activemq-commits mailing list archives

Site index · List index
Message view « Date » · « Thread »
Top « Date » · « Thread »
From Apache Jenkins Server <jenk...@builds.apache.org>
Subject Build failed in Jenkins: ActiveMQ-Apollo #960
Date Thu, 13 Jun 2013 12:09:34 GMT
See <https://builds.apache.org/job/ActiveMQ-Apollo/960/changes>

Changes:

[chirino] Fixes: APLO-328 cors_origin configuration attribute of the the web connectors not
properly setting the Access-Control-Allow-Headers

------------------------------------------
[...truncated 3238 lines...]
Downloaded: http://repo1.maven.org/maven2/org/slf4j/slf4j-nop/1.6.1/slf4j-nop-1.6.1.pom (2
KB at 14.4 KB/sec)
Downloading: http://repo.fusesource.com/nexus/content/groups/public/org/apache/maven/wagon/wagon-provider-api/2.2/wagon-provider-api-2.2.pom
Downloading: http://repo1.maven.org/maven2/org/apache/maven/wagon/wagon-provider-api/2.2/wagon-provider-api-2.2.pom
Downloaded: http://repo1.maven.org/maven2/org/apache/maven/wagon/wagon-provider-api/2.2/wagon-provider-api-2.2.pom
(2 KB at 280.9 KB/sec)
Downloading: http://repo.fusesource.com/nexus/content/groups/public/org/apache/maven/wagon/wagon/2.2/wagon-2.2.pom
Downloading: http://repo1.maven.org/maven2/org/apache/maven/wagon/wagon/2.2/wagon-2.2.pom
Downloaded: http://repo1.maven.org/maven2/org/apache/maven/wagon/wagon/2.2/wagon-2.2.pom (16
KB at 1959.6 KB/sec)
Downloading: http://repo.fusesource.com/nexus/content/groups/public/org/apache/maven/wagon/wagon-file/2.2/wagon-file-2.2.pom
Downloading: http://repo1.maven.org/maven2/org/apache/maven/wagon/wagon-file/2.2/wagon-file-2.2.pom
Downloaded: http://repo1.maven.org/maven2/org/apache/maven/wagon/wagon-file/2.2/wagon-file-2.2.pom
(2 KB at 22.4 KB/sec)
Downloading: http://repo.fusesource.com/nexus/content/groups/public/org/apache/maven/wagon/wagon-providers/2.2/wagon-providers-2.2.pom
Downloading: http://repo1.maven.org/maven2/org/apache/maven/wagon/wagon-providers/2.2/wagon-providers-2.2.pom
Downloaded: http://repo1.maven.org/maven2/org/apache/maven/wagon/wagon-providers/2.2/wagon-providers-2.2.pom
(3 KB at 73.0 KB/sec)
Downloading: http://repo.fusesource.com/nexus/content/groups/public/org/apache/maven/wagon/wagon-ssh/2.2/wagon-ssh-2.2.pom
Downloading: http://repo1.maven.org/maven2/org/apache/maven/wagon/wagon-ssh/2.2/wagon-ssh-2.2.pom
Downloaded: http://repo1.maven.org/maven2/org/apache/maven/wagon/wagon-ssh/2.2/wagon-ssh-2.2.pom
(6 KB at 174.0 KB/sec)
Downloading: http://repo.fusesource.com/nexus/content/groups/public/org/apache/maven/wagon/wagon-ssh-common/2.2/wagon-ssh-common-2.2.pom
Downloading: http://repo1.maven.org/maven2/org/apache/maven/wagon/wagon-ssh-common/2.2/wagon-ssh-common-2.2.pom
Downloaded: http://repo1.maven.org/maven2/org/apache/maven/wagon/wagon-ssh-common/2.2/wagon-ssh-common-2.2.pom
(2 KB at 42.7 KB/sec)
Downloading: http://repo.fusesource.com/nexus/content/groups/public/org/apache/maven/wagon/wagon-http-lightweight/2.2/wagon-http-lightweight-2.2.pom
Downloading: http://repo1.maven.org/maven2/org/apache/maven/wagon/wagon-http-lightweight/2.2/wagon-http-lightweight-2.2.pom
Downloaded: http://repo1.maven.org/maven2/org/apache/maven/wagon/wagon-http-lightweight/2.2/wagon-http-lightweight-2.2.pom
(3 KB at 41.2 KB/sec)
Downloading: http://repo.fusesource.com/nexus/content/groups/public/org/apache/maven/wagon/wagon-http-shared4/2.2/wagon-http-shared4-2.2.pom
Downloading: http://repo1.maven.org/maven2/org/apache/maven/wagon/wagon-http-shared4/2.2/wagon-http-shared4-2.2.pom
Downloaded: http://repo1.maven.org/maven2/org/apache/maven/wagon/wagon-http-shared4/2.2/wagon-http-shared4-2.2.pom
(3 KB at 16.3 KB/sec)
Downloading: http://repo.fusesource.com/nexus/content/groups/public/org/codehaus/swizzle/swizzle-confluence/1.4/swizzle-confluence-1.4.pom
Downloading: http://repo1.maven.org/maven2/org/codehaus/swizzle/swizzle-confluence/1.4/swizzle-confluence-1.4.pom
Downloaded: http://repo1.maven.org/maven2/org/codehaus/swizzle/swizzle-confluence/1.4/swizzle-confluence-1.4.pom
(2 KB at 23.1 KB/sec)
Downloading: http://repo.fusesource.com/nexus/content/groups/public/org/codehaus/swizzle/swizzle/1.4/swizzle-1.4.pom
Downloading: http://repo1.maven.org/maven2/org/codehaus/swizzle/swizzle/1.4/swizzle-1.4.pom
Downloaded: http://repo1.maven.org/maven2/org/codehaus/swizzle/swizzle/1.4/swizzle-1.4.pom
(4 KB at 25.3 KB/sec)
Downloading: http://repo.fusesource.com/nexus/content/groups/public/xmlrpc/xmlrpc-client/3.0/xmlrpc-client-3.0.pom
Downloading: http://repo1.maven.org/maven2/xmlrpc/xmlrpc-client/3.0/xmlrpc-client-3.0.pom
Downloaded: http://repo1.maven.org/maven2/xmlrpc/xmlrpc-client/3.0/xmlrpc-client-3.0.pom (808
B at 8.0 KB/sec)
Downloading: http://repo.fusesource.com/nexus/content/groups/public/org/apache/xmlrpc/xmlrpc/3.0/xmlrpc-3.0.pom
Downloading: http://repo1.maven.org/maven2/org/apache/xmlrpc/xmlrpc/3.0/xmlrpc-3.0.pom
Downloaded: http://repo1.maven.org/maven2/org/apache/xmlrpc/xmlrpc/3.0/xmlrpc-3.0.pom (12
KB at 64.4 KB/sec)
Downloading: http://repo.fusesource.com/nexus/content/groups/public/org/apache/xmlrpc/xmlrpc-common/3.0/xmlrpc-common-3.0.pom
Downloading: http://repo1.maven.org/maven2/org/apache/xmlrpc/xmlrpc-common/3.0/xmlrpc-common-3.0.pom
Downloaded: http://repo1.maven.org/maven2/org/apache/xmlrpc/xmlrpc-common/3.0/xmlrpc-common-3.0.pom
(854 B at 3.6 KB/sec)
Downloading: http://repo.fusesource.com/nexus/content/groups/public/org/apache/ws/commons/ws-commons-util/1.0.1/ws-commons-util-1.0.1.pom
Downloading: http://repo1.maven.org/maven2/org/apache/ws/commons/ws-commons-util/1.0.1/ws-commons-util-1.0.1.pom
Downloaded: http://repo1.maven.org/maven2/org/apache/ws/commons/ws-commons-util/1.0.1/ws-commons-util-1.0.1.pom
(6 KB at 17.0 KB/sec)
Downloading: http://repo.fusesource.com/nexus/content/groups/public/org/slf4j/slf4j-nop/1.6.1/slf4j-nop-1.6.1.jar
Downloading: http://repo.fusesource.com/nexus/content/groups/public/org/apache/maven/wagon/wagon-file/2.2/wagon-file-2.2.jar
Downloading: http://repo.fusesource.com/nexus/content/groups/public/org/apache/maven/wagon/wagon-ssh/2.2/wagon-ssh-2.2.jar
Downloading: http://repo.fusesource.com/nexus/content/groups/public/org/apache/maven/wagon/wagon-ssh-common/2.2/wagon-ssh-common-2.2.jar
Downloading: http://repo.fusesource.com/nexus/content/groups/public/org/apache/maven/wagon/wagon-http-lightweight/2.2/wagon-http-lightweight-2.2.jar
Downloading: http://repo.fusesource.com/nexus/content/groups/public/org/apache/maven/wagon/wagon-http-shared4/2.2/wagon-http-shared4-2.2.jar
Downloading: http://repo.fusesource.com/nexus/content/groups/public/org/codehaus/swizzle/swizzle-confluence/1.4/swizzle-confluence-1.4.jar
Downloading: http://repo.fusesource.com/nexus/content/groups/public/xmlrpc/xmlrpc-client/3.0/xmlrpc-client-3.0.jar
Downloading: http://repo.fusesource.com/nexus/content/groups/public/org/apache/xmlrpc/xmlrpc-common/3.0/xmlrpc-common-3.0.jar
Downloading: http://repo.fusesource.com/nexus/content/groups/public/org/apache/ws/commons/ws-commons-util/1.0.1/ws-commons-util-1.0.1.jar
Downloading: http://repo1.maven.org/maven2/org/slf4j/slf4j-nop/1.6.1/slf4j-nop-1.6.1.jar
Downloading: http://repo1.maven.org/maven2/org/apache/maven/wagon/wagon-file/2.2/wagon-file-2.2.jar
Downloading: http://repo1.maven.org/maven2/org/apache/maven/wagon/wagon-ssh-common/2.2/wagon-ssh-common-2.2.jar
Downloading: http://repo1.maven.org/maven2/org/apache/maven/wagon/wagon-ssh/2.2/wagon-ssh-2.2.jar
Downloading: http://repo1.maven.org/maven2/org/apache/maven/wagon/wagon-http-lightweight/2.2/wagon-http-lightweight-2.2.jar
Downloaded: http://repo1.maven.org/maven2/org/apache/maven/wagon/wagon-ssh-common/2.2/wagon-ssh-common-2.2.jar
(25 KB at 826.2 KB/sec)
Downloading: http://repo1.maven.org/maven2/org/apache/maven/wagon/wagon-http-shared4/2.2/wagon-http-shared4-2.2.jar
Downloaded: http://repo1.maven.org/maven2/org/apache/maven/wagon/wagon-ssh/2.2/wagon-ssh-2.2.jar
(29 KB at 585.8 KB/sec)
Downloading: http://repo1.maven.org/maven2/org/codehaus/swizzle/swizzle-confluence/1.4/swizzle-confluence-1.4.jar
Downloaded: http://repo1.maven.org/maven2/org/slf4j/slf4j-nop/1.6.1/slf4j-nop-1.6.1.jar (5
KB at 61.8 KB/sec)
Downloading: http://repo1.maven.org/maven2/xmlrpc/xmlrpc-client/3.0/xmlrpc-client-3.0.jar
Downloaded: http://repo1.maven.org/maven2/org/apache/maven/wagon/wagon-http-lightweight/2.2/wagon-http-lightweight-2.2.jar
(16 KB at 183.0 KB/sec)
Downloading: http://repo1.maven.org/maven2/org/apache/xmlrpc/xmlrpc-common/3.0/xmlrpc-common-3.0.jar
Downloaded: http://repo1.maven.org/maven2/org/codehaus/swizzle/swizzle-confluence/1.4/swizzle-confluence-1.4.jar
(29 KB at 549.7 KB/sec)
Downloading: http://repo1.maven.org/maven2/org/apache/ws/commons/ws-commons-util/1.0.1/ws-commons-util-1.0.1.jar
Downloaded: http://repo1.maven.org/maven2/org/apache/maven/wagon/wagon-file/2.2/wagon-file-2.2.jar
(11 KB at 97.2 KB/sec)
Downloaded: http://repo1.maven.org/maven2/org/apache/maven/wagon/wagon-http-shared4/2.2/wagon-http-shared4-2.2.jar
(30 KB at 274.6 KB/sec)
Downloaded: http://repo1.maven.org/maven2/xmlrpc/xmlrpc-client/3.0/xmlrpc-client-3.0.jar (43
KB at 237.6 KB/sec)
Downloaded: http://repo1.maven.org/maven2/org/apache/ws/commons/ws-commons-util/1.0.1/ws-commons-util-1.0.1.jar
(35 KB at 84.0 KB/sec)
Downloaded: http://repo1.maven.org/maven2/org/apache/xmlrpc/xmlrpc-common/3.0/xmlrpc-common-3.0.jar
(96 KB at 148.2 KB/sec)
[INFO] Generating static website from Scalate Templates and wiki files...
[INFO] template properties: null
[INFO]     processing <https://builds.apache.org/job/ActiveMQ-Apollo/ws/trunk/apollo-website/src/index.page>
with uri: /index.page => 
Traceback (most recent call last):
  File "/usr/local/bin/pygmentize", line 5, in <module>
    from pkg_resources import load_entry_point
  File "/usr/lib/python2.7/dist-packages/pkg_resources.py", line 2707, in <module>
    working_set.require(__requires__)
  File "/usr/lib/python2.7/dist-packages/pkg_resources.py", line 686, in require
    needed = self.resolve(parse_requirements(requirements))
  File "/usr/lib/python2.7/dist-packages/pkg_resources.py", line 584, in resolve
    raise DistributionNotFound(req)
pkg_resources.DistributionNotFound: Pygments==1.3.1
[INFO]     processing <https://builds.apache.org/job/ActiveMQ-Apollo/ws/trunk/apollo-website/src/documentation/getting-started.md>
with uri: /documentation/getting-started.md => 
[INFO]     processing <https://builds.apache.org/job/ActiveMQ-Apollo/ws/trunk/apollo-website/src/documentation/index.page>
with uri: /documentation/index.page => 
[INFO]     processing <https://builds.apache.org/job/ActiveMQ-Apollo/ws/trunk/apollo-website/src/documentation/amqp-manual.md>
with uri: /documentation/amqp-manual.md => 
[INFO]     processing <https://builds.apache.org/job/ActiveMQ-Apollo/ws/trunk/apollo-website/src/documentation/performance-scaling.md>
with uri: /documentation/performance-scaling.md => 
[INFO]     processing <https://builds.apache.org/job/ActiveMQ-Apollo/ws/trunk/apollo-website/src/documentation/verification.md>
with uri: /documentation/verification.md => 
[INFO]     processing <https://builds.apache.org/job/ActiveMQ-Apollo/ws/trunk/apollo-website/src/documentation/mqtt-manual.md>
with uri: /documentation/mqtt-manual.md => 
[INFO]     processing <https://builds.apache.org/job/ActiveMQ-Apollo/ws/trunk/apollo-website/src/documentation/migration-guide.md>
with uri: /documentation/migration-guide.md => 
[INFO]     processing <https://builds.apache.org/job/ActiveMQ-Apollo/ws/trunk/apollo-website/src/documentation/user-manual.md>
with uri: /documentation/user-manual.md => 
[INFO]     processing <https://builds.apache.org/job/ActiveMQ-Apollo/ws/trunk/apollo-website/src/documentation/openwire-manual.md>
with uri: /documentation/openwire-manual.md => 
[INFO]     processing <https://builds.apache.org/job/ActiveMQ-Apollo/ws/trunk/apollo-website/src/documentation/management-api.md>
with uri: /documentation/management-api.md => 
[INFO]     processing <https://builds.apache.org/job/ActiveMQ-Apollo/ws/trunk/apollo-website/src/documentation/stomp-manual.md>
with uri: /documentation/stomp-manual.md => 
[INFO]     processing <https://builds.apache.org/job/ActiveMQ-Apollo/ws/trunk/apollo-website/src/documentation/architecture.md>
with uri: /documentation/architecture.md => 
[INFO]     processing <https://builds.apache.org/job/ActiveMQ-Apollo/ws/trunk/apollo-website/src/documentation/module-organization.page>
with uri: /documentation/module-organization.page => 
[INFO]     processing <https://builds.apache.org/job/ActiveMQ-Apollo/ws/trunk/apollo-website/src/documentation/extending-guide.md>
with uri: /documentation/extending-guide.md => 
[INFO]     processing <https://builds.apache.org/job/ActiveMQ-Apollo/ws/trunk/apollo-website/src/privacy-policy.page>
with uri: /privacy-policy.page => 
[INFO]     processing <https://builds.apache.org/job/ActiveMQ-Apollo/ws/trunk/apollo-website/src/download.page>
with uri: /download.page => 
[12:08:51] Using dir: <https://builds.apache.org/job/ActiveMQ-Apollo/ws/trunk/apollo-website/src/blog>
at request path: /blog
[INFO]     processing <https://builds.apache.org/job/ActiveMQ-Apollo/ws/trunk/apollo-website/src/blog/index.page>
with uri: /blog/index.page => 
[12:08:53] Using dir: <https://builds.apache.org/job/ActiveMQ-Apollo/ws/trunk/apollo-website/src/blog>
at request path: /blog
[INFO]     processing <https://builds.apache.org/job/ActiveMQ-Apollo/ws/trunk/apollo-website/src/blog/index.rss.feed>
with uri: /blog/index.rss.feed => 
[INFO]     processing <https://builds.apache.org/job/ActiveMQ-Apollo/ws/trunk/apollo-website/src/blog/releases/release-1.5.page>
with uri: /blog/releases/release-1.5.page => 
[INFO]     processing <https://builds.apache.org/job/ActiveMQ-Apollo/ws/trunk/apollo-website/src/blog/releases/release-1.4.page>
with uri: /blog/releases/release-1.4.page => 
[INFO]     processing <https://builds.apache.org/job/ActiveMQ-Apollo/ws/trunk/apollo-website/src/blog/releases/release-1.2.page>
with uri: /blog/releases/release-1.2.page => 
[INFO]     processing <https://builds.apache.org/job/ActiveMQ-Apollo/ws/trunk/apollo-website/src/blog/releases/release-1-0-beta4.page>
with uri: /blog/releases/release-1-0-beta4.page => 
[INFO]     processing <https://builds.apache.org/job/ActiveMQ-Apollo/ws/trunk/apollo-website/src/blog/releases/release-1-0-beta3.page>
with uri: /blog/releases/release-1-0-beta3.page => 
[INFO]     processing <https://builds.apache.org/job/ActiveMQ-Apollo/ws/trunk/apollo-website/src/blog/releases/release-1.3.page>
with uri: /blog/releases/release-1.3.page => 
[INFO]     processing <https://builds.apache.org/job/ActiveMQ-Apollo/ws/trunk/apollo-website/src/blog/releases/release-1.1.page>
with uri: /blog/releases/release-1.1.page => 
[INFO]     processing <https://builds.apache.org/job/ActiveMQ-Apollo/ws/trunk/apollo-website/src/blog/releases/release-1-0-beta1.page>
with uri: /blog/releases/release-1-0-beta1.page => 
[INFO]     processing <https://builds.apache.org/job/ActiveMQ-Apollo/ws/trunk/apollo-website/src/blog/releases/release-1-0-beta2.page>
with uri: /blog/releases/release-1-0-beta2.page => 
[INFO]     processing <https://builds.apache.org/job/ActiveMQ-Apollo/ws/trunk/apollo-website/src/blog/releases/release-1-0-beta6.page>
with uri: /blog/releases/release-1-0-beta6.page => 
[INFO]     processing <https://builds.apache.org/job/ActiveMQ-Apollo/ws/trunk/apollo-website/src/blog/releases/release-1.0.page>
with uri: /blog/releases/release-1.0.page => 
[INFO]     processing <https://builds.apache.org/job/ActiveMQ-Apollo/ws/trunk/apollo-website/src/blog/releases/release-1-0-beta5.page>
with uri: /blog/releases/release-1-0-beta5.page => 
[INFO]     processing <https://builds.apache.org/job/ActiveMQ-Apollo/ws/trunk/apollo-website/src/blog/releases/release-1.6.page>
with uri: /blog/releases/release-1.6.page => 
[INFO]     processing <https://builds.apache.org/job/ActiveMQ-Apollo/ws/trunk/apollo-website/src/versions/index.page>
with uri: /versions/index.page => 
[INFO]     processing <https://builds.apache.org/job/ActiveMQ-Apollo/ws/trunk/apollo-website/src/community/faq.page>
with uri: /community/faq.page => 
[INFO]     processing <https://builds.apache.org/job/ActiveMQ-Apollo/ws/trunk/apollo-website/src/community/site.page>
with uri: /community/site.page => 
[INFO]     processing <https://builds.apache.org/job/ActiveMQ-Apollo/ws/trunk/apollo-website/src/community/index.page>
with uri: /community/index.page => 
[INFO]     processing <https://builds.apache.org/job/ActiveMQ-Apollo/ws/trunk/apollo-website/src/community/contributing.page>
with uri: /community/contributing.page => 
[INFO]     processing <https://builds.apache.org/job/ActiveMQ-Apollo/ws/trunk/apollo-website/src/community/source.page>
with uri: /community/source.page => 
[INFO]     processing <https://builds.apache.org/job/ActiveMQ-Apollo/ws/trunk/apollo-website/src/community/support.page>
with uri: /community/support.page => 
[INFO]     processing <https://builds.apache.org/job/ActiveMQ-Apollo/ws/trunk/apollo-website/src/community/developers.page>
with uri: /community/developers.page => 
[INFO]     processing <https://builds.apache.org/job/ActiveMQ-Apollo/ws/trunk/apollo-website/src/community/building.page>
with uri: /community/building.page => 
[INFO]     processing <https://builds.apache.org/job/ActiveMQ-Apollo/ws/trunk/apollo-website/src/community/release-guide.page>
with uri: /community/release-guide.page => 
[INFO] Installing <https://builds.apache.org/job/ActiveMQ-Apollo/ws/trunk/apollo-website/pom.xml>
to /home/jenkins/jenkins-slave/maven-repositories/0/org/apache/activemq/apollo-website/99-trunk-SNAPSHOT/apollo-website-99-trunk-SNAPSHOT.pom
[INFO] 
[INFO] --- maven-install-plugin:2.3.1:install (default-install) @ apollo-website ---
[12:09:00] [INFO]                                                                        

[INFO] ------------------------------------------------------------------------
[INFO] Skipping apache-apollo
[INFO] This project has been banned from the build due to previous failures.
[INFO] ------------------------------------------------------------------------
[INFO]                                                                         
[INFO] ------------------------------------------------------------------------
[INFO] Skipping apollo-itests
[INFO] This project has been banned from the build due to previous failures.
[INFO] ------------------------------------------------------------------------
[INFO] ------------------------------------------------------------------------
[INFO] Reactor Summary:
[INFO] 
[INFO] Apache ActiveMQ Apollo Project .................... SUCCESS [25.022s]
[INFO] apollo-boot ....................................... SUCCESS [13.922s]
[INFO] apollo-scala ...................................... SUCCESS [6.547s]
[INFO] apollo-util ....................................... SUCCESS [43.987s]
[INFO] apollo-dto ........................................ SUCCESS [10.688s]
[INFO] apollo-selector ................................... SUCCESS [5.090s]
[INFO] apollo-broker ..................................... SUCCESS [1:00.665s]
[INFO] apollo-web ........................................ FAILURE [29.731s]
[INFO] apollo-leveldb .................................... SKIPPED
[INFO] apollo-bdb ........................................ SKIPPED
[INFO] apollo-stomp ...................................... SKIPPED
[INFO] apollo-amqp ....................................... SKIPPED
[INFO] apollo-mqtt ....................................... SKIPPED
[INFO] apollo-openwire-generator ......................... SUCCESS [12.065s]
[INFO] apollo-openwire ................................... SKIPPED
[INFO] apollo-jmx ........................................ SKIPPED
[INFO] apollo-cli ........................................ SKIPPED
[INFO] apollo-website .................................... SUCCESS [55.884s]
[INFO] apache-apollo ..................................... SKIPPED
[INFO] apollo-itests ..................................... SKIPPED
[INFO] ------------------------------------------------------------------------
[INFO] BUILD FAILURE
[INFO] ------------------------------------------------------------------------
[INFO] Total time: 4:28.816s
[INFO] Finished at: Thu Jun 13 12:09:00 UTC 2013
[INFO] Final Memory: 80M/1309M
[INFO] ------------------------------------------------------------------------
[JENKINS] Archiving disabled
[JENKINS] Archiving disabled
[JENKINS] Archiving disabled
[JENKINS] Archiving disabled
[JENKINS] Archiving disabled
[JENKINS] Archiving disabled
[JENKINS] Archiving disabled
[JENKINS] Archiving disabled
[JENKINS] Archiving disabled
[JENKINS] Archiving disabled
[JENKINS] Archiving disabled
[JENKINS] Archiving disabled
[JENKINS] Archiving disabled
[JENKINS] Archiving disabled
[JENKINS] Archiving disabled
[JENKINS] Archiving disabled
[JENKINS] Archiving disabled
[JENKINS] Archiving disabled
[JENKINS] Archiving disabled
[JENKINS] Archiving disabled
Waiting for Jenkins to finish collecting data
mavenExecutionResult exceptions not empty
message : Failed to execute goal on project apollo-web: Could not resolve dependencies for
project org.apache.activemq:apollo-web:jar:99-trunk-SNAPSHOT: The following artifacts could
not be resolved: net.sf.josql:josql:jar:1.5, net.sf.josql:gentlyweb-utils:jar:1.5: Could not
find artifact net.sf.josql:josql:jar:1.5 in oracleReleases (http://download.oracle.com/maven)
cause : Could not resolve dependencies for project org.apache.activemq:apollo-web:jar:99-trunk-SNAPSHOT:
The following artifacts could not be resolved: net.sf.josql:josql:jar:1.5, net.sf.josql:gentlyweb-utils:jar:1.5:
Could not find artifact net.sf.josql:josql:jar:1.5 in oracleReleases (http://download.oracle.com/maven)
Stack trace : 
org.apache.maven.lifecycle.LifecycleExecutionException: Failed to execute goal on project
apollo-web: Could not resolve dependencies for project org.apache.activemq:apollo-web:jar:99-trunk-SNAPSHOT:
The following artifacts could not be resolved: net.sf.josql:josql:jar:1.5, net.sf.josql:gentlyweb-utils:jar:1.5:
Could not find artifact net.sf.josql:josql:jar:1.5 in oracleReleases (http://download.oracle.com/maven)
	at org.apache.maven.lifecycle.internal.LifecycleDependencyResolver.getDependencies(LifecycleDependencyResolver.java:190)
	at org.apache.maven.lifecycle.internal.LifecycleDependencyResolver.resolveProjectDependencies(LifecycleDependencyResolver.java:104)
	at org.apache.maven.lifecycle.internal.MojoExecutor.ensureDependenciesAreResolved(MojoExecutor.java:258)
	at org.apache.maven.lifecycle.internal.MojoExecutor.execute(MojoExecutor.java:201)
	at org.apache.maven.lifecycle.internal.MojoExecutor.execute(MojoExecutor.java:153)
	at org.apache.maven.lifecycle.internal.MojoExecutor.execute(MojoExecutor.java:145)
	at org.apache.maven.lifecycle.internal.LifecycleModuleBuilder.buildProject(LifecycleModuleBuilder.java:84)
	at org.apache.maven.lifecycle.internal.LifecycleModuleBuilder.buildProject(LifecycleModuleBuilder.java:59)
	at org.apache.maven.lifecycle.internal.LifecycleStarter.singleThreadedBuild(LifecycleStarter.java:183)
	at org.apache.maven.lifecycle.internal.LifecycleStarter.execute(LifecycleStarter.java:161)
	at org.apache.maven.DefaultMaven.doExecute(DefaultMaven.java:319)
	at org.apache.maven.DefaultMaven.execute(DefaultMaven.java:156)
	at org.jvnet.hudson.maven3.launcher.Maven3Launcher.main(Maven3Launcher.java:79)
	at sun.reflect.NativeMethodAccessorImpl.invoke0(Native Method)
	at sun.reflect.NativeMethodAccessorImpl.invoke(NativeMethodAccessorImpl.java:39)
	at sun.reflect.DelegatingMethodAccessorImpl.invoke(DelegatingMethodAccessorImpl.java:25)
	at java.lang.reflect.Method.invoke(Method.java:597)
	at org.codehaus.plexus.classworlds.launcher.Launcher.launchStandard(Launcher.java:329)
	at org.codehaus.plexus.classworlds.launcher.Launcher.launch(Launcher.java:239)
	at org.jvnet.hudson.maven3.agent.Maven3Main.launch(Maven3Main.java:158)
	at hudson.maven.Maven3Builder.call(Maven3Builder.java:100)
	at hudson.maven.Maven3Builder.call(Maven3Builder.java:66)
	at hudson.remoting.UserRequest.perform(UserRequest.java:118)
	at hudson.remoting.UserRequest.perform(UserRequest.java:48)
	at hudson.remoting.Request$2.run(Request.java:326)
	at hudson.remoting.InterceptingExecutorService$1.call(InterceptingExecutorService.java:72)
	at java.util.concurrent.FutureTask$Sync.innerRun(FutureTask.java:303)
	at java.util.concurrent.FutureTask.run(FutureTask.java:138)
	at java.util.concurrent.ThreadPoolExecutor$Worker.runTask(ThreadPoolExecutor.java:895)
	at java.util.concurrent.ThreadPoolExecutor$Worker.run(ThreadPoolExecutor.java:918)
	at java.lang.Thread.run(Thread.java:662)
Caused by: org.apache.maven.project.DependencyResolutionException: Could not resolve dependencies
for project org.apache.activemq:apollo-web:jar:99-trunk-SNAPSHOT: The following artifacts
could not be resolved: net.sf.josql:josql:jar:1.5, net.sf.josql:gentlyweb-utils:jar:1.5: Could
not find artifact net.sf.josql:josql:jar:1.5 in oracleReleases (http://download.oracle.com/maven)
	at org.apache.maven.project.DefaultProjectDependenciesResolver.resolve(DefaultProjectDependenciesResolver.java:156)
	at org.apache.maven.lifecycle.internal.LifecycleDependencyResolver.getDependencies(LifecycleDependencyResolver.java:165)
	... 30 more
Caused by: org.sonatype.aether.resolution.ArtifactResolutionException: The following artifacts
could not be resolved: net.sf.josql:josql:jar:1.5, net.sf.josql:gentlyweb-utils:jar:1.5: Could
not find artifact net.sf.josql:josql:jar:1.5 in oracleReleases (http://download.oracle.com/maven)
	at org.sonatype.aether.impl.internal.DefaultArtifactResolver.resolveArtifacts(DefaultArtifactResolver.java:526)
	at org.sonatype.aether.impl.internal.DefaultRepositorySystem.resolveArtifacts(DefaultRepositorySystem.java:304)
	at org.sonatype.aether.impl.internal.DefaultRepositorySystem.resolveDependencies(DefaultRepositorySystem.java:334)
	at org.apache.maven.project.DefaultProjectDependenciesResolver.resolve(DefaultProjectDependenciesResolver.java:150)
	... 31 more
Caused by: org.sonatype.aether.transfer.ArtifactNotFoundException: Could not find artifact
net.sf.josql:josql:jar:1.5 in oracleReleases (http://download.oracle.com/maven)
	at org.sonatype.aether.connector.wagon.WagonRepositoryConnector$4.wrap(WagonRepositoryConnector.java:945)
	at org.sonatype.aether.connector.wagon.WagonRepositoryConnector$4.wrap(WagonRepositoryConnector.java:940)
	at org.sonatype.aether.connector.wagon.WagonRepositoryConnector$GetTask.flush(WagonRepositoryConnector.java:696)
	at org.sonatype.aether.connector.wagon.WagonRepositoryConnector$GetTask.flush(WagonRepositoryConnector.java:690)
	at org.sonatype.aether.connector.wagon.WagonRepositoryConnector.get(WagonRepositoryConnector.java:435)
	at org.sonatype.aether.impl.internal.DefaultArtifactResolver.resolveArtifacts(DefaultArtifactResolver.java:438)
	... 34 more
Sending e-mails to: commits@activemq.apache.org
channel stopped

Mime
View raw message