activemq-commits mailing list archives

Site index · List index
Message view « Date » · « Thread »
Top « Date » · « Thread »
From Apache Jenkins Server <jenk...@builds.apache.org>
Subject Build failed in Jenkins: ActiveMQ-Apollo-Deploy #404
Date Mon, 03 Jun 2013 15:28:10 GMT
See <https://builds.apache.org/job/ActiveMQ-Apollo-Deploy/404/>

------------------------------------------
[...truncated 8343 lines...]
Downloaded: http://repo1.maven.org/maven2/org/eclipse/jetty/jetty-servlet/7.2.1.v20101111/jetty-servlet-7.2.1.v20101111.jar
(77 KB at 1072.7 KB/sec)
Downloaded: http://repo1.maven.org/maven2/org/eclipse/jetty/jetty-security/7.2.1.v20101111/jetty-security-7.2.1.v20101111.jar
(75 KB at 871.0 KB/sec)
Downloaded: http://repo1.maven.org/maven2/org/fusesource/scalamd/scalamd_2.10/1.6/scalamd_2.10-1.6.jar
(85 KB at 178.7 KB/sec)
Downloaded: http://repo1.maven.org/maven2/org/eclipse/jetty/jetty-util/7.2.1.v20101111/jetty-util-7.2.1.v20101111.jar
(192 KB at 864.6 KB/sec)
[INFO] 
[INFO] --- maven-clean-plugin:2.4.1:clean (default-clean) @ apollo-website ---
[INFO] 
[INFO] --- maven-enforcer-plugin:1.0:enforce (default) @ apollo-website ---
Jun 3, 2013 3:27:30 PM hudson.maven.ExecutedMojo <init>
WARNING: Failed to getClass for org.apache.maven.plugin.source.SourceJarMojo
[INFO] 
[INFO] --- maven-source-plugin:2.1.2:jar (default-cli) @ apollo-website ---
[INFO] 
[INFO] --- maven-enforcer-plugin:1.0:enforce (default) @ apollo-website ---
[INFO] [WARNING] Parameter tasks is deprecated, use target instead

[INFO] --- maven-antrun-plugin:1.7:run (default) @ apollo-website ---
[INFO] Executing tasks

main:
    [mkdir] Created dir: <https://builds.apache.org/job/ActiveMQ-Apollo-Deploy/ws/trunk/apollo-website/target/sitegen/documentation/schema>
     [copy] Copying 1 file to <https://builds.apache.org/job/ActiveMQ-Apollo-Deploy/ws/trunk/apollo-website/target/sitegen/documentation/schema>
[INFO] Executed tasks
[INFO] 
[INFO] --- maven-remote-resources-plugin:1.1:process (default) @ apollo-website ---
[INFO] [INFO] <https://builds.apache.org/job/ActiveMQ-Apollo-Deploy/ws/trunk/apollo-website/ext>:-1:
info: compiling
[INFO] Compiling 3 source files to <https://builds.apache.org/job/ActiveMQ-Apollo-Deploy/ws/trunk/apollo-website/target/classes>
at 1370273251636

[INFO] --- scala-maven-plugin:3.1.0:compile (default) @ apollo-website ---
[INFO] prepare-compile in 0 s
[INFO] compile in 4 s
[INFO] [WARNING] No source files found.

[INFO] --- scala-maven-plugin:3.1.0:testCompile (default) @ apollo-website ---
[INFO] 
[INFO] --- maven-site-plugin:3.0:attach-descriptor (attach-descriptor) @ apollo-website ---
[INFO] 
[INFO] --- maven-enforcer-plugin:1.0:enforce (default) @ apollo-website ---
Jun 3, 2013 3:27:37 PM hudson.maven.ExecutedMojo <init>
WARNING: Failed to getClass for org.apache.maven.plugin.source.SourceJarMojo
[INFO] 
[INFO] --- maven-source-plugin:2.1.2:jar (attach-sources) @ apollo-website ---
[INFO] [INFO] Generating static website from Scalate Templates and wiki files...
[INFO] template properties: null

[INFO] --- maven-scalate-plugin_2.10:1.6.1:sitegen (sitegen) @ apollo-website ---
[INFO]     processing <https://builds.apache.org/job/ActiveMQ-Apollo-Deploy/ws/trunk/apollo-website/src/download.page>
with uri: /download.page => 
[INFO]     processing <https://builds.apache.org/job/ActiveMQ-Apollo-Deploy/ws/trunk/apollo-website/src/blog/releases/release-1.4.page>
with uri: /blog/releases/release-1.4.page => 
[INFO]     processing <https://builds.apache.org/job/ActiveMQ-Apollo-Deploy/ws/trunk/apollo-website/src/blog/releases/release-1.6.page>
with uri: /blog/releases/release-1.6.page => 
[INFO]     processing <https://builds.apache.org/job/ActiveMQ-Apollo-Deploy/ws/trunk/apollo-website/src/blog/releases/release-1.5.page>
with uri: /blog/releases/release-1.5.page => 
[INFO]     processing <https://builds.apache.org/job/ActiveMQ-Apollo-Deploy/ws/trunk/apollo-website/src/blog/releases/release-1.1.page>
with uri: /blog/releases/release-1.1.page => 
[INFO]     processing <https://builds.apache.org/job/ActiveMQ-Apollo-Deploy/ws/trunk/apollo-website/src/blog/releases/release-1-0-beta1.page>
with uri: /blog/releases/release-1-0-beta1.page => 
[INFO]     processing <https://builds.apache.org/job/ActiveMQ-Apollo-Deploy/ws/trunk/apollo-website/src/blog/releases/release-1-0-beta2.page>
with uri: /blog/releases/release-1-0-beta2.page => 
[INFO]     processing <https://builds.apache.org/job/ActiveMQ-Apollo-Deploy/ws/trunk/apollo-website/src/blog/releases/release-1.0.page>
with uri: /blog/releases/release-1.0.page => 
[INFO]     processing <https://builds.apache.org/job/ActiveMQ-Apollo-Deploy/ws/trunk/apollo-website/src/blog/releases/release-1-0-beta6.page>
with uri: /blog/releases/release-1-0-beta6.page => 
[INFO]     processing <https://builds.apache.org/job/ActiveMQ-Apollo-Deploy/ws/trunk/apollo-website/src/blog/releases/release-1-0-beta3.page>
with uri: /blog/releases/release-1-0-beta3.page => 
[INFO]     processing <https://builds.apache.org/job/ActiveMQ-Apollo-Deploy/ws/trunk/apollo-website/src/blog/releases/release-1.3.page>
with uri: /blog/releases/release-1.3.page => 
[INFO]     processing <https://builds.apache.org/job/ActiveMQ-Apollo-Deploy/ws/trunk/apollo-website/src/blog/releases/release-1-0-beta5.page>
with uri: /blog/releases/release-1-0-beta5.page => 
[INFO]     processing <https://builds.apache.org/job/ActiveMQ-Apollo-Deploy/ws/trunk/apollo-website/src/blog/releases/release-1.2.page>
with uri: /blog/releases/release-1.2.page => 
[INFO]     processing <https://builds.apache.org/job/ActiveMQ-Apollo-Deploy/ws/trunk/apollo-website/src/blog/releases/release-1-0-beta4.page>
with uri: /blog/releases/release-1-0-beta4.page => 
Using dir: <https://builds.apache.org/job/ActiveMQ-Apollo-Deploy/ws/trunk/apollo-website/src/blog>
at request path: /blog
[INFO]     processing <https://builds.apache.org/job/ActiveMQ-Apollo-Deploy/ws/trunk/apollo-website/src/blog/index.rss.feed>
with uri: /blog/index.rss.feed => 
Using dir: <https://builds.apache.org/job/ActiveMQ-Apollo-Deploy/ws/trunk/apollo-website/src/blog>
at request path: /blog
[INFO]     processing <https://builds.apache.org/job/ActiveMQ-Apollo-Deploy/ws/trunk/apollo-website/src/blog/index.page>
with uri: /blog/index.page => 
[INFO]     processing <https://builds.apache.org/job/ActiveMQ-Apollo-Deploy/ws/trunk/apollo-website/src/documentation/verification.md>
with uri: /documentation/verification.md => 
[INFO]     processing <https://builds.apache.org/job/ActiveMQ-Apollo-Deploy/ws/trunk/apollo-website/src/documentation/getting-started.md>
with uri: /documentation/getting-started.md => 
[INFO]     processing <https://builds.apache.org/job/ActiveMQ-Apollo-Deploy/ws/trunk/apollo-website/src/documentation/stomp-manual.md>
with uri: /documentation/stomp-manual.md => 
[INFO]     processing <https://builds.apache.org/job/ActiveMQ-Apollo-Deploy/ws/trunk/apollo-website/src/documentation/extending-guide.md>
with uri: /documentation/extending-guide.md => 
[INFO]     processing <https://builds.apache.org/job/ActiveMQ-Apollo-Deploy/ws/trunk/apollo-website/src/documentation/architecture.md>
with uri: /documentation/architecture.md => 
[INFO]     processing <https://builds.apache.org/job/ActiveMQ-Apollo-Deploy/ws/trunk/apollo-website/src/documentation/module-organization.page>
with uri: /documentation/module-organization.page => 
[INFO]     processing <https://builds.apache.org/job/ActiveMQ-Apollo-Deploy/ws/trunk/apollo-website/src/documentation/performance-scaling.md>
with uri: /documentation/performance-scaling.md => 
[INFO]     processing <https://builds.apache.org/job/ActiveMQ-Apollo-Deploy/ws/trunk/apollo-website/src/documentation/user-manual.md>
with uri: /documentation/user-manual.md => 
[INFO]     processing <https://builds.apache.org/job/ActiveMQ-Apollo-Deploy/ws/trunk/apollo-website/src/documentation/openwire-manual.md>
with uri: /documentation/openwire-manual.md => 
[INFO]     processing <https://builds.apache.org/job/ActiveMQ-Apollo-Deploy/ws/trunk/apollo-website/src/documentation/mqtt-manual.md>
with uri: /documentation/mqtt-manual.md => 
[INFO]     processing <https://builds.apache.org/job/ActiveMQ-Apollo-Deploy/ws/trunk/apollo-website/src/documentation/management-api.md>
with uri: /documentation/management-api.md => 
[INFO]     processing <https://builds.apache.org/job/ActiveMQ-Apollo-Deploy/ws/trunk/apollo-website/src/documentation/index.page>
with uri: /documentation/index.page => 
[INFO]     processing <https://builds.apache.org/job/ActiveMQ-Apollo-Deploy/ws/trunk/apollo-website/src/documentation/amqp-manual.md>
with uri: /documentation/amqp-manual.md => 
[INFO]     processing <https://builds.apache.org/job/ActiveMQ-Apollo-Deploy/ws/trunk/apollo-website/src/documentation/migration-guide.md>
with uri: /documentation/migration-guide.md => 
[INFO]     processing <https://builds.apache.org/job/ActiveMQ-Apollo-Deploy/ws/trunk/apollo-website/src/privacy-policy.page>
with uri: /privacy-policy.page => 
[INFO]     processing <https://builds.apache.org/job/ActiveMQ-Apollo-Deploy/ws/trunk/apollo-website/src/index.page>
with uri: /index.page => 
[INFO]     processing <https://builds.apache.org/job/ActiveMQ-Apollo-Deploy/ws/trunk/apollo-website/src/community/source.page>
with uri: /community/source.page => 
[INFO]     processing <https://builds.apache.org/job/ActiveMQ-Apollo-Deploy/ws/trunk/apollo-website/src/community/release-guide.page>
with uri: /community/release-guide.page => 
[INFO]     processing <https://builds.apache.org/job/ActiveMQ-Apollo-Deploy/ws/trunk/apollo-website/src/community/faq.page>
with uri: /community/faq.page => 
[INFO]     processing <https://builds.apache.org/job/ActiveMQ-Apollo-Deploy/ws/trunk/apollo-website/src/community/index.page>
with uri: /community/index.page => 
[INFO]     processing <https://builds.apache.org/job/ActiveMQ-Apollo-Deploy/ws/trunk/apollo-website/src/community/contributing.page>
with uri: /community/contributing.page => 
[INFO]     processing <https://builds.apache.org/job/ActiveMQ-Apollo-Deploy/ws/trunk/apollo-website/src/community/developers.page>
with uri: /community/developers.page => 
[INFO]     processing <https://builds.apache.org/job/ActiveMQ-Apollo-Deploy/ws/trunk/apollo-website/src/community/building.page>
with uri: /community/building.page => 
[INFO]     processing <https://builds.apache.org/job/ActiveMQ-Apollo-Deploy/ws/trunk/apollo-website/src/community/support.page>
with uri: /community/support.page => 
[INFO]     processing <https://builds.apache.org/job/ActiveMQ-Apollo-Deploy/ws/trunk/apollo-website/src/community/site.page>
with uri: /community/site.page => 
[INFO]     processing <https://builds.apache.org/job/ActiveMQ-Apollo-Deploy/ws/trunk/apollo-website/src/versions/index.page>
with uri: /versions/index.page => 
[INFO] [INFO] Installing <https://builds.apache.org/job/ActiveMQ-Apollo-Deploy/ws/trunk/apollo-website/pom.xml>
to <https://builds.apache.org/job/ActiveMQ-Apollo-Deploy/ws/.repository/org/apache/activemq/apollo-website/99-trunk-SNAPSHOT/apollo-website-99-trunk-SNAPSHOT.pom>

[INFO] --- maven-install-plugin:2.3.1:install (default-install) @ apollo-website ---
[INFO] Downloading: https://repository.apache.org/content/repositories/snapshots/org/apache/activemq/apollo-website/99-trunk-SNAPSHOT/maven-metadata.xml

[INFO] --- maven-deploy-plugin:2.5:deploy (default-deploy) @ apollo-website ---
Downloaded: https://repository.apache.org/content/repositories/snapshots/org/apache/activemq/apollo-website/99-trunk-SNAPSHOT/maven-metadata.xml
(620 B at 2.0 KB/sec)
Uploading: https://repository.apache.org/content/repositories/snapshots/org/apache/activemq/apollo-website/99-trunk-SNAPSHOT/apollo-website-99-trunk-20130603.152752-264.pom
Uploaded: https://repository.apache.org/content/repositories/snapshots/org/apache/activemq/apollo-website/99-trunk-SNAPSHOT/apollo-website-99-trunk-20130603.152752-264.pom
(12 KB at 46.8 KB/sec)
Downloading: https://repository.apache.org/content/repositories/snapshots/org/apache/activemq/apollo-website/maven-metadata.xml
Downloaded: https://repository.apache.org/content/repositories/snapshots/org/apache/activemq/apollo-website/maven-metadata.xml
(359 B at 1.5 KB/sec)
Uploading: https://repository.apache.org/content/repositories/snapshots/org/apache/activemq/apollo-website/99-trunk-SNAPSHOT/maven-metadata.xml
Uploaded: https://repository.apache.org/content/repositories/snapshots/org/apache/activemq/apollo-website/99-trunk-SNAPSHOT/maven-metadata.xml
(620 B at 2.5 KB/sec)
Uploading: https://repository.apache.org/content/repositories/snapshots/org/apache/activemq/apollo-website/maven-metadata.xml
Uploaded: https://repository.apache.org/content/repositories/snapshots/org/apache/activemq/apollo-website/maven-metadata.xml
(359 B at 2.2 KB/sec)
[INFO]                                                                         
[INFO] ------------------------------------------------------------------------
[INFO] Skipping apache-apollo
[INFO] This project has been banned from the build due to previous failures.
[INFO] ------------------------------------------------------------------------
[INFO] ------------------------------------------------------------------------
[INFO] Reactor Summary:
[INFO] 
[INFO] Apache ActiveMQ Apollo Project .................... SUCCESS [30.311s]
[INFO] apollo-boot ....................................... SUCCESS [13.308s]
[INFO] apollo-scala ...................................... SUCCESS [16.781s]
[INFO] apollo-util ....................................... SUCCESS [1:20.794s]
[INFO] apollo-dto ........................................ SUCCESS [1:59.507s]
[INFO] apollo-selector ................................... SUCCESS [21.413s]
[INFO] apollo-broker ..................................... SUCCESS [1:29.949s]
[INFO] apollo-web ........................................ SUCCESS [2:32.742s]
[INFO] apollo-leveldb .................................... SUCCESS [1:06.650s]
[INFO] apollo-bdb ........................................ SUCCESS [20.538s]
[INFO] apollo-stomp ...................................... SUCCESS [1:38.703s]
[INFO] apollo-amqp ....................................... FAILURE [3:17.880s]
[INFO] apollo-mqtt ....................................... SUCCESS [26.998s]
[INFO] apollo-openwire-generator ......................... SUCCESS [18.388s]
[INFO] apollo-openwire ................................... SUCCESS [1:07.115s]
[INFO] apollo-jmx ........................................ SUCCESS [20.372s]
[INFO] apollo-network .................................... SUCCESS [41.625s]
[INFO] apollo-cli ........................................ SKIPPED
[INFO] apollo-website .................................... SUCCESS [46.902s]
[INFO] apache-apollo ..................................... SKIPPED
[INFO] ------------------------------------------------------------------------
[INFO] BUILD FAILURE
[INFO] ------------------------------------------------------------------------
[INFO] Total time: 19:01.756s
[INFO] Finished at: Mon Jun 03 15:27:53 UTC 2013
[INFO] Final Memory: 136M/997M
[INFO] ------------------------------------------------------------------------
[JENKINS] Archiving disabled
[JENKINS] Archiving disabled
[JENKINS] Archiving disabled
[JENKINS] Archiving disabled
[JENKINS] Archiving disabled
[JENKINS] Archiving disabled
[JENKINS] Archiving disabled
[JENKINS] Archiving disabled
[JENKINS] Archiving disabled
[JENKINS] Archiving disabled
[JENKINS] Archiving disabled
[JENKINS] Archiving disabled
[JENKINS] Archiving disabled
[JENKINS] Archiving disabled
[JENKINS] Archiving disabled
[JENKINS] Archiving disabled
[JENKINS] Archiving disabled
[JENKINS] Archiving disabled
[JENKINS] Archiving disabled
[JENKINS] Archiving disabled
Waiting for Jenkins to finish collecting data
mavenExecutionResult exceptions not empty
message : Failed to execute goal on project apollo-amqp: Could not resolve dependencies for
project org.apache.activemq:apollo-amqp:jar:99-trunk-SNAPSHOT: Failed to collect dependencies
for [org.apache.activemq:apollo-broker:jar:99-trunk-SNAPSHOT (compile), org.apache.qpid:proton-hawtdispatch:jar:0.3.0-fuse-2
(compile), org.apache.activemq:apollo-web:jar:99-trunk-SNAPSHOT (compile?), org.eclipse.jetty.orbit:javax.servlet:jar:3.0.0.v201112011016
(provided), org.scala-lang:scala-library:jar:2.10.0 (compile), org.apache.activemq:apollo-broker:jar:tests:99-trunk-SNAPSHOT
(test), org.apache.activemq:apollo-util:jar:tests:99-trunk-SNAPSHOT (test), org.apache.activemq:apollo-bdb:jar:99-trunk-SNAPSHOT
(test), org.apache.activemq:apollo-leveldb:jar:99-trunk-SNAPSHOT (test), org.eclipse.jetty.aggregate:jetty-all-server:jar:8.1.5.v20120716
(test), org.fusesource.joram-jms-tests:joram-jms-tests:jar:1.0 (test), org.apache.qpid:qpid-amqp-1-0-client-jms:jar:0.20
(test), org.apache.geronimo.specs:geronimo-jms_1.1_spec:jar:1.1.1 (test), junit:junit:jar:4.10
(test), org.scalatest:scalatest_2.10.0:jar:1.8 (test), org.slf4j:slf4j-log4j12:jar:1.6.1 (test),
org.seleniumhq.selenium:selenium-java:jar:2.21.0 (test), org.seleniumhq.selenium:selenium-chrome-driver:jar:2.21.0
(test), org.seleniumhq.selenium:selenium-firefox-driver:jar:2.21.0 (test)]
cause : Could not resolve dependencies for project org.apache.activemq:apollo-amqp:jar:99-trunk-SNAPSHOT:
Failed to collect dependencies for [org.apache.activemq:apollo-broker:jar:99-trunk-SNAPSHOT
(compile), org.apache.qpid:proton-hawtdispatch:jar:0.3.0-fuse-2 (compile), org.apache.activemq:apollo-web:jar:99-trunk-SNAPSHOT
(compile?), org.eclipse.jetty.orbit:javax.servlet:jar:3.0.0.v201112011016 (provided), org.scala-lang:scala-library:jar:2.10.0
(compile), org.apache.activemq:apollo-broker:jar:tests:99-trunk-SNAPSHOT (test), org.apache.activemq:apollo-util:jar:tests:99-trunk-SNAPSHOT
(test), org.apache.activemq:apollo-bdb:jar:99-trunk-SNAPSHOT (test), org.apache.activemq:apollo-leveldb:jar:99-trunk-SNAPSHOT
(test), org.eclipse.jetty.aggregate:jetty-all-server:jar:8.1.5.v20120716 (test), org.fusesource.joram-jms-tests:joram-jms-tests:jar:1.0
(test), org.apache.qpid:qpid-amqp-1-0-client-jms:jar:0.20 (test), org.apache.geronimo.specs:geronimo-jms_1.1_spec:jar:1.1.1
(test), junit:junit:jar:4.10 (test), org.scalatest:scalatest_2.10.0:jar:1.8 (test), org.slf4j:slf4j-log4j12:jar:1.6.1
(test), org.seleniumhq.selenium:selenium-java:jar:2.21.0 (test), org.seleniumhq.selenium:selenium-chrome-driver:jar:2.21.0
(test), org.seleniumhq.selenium:selenium-firefox-driver:jar:2.21.0 (test)]
Stack trace : 
org.apache.maven.lifecycle.LifecycleExecutionException: Failed to execute goal on project
apollo-amqp: Could not resolve dependencies for project org.apache.activemq:apollo-amqp:jar:99-trunk-SNAPSHOT:
Failed to collect dependencies for [org.apache.activemq:apollo-broker:jar:99-trunk-SNAPSHOT
(compile), org.apache.qpid:proton-hawtdispatch:jar:0.3.0-fuse-2 (compile), org.apache.activemq:apollo-web:jar:99-trunk-SNAPSHOT
(compile?), org.eclipse.jetty.orbit:javax.servlet:jar:3.0.0.v201112011016 (provided), org.scala-lang:scala-library:jar:2.10.0
(compile), org.apache.activemq:apollo-broker:jar:tests:99-trunk-SNAPSHOT (test), org.apache.activemq:apollo-util:jar:tests:99-trunk-SNAPSHOT
(test), org.apache.activemq:apollo-bdb:jar:99-trunk-SNAPSHOT (test), org.apache.activemq:apollo-leveldb:jar:99-trunk-SNAPSHOT
(test), org.eclipse.jetty.aggregate:jetty-all-server:jar:8.1.5.v20120716 (test), org.fusesource.joram-jms-tests:joram-jms-tests:jar:1.0
(test), org.apache.qpid:qpid-amqp-1-0-client-jms:jar:0.20 (test), org.apache.geronimo.specs:geronimo-jms_1.1_spec:jar:1.1.1
(test), junit:junit:jar:4.10 (test), org.scalatest:scalatest_2.10.0:jar:1.8 (test), org.slf4j:slf4j-log4j12:jar:1.6.1
(test), org.seleniumhq.selenium:selenium-java:jar:2.21.0 (test), org.seleniumhq.selenium:selenium-chrome-driver:jar:2.21.0
(test), org.seleniumhq.selenium:selenium-firefox-driver:jar:2.21.0 (test)]
	at org.apache.maven.lifecycle.internal.LifecycleDependencyResolver.getDependencies(LifecycleDependencyResolver.java:190)
	at org.apache.maven.lifecycle.internal.LifecycleDependencyResolver.resolveProjectDependencies(LifecycleDependencyResolver.java:104)
	at org.apache.maven.lifecycle.internal.MojoExecutor.ensureDependenciesAreResolved(MojoExecutor.java:258)
	at org.apache.maven.lifecycle.internal.MojoExecutor.execute(MojoExecutor.java:201)
	at org.apache.maven.lifecycle.internal.MojoExecutor.execute(MojoExecutor.java:153)
	at org.apache.maven.lifecycle.internal.MojoExecutor.execute(MojoExecutor.java:145)
	at org.apache.maven.lifecycle.internal.LifecycleModuleBuilder.buildProject(LifecycleModuleBuilder.java:84)
	at org.apache.maven.lifecycle.internal.LifecycleModuleBuilder.buildProject(LifecycleModuleBuilder.java:59)
	at org.apache.maven.lifecycle.internal.LifecycleStarter.singleThreadedBuild(LifecycleStarter.java:183)
	at org.apache.maven.lifecycle.internal.LifecycleStarter.execute(LifecycleStarter.java:161)
	at org.apache.maven.DefaultMaven.doExecute(DefaultMaven.java:319)
	at org.apache.maven.DefaultMaven.execute(DefaultMaven.java:156)
	at org.jvnet.hudson.maven3.launcher.Maven3Launcher.main(Maven3Launcher.java:79)
	at sun.reflect.NativeMethodAccessorImpl.invoke0(Native Method)
	at sun.reflect.NativeMethodAccessorImpl.invoke(NativeMethodAccessorImpl.java:39)
	at sun.reflect.DelegatingMethodAccessorImpl.invoke(DelegatingMethodAccessorImpl.java:25)
	at java.lang.reflect.Method.invoke(Method.java:597)
	at org.codehaus.plexus.classworlds.launcher.Launcher.launchStandard(Launcher.java:329)
	at org.codehaus.plexus.classworlds.launcher.Launcher.launch(Launcher.java:239)
	at org.jvnet.hudson.maven3.agent.Maven3Main.launch(Maven3Main.java:158)
	at hudson.maven.Maven3Builder.call(Maven3Builder.java:100)
	at hudson.maven.Maven3Builder.call(Maven3Builder.java:66)
	at hudson.remoting.UserRequest.perform(UserRequest.java:118)
	at hudson.remoting.UserRequest.perform(UserRequest.java:48)
	at hudson.remoting.Request$2.run(Request.java:326)
	at hudson.remoting.InterceptingExecutorService$1.call(InterceptingExecutorService.java:72)
	at java.util.concurrent.FutureTask$Sync.innerRun(FutureTask.java:303)
	at java.util.concurrent.FutureTask.run(FutureTask.java:138)
	at java.util.concurrent.ThreadPoolExecutor$Worker.runTask(ThreadPoolExecutor.java:895)
	at java.util.concurrent.ThreadPoolExecutor$Worker.run(ThreadPoolExecutor.java:918)
	at java.lang.Thread.run(Thread.java:662)
Caused by: org.apache.maven.project.DependencyResolutionException: Could not resolve dependencies
for project org.apache.activemq:apollo-amqp:jar:99-trunk-SNAPSHOT: Failed to collect dependencies
for [org.apache.activemq:apollo-broker:jar:99-trunk-SNAPSHOT (compile), org.apache.qpid:proton-hawtdispatch:jar:0.3.0-fuse-2
(compile), org.apache.activemq:apollo-web:jar:99-trunk-SNAPSHOT (compile?), org.eclipse.jetty.orbit:javax.servlet:jar:3.0.0.v201112011016
(provided), org.scala-lang:scala-library:jar:2.10.0 (compile), org.apache.activemq:apollo-broker:jar:tests:99-trunk-SNAPSHOT
(test), org.apache.activemq:apollo-util:jar:tests:99-trunk-SNAPSHOT (test), org.apache.activemq:apollo-bdb:jar:99-trunk-SNAPSHOT
(test), org.apache.activemq:apollo-leveldb:jar:99-trunk-SNAPSHOT (test), org.eclipse.jetty.aggregate:jetty-all-server:jar:8.1.5.v20120716
(test), org.fusesource.joram-jms-tests:joram-jms-tests:jar:1.0 (test), org.apache.qpid:qpid-amqp-1-0-client-jms:jar:0.20
(test), org.apache.geronimo.specs:geronimo-jms_1.1_spec:jar:1.1.1 (test), junit:junit:jar:4.10
(test), org.scalatest:scalatest_2.10.0:jar:1.8 (test), org.slf4j:slf4j-log4j12:jar:1.6.1 (test),
org.seleniumhq.selenium:selenium-java:jar:2.21.0 (test), org.seleniumhq.selenium:selenium-chrome-driver:jar:2.21.0
(test), org.seleniumhq.selenium:selenium-firefox-driver:jar:2.21.0 (test)]
	at org.apache.maven.project.DefaultProjectDependenciesResolver.resolve(DefaultProjectDependenciesResolver.java:127)
	at org.apache.maven.lifecycle.internal.LifecycleDependencyResolver.getDependencies(LifecycleDependencyResolver.java:165)
	... 30 more
Caused by: org.sonatype.aether.collection.DependencyCollectionException: Failed to collect
dependencies for [org.apache.activemq:apollo-broker:jar:99-trunk-SNAPSHOT (compile), org.apache.qpid:proton-hawtdispatch:jar:0.3.0-fuse-2
(compile), org.apache.activemq:apollo-web:jar:99-trunk-SNAPSHOT (compile?), org.eclipse.jetty.orbit:javax.servlet:jar:3.0.0.v201112011016
(provided), org.scala-lang:scala-library:jar:2.10.0 (compile), org.apache.activemq:apollo-broker:jar:tests:99-trunk-SNAPSHOT
(test), org.apache.activemq:apollo-util:jar:tests:99-trunk-SNAPSHOT (test), org.apache.activemq:apollo-bdb:jar:99-trunk-SNAPSHOT
(test), org.apache.activemq:apollo-leveldb:jar:99-trunk-SNAPSHOT (test), org.eclipse.jetty.aggregate:jetty-all-server:jar:8.1.5.v20120716
(test), org.fusesource.joram-jms-tests:joram-jms-tests:jar:1.0 (test), org.apache.qpid:qpid-amqp-1-0-client-jms:jar:0.20
(test), org.apache.geronimo.specs:geronimo-jms_1.1_spec:jar:1.1.1 (test), junit:junit:jar:4.10
(test), org.scalatest:scalatest_2.10.0:jar:1.8 (test), org.slf4j:slf4j-log4j12:jar:1.6.1 (test),
org.seleniumhq.selenium:selenium-java:jar:2.21.0 (test), org.seleniumhq.selenium:selenium-chrome-driver:jar:2.21.0
(test), org.seleniumhq.selenium:selenium-firefox-driver:jar:2.21.0 (test)]
	at org.sonatype.aether.impl.internal.DefaultDependencyCollector.collectDependencies(DefaultDependencyCollector.java:251)
	at org.sonatype.aether.impl.internal.DefaultRepositorySystem.collectDependencies(DefaultRepositorySystem.java:318)
	at org.apache.maven.project.DefaultProjectDependenciesResolver.resolve(DefaultProjectDependenciesResolver.java:119)
	... 31 more
Caused by: org.sonatype.aether.resolution.ArtifactDescriptorException: Failed to read artifact
descriptor for org.apache.qpid:proton-hawtdispatch:jar:0.3.0-fuse-2
	at org.apache.maven.repository.internal.DefaultArtifactDescriptorReader.loadPom(DefaultArtifactDescriptorReader.java:283)
	at org.apache.maven.repository.internal.DefaultArtifactDescriptorReader.readArtifactDescriptor(DefaultArtifactDescriptorReader.java:173)
	at org.sonatype.aether.impl.internal.DefaultDependencyCollector.process(DefaultDependencyCollector.java:419)
	at org.sonatype.aether.impl.internal.DefaultDependencyCollector.collectDependencies(DefaultDependencyCollector.java:233)
	... 33 more
Caused by: org.sonatype.aether.resolution.ArtifactResolutionException: Could not transfer
artifact org.apache.qpid:proton-hawtdispatch:pom:0.3.0-fuse-2 from/to com.fusesource.m2 (http://repo.fusesource.com/nexus/content/groups/public/):
Error transferring file: Server returned HTTP response code: 503 for URL: http://repo.fusesource.com/nexus/content/groups/public/org/apache/qpid/proton-hawtdispatch/0.3.0-fuse-2/proton-hawtdispatch-0.3.0-fuse-2.pom
	at org.sonatype.aether.impl.internal.DefaultArtifactResolver.resolveArtifacts(DefaultArtifactResolver.java:526)
	at org.sonatype.aether.impl.internal.DefaultArtifactResolver.resolveArtifact(DefaultArtifactResolver.java:214)
	at org.apache.maven.repository.internal.DefaultArtifactDescriptorReader.loadPom(DefaultArtifactDescriptorReader.java:268)
	... 36 more
Caused by: org.sonatype.aether.transfer.ArtifactTransferException: Could not transfer artifact
org.apache.qpid:proton-hawtdispatch:pom:0.3.0-fuse-2 from/to com.fusesource.m2 (http://repo.fusesource.com/nexus/content/groups/public/):
Error transferring file: Server returned HTTP response code: 503 for URL: http://repo.fusesource.com/nexus/content/groups/public/org/apache/qpid/proton-hawtdispatch/0.3.0-fuse-2/proton-hawtdispatch-0.3.0-fuse-2.pom
	at org.sonatype.aether.connector.wagon.WagonRepositoryConnector$4.wrap(WagonRepositoryConnector.java:949)
	at org.sonatype.aether.connector.wagon.WagonRepositoryConnector$4.wrap(WagonRepositoryConnector.java:940)
	at org.sonatype.aether.connector.wagon.WagonRepositoryConnector$GetTask.flush(WagonRepositoryConnector.java:696)
	at org.sonatype.aether.connector.wagon.WagonRepositoryConnector$GetTask.flush(WagonRepositoryConnector.java:690)
	at org.sonatype.aether.connector.wagon.WagonRepositoryConnector.get(WagonRepositoryConnector.java:435)
	at org.sonatype.aether.impl.internal.DefaultArtifactResolver.resolveArtifacts(DefaultArtifactResolver.java:438)
	... 38 more
Caused by: org.apache.maven.wagon.TransferFailedException: Error transferring file: Server
returned HTTP response code: 503 for URL: http://repo.fusesource.com/nexus/content/groups/public/org/apache/qpid/proton-hawtdispatch/0.3.0-fuse-2/proton-hawtdispatch-0.3.0-fuse-2.pom
	at org.apache.maven.wagon.providers.http.LightweightHttpWagon.fillInputData(LightweightHttpWagon.java:143)
	at org.apache.maven.wagon.StreamWagon.getInputStream(StreamWagon.java:116)
	at org.apache.maven.wagon.StreamWagon.getIfNewer(StreamWagon.java:88)
	at org.apache.maven.wagon.StreamWagon.get(StreamWagon.java:61)
	at org.sonatype.aether.connector.wagon.WagonRepositoryConnector$GetTask.run(WagonRepositoryConnector.java:605)
	... 3 more
Caused by: java.io.IOException: Server returned HTTP response code: 503 for URL: http://repo.fusesource.com/nexus/content/groups/public/org/apache/qpid/proton-hawtdispatch/0.3.0-fuse-2/proton-hawtdispatch-0.3.0-fuse-2.pom
	at sun.reflect.GeneratedConstructorAccessor53.newInstance(Unknown Source)
	at sun.reflect.DelegatingConstructorAccessorImpl.newInstance(DelegatingConstructorAccessorImpl.java:27)
	at java.lang.reflect.Constructor.newInstance(Constructor.java:513)
	at sun.net.www.protocol.http.HttpURLConnection$6.run(HttpURLConnection.java:1514)
	at java.security.AccessController.doPrivileged(Native Method)
	at sun.net.www.protocol.http.HttpURLConnection.getChainedException(HttpURLConnection.java:1508)
	at sun.net.www.protocol.http.HttpURLConnection.getInputStream(HttpURLConnection.java:1162)
	at org.apache.maven.wagon.providers.http.LightweightHttpWagon.fillInputData(LightweightHttpWagon.java:122)
	... 7 more
Caused by: java.io.IOException: Server returned HTTP response code: 503 for URL: http://repo.fusesource.com/nexus/content/groups/public/org/apache/qpid/proton-hawtdispatch/0.3.0-fuse-2/proton-hawtdispatch-0.3.0-fuse-2.pom
	at sun.net.www.protocol.http.HttpURLConnection.getInputStream(HttpURLConnection.java:1459)
	at java.net.HttpURLConnection.getResponseCode(HttpURLConnection.java:379)
	at org.apache.maven.wagon.providers.http.LightweightHttpWagon.fillInputData(LightweightHttpWagon.java:115)
	... 7 more
Sending e-mails to: commits@activemq.apache.org
channel stopped

Mime
View raw message