activemq-commits mailing list archives

Site index · List index
Message view « Date » · « Thread »
Top « Date » · « Thread »
From Apache Jenkins Server <jenk...@builds.apache.org>
Subject Build failed in Jenkins: ActiveMQ-Apollo #954
Date Mon, 20 May 2013 14:44:07 GMT
See <https://builds.apache.org/job/ActiveMQ-Apollo/954/changes>

Changes:

[chirino] Switch to released lib version.

------------------------------------------
[...truncated 2798 lines...]
                             log.console | INFO  | OS is restricting the open file limit to:
40000
                             log.console | INFO  | Accepting connections at: tcp://0.0.0.0:46517
                             log.console | INFO  | Accepting connections at: udp://0.0.0.0:51077
                             log.console | INFO  | Accepting connections at: udp://0.0.0.0:56235
                             log.console | INFO  | Stopped connector at: tcp://0.0.0.0:0
                             log.console | INFO  | Stopped connector at: udp://0.0.0.0:0
                             log.console | INFO  | Stopped connector at: udp://0.0.0.0:0
Tests run: 7, Failures: 0, Errors: 0, Skipped: 0, Time elapsed: 0.357 sec
Running org.apache.activemq.apollo.stomp.test.StompLevelDBMetricsTest
ParallelJUnitRunner using up to 16 threads to execute parallel tests.
                             log.console | INFO  | OS     : Linux 3.2.0-38-generic (Ubuntu
12.04.2 LTS)
                             log.console | INFO  | JVM    : Java HotSpot(TM) Server VM 1.6.0_45
(Sun Microsystems Inc.)
                             log.console | INFO  | Apollo : 99-trunk-SNAPSHOT
                             log.console | INFO  | OS is restricting the open file limit to:
40000
                             log.console | INFO  | Accepting connections at: tcp://0.0.0.0:55858
                             log.console | INFO  | Accepting connections at: udp://0.0.0.0:42351
                             log.console | INFO  | Accepting connections at: udp://0.0.0.0:36069
                             log.console | INFO  | Starting store: leveldb store at <https://builds.apache.org/job/ActiveMQ-Apollo/ws/trunk/apollo-stomp/target/test-data/org.apache.activemq.apollo.stomp.test.StompLevelDBMetricsTest>
                   leveldb.LevelDBClient | INFO  | Opening the log file took: 155.19 ms
                             log.console | INFO  | Stopped connector at: udp://0.0.0.0:0
                             log.console | INFO  | Stopped connector at: udp://0.0.0.0:0
                             log.console | INFO  | Stopped connector at: tcp://0.0.0.0:0
Tests run: 8, Failures: 0, Errors: 0, Skipped: 0, Time elapsed: 2.159 sec
Running org.apache.activemq.apollo.stomp.test.StompSslTest
ParallelJUnitRunner using up to 16 threads to execute parallel tests.
                             log.console | INFO  | OS     : Linux 3.2.0-38-generic (Ubuntu
12.04.2 LTS)
                             log.console | INFO  | JVM    : Java HotSpot(TM) Server VM 1.6.0_45
(Sun Microsystems Inc.)
                             log.console | INFO  | Apollo : 99-trunk-SNAPSHOT
                             log.console | INFO  | OS is restricting the open file limit to:
40000
                             log.console | INFO  | Accepting connections at: ssl://0.0.0.0:49090
                             log.console | INFO  | Accepting connections at: tcp://0.0.0.0:51109
                             log.console | INFO  | Stopped connector at: ssl://0.0.0.0:0
                             log.console | INFO  | Stopped connector at: tcp://0.0.0.0:0
Tests run: 2, Failures: 0, Errors: 0, Skipped: 0, Time elapsed: 0.55 sec
Running org.apache.activemq.apollo.stomp.test.StompWebSocketTests$ChromeStompWebSocketTest
ParallelJUnitRunner using up to 16 threads to execute parallel tests.
ignoring tests, could not create web driver: java.lang.IllegalStateException: The path to
the driver executable must be set by the webdriver.chrome.driver system property; for more
information, see http://code.google.com/p/selenium/wiki/ChromeDriver. The latest version can
be downloaded from http://code.google.com/p/chromedriver/downloads/list
Tests run: 2, Failures: 0, Errors: 0, Skipped: 0, Time elapsed: 0.041 sec
Running org.apache.activemq.apollo.stomp.test.StompLevelDBParallelTest
ParallelJUnitRunner using up to 16 threads to execute parallel tests.
                             log.console | INFO  | OS     : Linux 3.2.0-38-generic (Ubuntu
12.04.2 LTS)
                             log.console | INFO  | JVM    : Java HotSpot(TM) Server VM 1.6.0_45
(Sun Microsystems Inc.)
                             log.console | INFO  | Apollo : 99-trunk-SNAPSHOT
                             log.console | INFO  | OS is restricting the open file limit to:
40000
                             log.console | INFO  | Starting store: leveldb store at <https://builds.apache.org/job/ActiveMQ-Apollo/ws/trunk/apollo-stomp/target/test-data/org.apache.activemq.apollo.stomp.test.StompLevelDBParallelTest>
                             log.console | INFO  | Accepting connections at: tcp://0.0.0.0:52485
                             log.console | INFO  | Accepting connections at: udp://0.0.0.0:60783
                             log.console | INFO  | Accepting connections at: udp://0.0.0.0:42559
                   leveldb.LevelDBClient | INFO  | Opening the log file took: 88.27 ms
BParallelTest:STOMP UDP to STOMP interop | INFO  | The UDP port is: 42559
:Message groups are sticky to a consumer | INFO  | Map(2 -> Set(c, r, s, k, h, w, i, p,
m, t), 1 -> Set(f, u, g, v, o, x, a, j, b, q, y, d, z, e, l, n))
:Message groups are sticky to a consumer | INFO  | Map(2 -> Set(r, h, i, p, m, t), 1 ->
Set(g, d, v, y, z, e, o, l, a, q), 3 -> Set(f, c, u, s, k, w, x, j, b, n))
pLevelDBParallelTest:STOMP flow control. | INFO  | sending: 1
pLevelDBParallelTest:STOMP flow control. | INFO  | sending: 2
pLevelDBParallelTest:STOMP flow control. | INFO  | sending: 3
pLevelDBParallelTest:STOMP flow control. | INFO  | sending: 4
pLevelDBParallelTest:STOMP flow control. | INFO  | sending: 5
pLevelDBParallelTest:STOMP flow control. | INFO  | sending: 6
pLevelDBParallelTest:STOMP flow control. | INFO  | sending: 7
 does not (always) work on topics: block | INFO  | expired: 779
does not (always) work on topics: queued | INFO  | expired: 744
pLevelDBParallelTest:STOMP flow control. | INFO  | sending: 8
pLevelDBParallelTest:STOMP flow control. | INFO  | sending: 9
pLevelDBParallelTest:STOMP flow control. | INFO  | sending: 10
                             log.console | INFO  | Stopped connector at: udp://0.0.0.0:0
                             log.console | INFO  | Stopped connector at: tcp://0.0.0.0:0
                             log.console | INFO  | Stopped connector at: udp://0.0.0.0:0
Tests run: 77, Failures: 0, Errors: 0, Skipped: 0, Time elapsed: 4.355 sec
Running org.apache.activemq.apollo.stomp.test.DeadLetterQueueLoadTest
ParallelJUnitRunner using up to 16 threads to execute parallel tests.
                             log.console | INFO  | OS     : Linux 3.2.0-38-generic (Ubuntu
12.04.2 LTS)
                             log.console | INFO  | JVM    : Java HotSpot(TM) Server VM 1.6.0_45
(Sun Microsystems Inc.)
                             log.console | INFO  | Apollo : 99-trunk-SNAPSHOT
                             log.console | INFO  | OS is restricting the open file limit to:
40000
                             log.console | INFO  | Accepting connections at: tcp://0.0.0.0:52752
                             log.console | INFO  | Accepting connections at: udp://0.0.0.0:45808
                             log.console | INFO  | Accepting connections at: udp://0.0.0.0:49986
                             log.console | INFO  | Starting store: bdb store at <https://builds.apache.org/job/ActiveMQ-Apollo/ws/trunk/apollo-stomp/target/test-data/org.apache.activemq.apollo.stomp.test.DeadLetterQueueLoadTest>
                             log.console | INFO  | Stopped connector at: udp://0.0.0.0:0
                             log.console | INFO  | Stopped connector at: tcp://0.0.0.0:0
                             log.console | INFO  | Stopped connector at: udp://0.0.0.0:0
Tests run: 16, Failures: 0, Errors: 0, Skipped: 0, Time elapsed: 42.155 sec
Running org.apache.activemq.apollo.stomp.test.StompSslSecurityTest
ParallelJUnitRunner using up to 16 threads to execute parallel tests.
                             log.console | INFO  | OS     : Linux 3.2.0-38-generic (Ubuntu
12.04.2 LTS)
                             log.console | INFO  | JVM    : Java HotSpot(TM) Server VM 1.6.0_45
(Sun Microsystems Inc.)
                             log.console | INFO  | Apollo : 99-trunk-SNAPSHOT
                             log.console | INFO  | OS is restricting the open file limit to:
40000
                             log.console | INFO  | Accepting connections at: ssl://0.0.0.0:49391
                             log.console | INFO  | Stopped connector at: ssl://0.0.0.0:0
Tests run: 1, Failures: 0, Errors: 0, Skipped: 0, Time elapsed: 0.275 sec
Running org.apache.activemq.apollo.stomp.test.StompParallelTest
ParallelJUnitRunner using up to 16 threads to execute parallel tests.
                             log.console | INFO  | OS     : Linux 3.2.0-38-generic (Ubuntu
12.04.2 LTS)
                             log.console | INFO  | JVM    : Java HotSpot(TM) Server VM 1.6.0_45
(Sun Microsystems Inc.)
                             log.console | INFO  | Apollo : 99-trunk-SNAPSHOT
                             log.console | INFO  | OS is restricting the open file limit to:
40000
                             log.console | INFO  | Accepting connections at: tcp://0.0.0.0:52744
                             log.console | INFO  | Accepting connections at: udp://0.0.0.0:48269
                             log.console | INFO  | Accepting connections at: udp://0.0.0.0:42605
pParallelTest:STOMP UDP to STOMP interop | INFO  | The UDP port is: 42605
:Message groups are sticky to a consumer | INFO  | Map(2 -> Set(c, g, k, e, w, a, m), 1
-> Set(f, u, v, h, o, i, x, p, j, b, q, r, y, d, s, z, l, t, n))
:Message groups are sticky to a consumer | INFO  | Map(2 -> Set(c, g, k, e, w, m), 1 ->
Set(f, u, y, d, s, v, z, o, l, i, j, q, n), 3 -> Set(r, h, x, a, p, b, t))
st.StompParallelTest:STOMP flow control. | INFO  | sending: 1
st.StompParallelTest:STOMP flow control. | INFO  | sending: 2
st.StompParallelTest:STOMP flow control. | INFO  | sending: 3
st.StompParallelTest:STOMP flow control. | INFO  | sending: 4
st.StompParallelTest:STOMP flow control. | INFO  | sending: 5
st.StompParallelTest:STOMP flow control. | INFO  | sending: 6
st.StompParallelTest:STOMP flow control. | INFO  | sending: 7
does not (always) work on topics: queued | INFO  | expired: 750
 does not (always) work on topics: block | INFO  | expired: 737
st.StompParallelTest:STOMP flow control. | INFO  | sending: 8
st.StompParallelTest:STOMP flow control. | INFO  | sending: 9
st.StompParallelTest:STOMP flow control. | INFO  | sending: 10
                             log.console | INFO  | Stopped connector at: udp://0.0.0.0:0
                             log.console | INFO  | Stopped connector at: tcp://0.0.0.0:0
                             log.console | INFO  | Stopped connector at: udp://0.0.0.0:0
Tests run: 68, Failures: 0, Errors: 0, Skipped: 0, Time elapsed: 3.267 sec
Running org.apache.activemq.apollo.stomp.test.StompDropPolicyTest
ParallelJUnitRunner using up to 16 threads to execute parallel tests.
                             log.console | INFO  | OS     : Linux 3.2.0-38-generic (Ubuntu
12.04.2 LTS)
                             log.console | INFO  | JVM    : Java HotSpot(TM) Server VM 1.6.0_45
(Sun Microsystems Inc.)
                             log.console | INFO  | Apollo : 99-trunk-SNAPSHOT
                             log.console | INFO  | OS is restricting the open file limit to:
40000
                             log.console | INFO  | Starting store: leveldb store at <https://builds.apache.org/job/ActiveMQ-Apollo/ws/trunk/apollo-stomp/target/test-data/org.apache.activemq.apollo.stomp.test.StompDropPolicyTest>
                             log.console | INFO  | Accepting connections at: tcp://0.0.0.0:54994
                             log.console | INFO  | Accepting connections at: udp://0.0.0.0:50789
                             log.console | INFO  | Accepting connections at: udp://0.0.0.0:58033
                   leveldb.LevelDBClient | INFO  | Opening the log file took: 161.89 ms
                             log.console | INFO  | Stopped connector at: tcp://0.0.0.0:0
                             log.console | INFO  | Stopped connector at: udp://0.0.0.0:0
                             log.console | INFO  | Stopped connector at: udp://0.0.0.0:0
Tests run: 4, Failures: 0, Errors: 0, Skipped: 0, Time elapsed: 1.171 sec
Running org.apache.activemq.apollo.stomp.test.StompWildcardCustomParallelTest
ParallelJUnitRunner using up to 16 threads to execute parallel tests.
                             log.console | INFO  | OS     : Linux 3.2.0-38-generic (Ubuntu
12.04.2 LTS)
                             log.console | INFO  | JVM    : Java HotSpot(TM) Server VM 1.6.0_45
(Sun Microsystems Inc.)
                             log.console | INFO  | Apollo : 99-trunk-SNAPSHOT
                             log.console | INFO  | OS is restricting the open file limit to:
40000
                             log.console | INFO  | Accepting connections at: tcp://0.0.0.0:43206
                             log.console | INFO  | Stopped connector at: tcp://0.0.0.0:0
Tests run: 1, Failures: 0, Errors: 0, Skipped: 0, Time elapsed: 0.049 sec
Running org.apache.activemq.apollo.stomp.test.StompBDBParallelTest
ParallelJUnitRunner using up to 16 threads to execute parallel tests.
                             log.console | INFO  | OS     : Linux 3.2.0-38-generic (Ubuntu
12.04.2 LTS)
                             log.console | INFO  | JVM    : Java HotSpot(TM) Server VM 1.6.0_45
(Sun Microsystems Inc.)
                             log.console | INFO  | Apollo : 99-trunk-SNAPSHOT
                             log.console | INFO  | OS is restricting the open file limit to:
40000
                             log.console | INFO  | Starting store: bdb store at <https://builds.apache.org/job/ActiveMQ-Apollo/ws/trunk/apollo-stomp/target/test-data/org.apache.activemq.apollo.stomp.test.StompBDBParallelTest>
                             log.console | INFO  | Accepting connections at: tcp://0.0.0.0:35338
                             log.console | INFO  | Accepting connections at: udp://0.0.0.0:58511
                             log.console | INFO  | Accepting connections at: udp://0.0.0.0:49270
BParallelTest:STOMP UDP to STOMP interop | INFO  | The UDP port is: 49270
:Message groups are sticky to a consumer | INFO  | Map(2 -> Set(f, u, v, h, w, o, i, a,
d, s, k, l, m, t, n), 1 -> Set(c, r, g, y, z, e, x, p, j, b, q))
:Message groups are sticky to a consumer | INFO  | Map(2 -> Set(d, s, k, h, w, o, l, i,
t, n), 1 -> Set(c, r, g, y, e, x, p, j, b, q), 3 -> Set(f, u, v, z, a, m))
StompBDBParallelTest:STOMP flow control. | INFO  | sending: 1
StompBDBParallelTest:STOMP flow control. | INFO  | sending: 2
StompBDBParallelTest:STOMP flow control. | INFO  | sending: 3
StompBDBParallelTest:STOMP flow control. | INFO  | sending: 4
StompBDBParallelTest:STOMP flow control. | INFO  | sending: 5
does not (always) work on topics: queued | INFO  | expired: 744
StompBDBParallelTest:STOMP flow control. | INFO  | sending: 6
 does not (always) work on topics: block | INFO  | expired: 779
StompBDBParallelTest:STOMP flow control. | INFO  | sending: 7
StompBDBParallelTest:STOMP flow control. | INFO  | sending: 8
StompBDBParallelTest:STOMP flow control. | INFO  | sending: 9
StompBDBParallelTest:STOMP flow control. | INFO  | sending: 10
                             log.console | INFO  | Stopped connector at: udp://0.0.0.0:0
                             log.console | INFO  | Stopped connector at: udp://0.0.0.0:0
                             log.console | INFO  | Stopped connector at: tcp://0.0.0.0:0
Tests run: 77, Failures: 0, Errors: 0, Skipped: 0, Time elapsed: 4.486 sec
Running org.apache.activemq.apollo.stomp.test.StompSecurityTest
ParallelJUnitRunner using up to 16 threads to execute parallel tests.
                             log.console | INFO  | OS     : Linux 3.2.0-38-generic (Ubuntu
12.04.2 LTS)
                             log.console | INFO  | JVM    : Java HotSpot(TM) Server VM 1.6.0_45
(Sun Microsystems Inc.)
                             log.console | INFO  | Apollo : 99-trunk-SNAPSHOT
                             log.console | INFO  | OS is restricting the open file limit to:
40000
                             log.console | INFO  | Accepting connections at: tcp://0.0.0.0:58197
                             log.console | INFO  | Accepting connections at: tcp://0.0.0.0:45367
                             log.console | INFO  | Accepting connections at: udp://0.0.0.0:58300
                            log.security | INFO  | authentication failed: local:/127.0.0.1:58197,
remote:/127.0.0.1:46700, reason:Failed login: User id not provided 
                            log.security | INFO  | authentication failed: local:/127.0.0.1:58197,
remote:/127.0.0.1:46701, reason:Failed login: Invalid user id or password for user: foo 
The UDP port is: 58300
MESSAGE
subscription:0
sender-ip:127.0.0.1
message-id:default-11
destination:/topic/some-other-udp
login:can_send_topic
passcode:can_send_topic

Hello
                             log.console | INFO  | Stopped connector at: udp://0.0.0.0:0
                             log.console | INFO  | Stopped connector at: tcp://0.0.0.0:0
                             log.console | INFO  | Stopped connector at: tcp://0.0.0.0:0
Tests run: 15, Failures: 0, Errors: 0, Skipped: 0, Time elapsed: 0.087 sec
Running org.apache.activemq.apollo.stomp.test.StompWebSocketTests$FirefoxStompWebSocketTest
ParallelJUnitRunner using up to 16 threads to execute parallel tests.
org.openqa.selenium.firefox.NotConnectedException: Unable to connect to host 127.0.0.1 on
port 7055 after 45000 ms. Firefox console output:
Error: no display specified
Error: no display specified

	at org.openqa.selenium.firefox.internal.NewProfileExtensionConnection.start(NewProfileExtensionConnection.java:109)
	at org.openqa.selenium.firefox.FirefoxDriver.startClient(FirefoxDriver.java:245)
	at org.openqa.selenium.remote.RemoteWebDriver.<init>(RemoteWebDriver.java:109)
	at org.openqa.selenium.firefox.FirefoxDriver.<init>(FirefoxDriver.java:183)
	at org.openqa.selenium.firefox.FirefoxDriver.<init>(FirefoxDriver.java:178)
	at org.openqa.selenium.firefox.FirefoxDriver.<init>(FirefoxDriver.java:174)
	at org.openqa.selenium.firefox.FirefoxDriver.<init>(FirefoxDriver.java:96)
	at org.apache.activemq.apollo.stomp.test.FirefoxWebDriverTrait$class.create_web_driver(FirefoxWebDriverTrait.scala:28)
	at org.apache.activemq.apollo.stomp.test.StompWebSocketTests$FirefoxStompWebSocketTest.create_web_driver(StompWebSocketTests.scala:32)
	at org.apache.activemq.apollo.stomp.test.StompWebSocketTests$FirefoxStompWebSocketTest.create_web_driver(StompWebSocketTests.scala:32)
	at org.apache.activemq.apollo.stomp.test.StompWebSocketTests$StompWebSocketTestBase.beforeAll(StompWebSocketTests.scala:42)
	at org.scalatest.ParallelBeforeAndAfterAll$class.beforeAll(ParallelBeforeAndAfterAll.scala:152)
	at org.apache.activemq.apollo.util.FunSuiteSupport.beforeAll(FunSuiteSupport.scala:124)
	at org.scalatest.ParallelBeforeAndAfterAll$class.run(ParallelBeforeAndAfterAll.scala:226)
	at org.apache.activemq.apollo.util.FunSuiteSupport.run(FunSuiteSupport.scala:42)
	at org.scalatest.junit.ParallelJUnitRunner$$anonfun$run$1.apply(ParallelJUnitRunner.scala:105)
	at org.scalatest.junit.ParallelJUnitRunner$$anonfun$run$1.apply(ParallelJUnitRunner.scala:102)
	at org.scalatest.junit.ParallelJUnitRunner$.withExecutor(ParallelJUnitRunner.scala:138)
	at org.scalatest.junit.ParallelJUnitRunner.run(ParallelJUnitRunner.scala:102)
	at org.apache.maven.surefire.junit4.JUnit4Provider.execute(JUnit4Provider.java:236)
	at org.apache.maven.surefire.junit4.JUnit4Provider.executeTestSet(JUnit4Provider.java:134)
	at org.apache.maven.surefire.junit4.JUnit4Provider.invoke(JUnit4Provider.java:113)
	at sun.reflect.NativeMethodAccessorImpl.invoke0(Native Method)
	at sun.reflect.NativeMethodAccessorImpl.invoke(NativeMethodAccessorImpl.java:39)
	at sun.reflect.DelegatingMethodAccessorImpl.invoke(DelegatingMethodAccessorImpl.java:25)
	at java.lang.reflect.Method.invoke(Method.java:597)
	at org.apache.maven.surefire.util.ReflectionUtils.invokeMethodWithArray(ReflectionUtils.java:189)
	at org.apache.maven.surefire.booter.ProviderFactory$ProviderProxy.invoke(ProviderFactory.java:165)
	at org.apache.maven.surefire.booter.ProviderFactory.invokeProvider(ProviderFactory.java:85)
	at org.apache.maven.surefire.booter.ForkedBooter.runSuitesInProcess(ForkedBooter.java:103)
	at org.apache.maven.surefire.booter.ForkedBooter.main(ForkedBooter.java:74)
ignoring tests, could not create web driver: org.openqa.selenium.WebDriverException: Failed
to connect to binary FirefoxBinary(/usr/bin/firefox) on port 7055; process output follows:

Error: no display specified
Error: no display specified

Build info: version: '2.25.0', revision: '17482', time: '2012-07-18 22:18:01'
System info: os.name: 'Linux', os.arch: 'i386', os.version: '3.2.0-38-generic', java.version:
'1.6.0_45'
Driver info: driver.version: FirefoxDriver
Tests run: 2, Failures: 0, Errors: 0, Skipped: 0, Time elapsed: 47.101 sec

Results :

Tests run: 283, Failures: 0, Errors: 0, Skipped: 0

ERROR: Maven JVM terminated unexpectedly with exit code 143


Mime
View raw message