activemq-commits mailing list archives

Site index · List index
Message view « Date » · « Thread »
Top « Date » · « Thread »
From Apache Jenkins Server <jenk...@builds.apache.org>
Subject Build failed in Jenkins: ActiveMQ-Apollo-Deploy » apollo-util #388
Date Thu, 04 Apr 2013 07:01:53 GMT
See <https://builds.apache.org/job/ActiveMQ-Apollo-Deploy/org.apache.activemq$apollo-util/388/changes>

Changes:

[chirino] protect against APLO-315: Added a test case and protection against 'evil' clients
that send many request /w receipt frames but that don't read their sockets for responses.

------------------------------------------
[...truncated 7 lines...]
Downloading: http://download.oracle.com/maven/org/fusesource/hawtbuf/hawtbuf-project/1.9/hawtbuf-project-1.9.pom
Downloading: http://repo.fusesource.com/nexus/content/groups/public/org/fusesource/hawtbuf/hawtbuf-project/1.9/hawtbuf-project-1.9.pom
Downloaded: http://repo.fusesource.com/nexus/content/groups/public/org/fusesource/hawtbuf/hawtbuf-project/1.9/hawtbuf-project-1.9.pom
(11 KB at 32.9 KB/sec)
Downloading: http://download.oracle.com/maven/org/fusesource/fusesource-pom/1.9/fusesource-pom-1.9.pom
Downloading: http://repo.fusesource.com/nexus/content/groups/public/org/fusesource/fusesource-pom/1.9/fusesource-pom-1.9.pom
Downloaded: http://repo.fusesource.com/nexus/content/groups/public/org/fusesource/fusesource-pom/1.9/fusesource-pom-1.9.pom
(15 KB at 35.0 KB/sec)
Downloading: http://repository.apache.org/snapshots/org/fusesource/hawtdispatch/hawtdispatch-scala/1.14-SNAPSHOT/maven-metadata.xml
Downloading: http://repo.fusesource.com/nexus/content/groups/public-snapshots/org/fusesource/hawtdispatch/hawtdispatch-scala/1.14-SNAPSHOT/maven-metadata.xml
Downloading: http://download.oracle.com/maven/org/fusesource/hawtdispatch/hawtdispatch-scala/1.14-SNAPSHOT/maven-metadata.xml
Downloaded: http://repo.fusesource.com/nexus/content/groups/public-snapshots/org/fusesource/hawtdispatch/hawtdispatch-scala/1.14-SNAPSHOT/maven-metadata.xml
(792 B at 1.8 KB/sec)
Downloading: http://repository.apache.org/snapshots/org/fusesource/hawtdispatch/hawtdispatch-scala/1.14-SNAPSHOT/hawtdispatch-scala-1.14-20130403.141315-2.pom
Downloading: http://repo.fusesource.com/nexus/content/groups/public-snapshots/org/fusesource/hawtdispatch/hawtdispatch-scala/1.14-SNAPSHOT/hawtdispatch-scala-1.14-20130403.141315-2.pom
Downloaded: http://repo.fusesource.com/nexus/content/groups/public-snapshots/org/fusesource/hawtdispatch/hawtdispatch-scala/1.14-SNAPSHOT/hawtdispatch-scala-1.14-20130403.141315-2.pom
(7 KB at 16.3 KB/sec)
Downloading: http://repository.apache.org/snapshots/org/fusesource/hawtdispatch/hawtdispatch-project/1.14-SNAPSHOT/maven-metadata.xml
Downloading: http://download.oracle.com/maven/org/fusesource/hawtdispatch/hawtdispatch-project/1.14-SNAPSHOT/maven-metadata.xml
Downloading: http://repo.fusesource.com/nexus/content/groups/public-snapshots/org/fusesource/hawtdispatch/hawtdispatch-project/1.14-SNAPSHOT/maven-metadata.xml
Downloaded: http://repo.fusesource.com/nexus/content/groups/public-snapshots/org/fusesource/hawtdispatch/hawtdispatch-project/1.14-SNAPSHOT/maven-metadata.xml
(382 B at 1.1 KB/sec)
Downloading: http://repo.fusesource.com/nexus/content/groups/public-snapshots/org/fusesource/hawtdispatch/hawtdispatch-project/1.14-SNAPSHOT/hawtdispatch-project-1.14-20130404.051653-6.pom
Downloaded: http://repo.fusesource.com/nexus/content/groups/public-snapshots/org/fusesource/hawtdispatch/hawtdispatch-project/1.14-SNAPSHOT/hawtdispatch-project-1.14-20130404.051653-6.pom
(13 KB at 26.7 KB/sec)
Downloading: http://repo.fusesource.com/nexus/content/groups/public-snapshots/org/fusesource/hawtdispatch/hawtdispatch/1.14-SNAPSHOT/maven-metadata.xml
Downloading: http://repository.apache.org/snapshots/org/fusesource/hawtdispatch/hawtdispatch/1.14-SNAPSHOT/maven-metadata.xml
Downloading: http://download.oracle.com/maven/org/fusesource/hawtdispatch/hawtdispatch/1.14-SNAPSHOT/maven-metadata.xml
Downloaded: http://repo.fusesource.com/nexus/content/groups/public-snapshots/org/fusesource/hawtdispatch/hawtdispatch/1.14-SNAPSHOT/maven-metadata.xml
(374 B at 1.0 KB/sec)
Downloading: http://repository.apache.org/snapshots/org/fusesource/hawtdispatch/hawtdispatch/1.14-SNAPSHOT/hawtdispatch-1.14-20130404.051653-6.pom
Downloading: http://repo.fusesource.com/nexus/content/groups/public-snapshots/org/fusesource/hawtdispatch/hawtdispatch/1.14-SNAPSHOT/hawtdispatch-1.14-20130404.051653-6.pom
Downloaded: http://repo.fusesource.com/nexus/content/groups/public-snapshots/org/fusesource/hawtdispatch/hawtdispatch/1.14-SNAPSHOT/hawtdispatch-1.14-20130404.051653-6.pom
(3 KB at 7.9 KB/sec)
Downloading: http://download.oracle.com/maven/org/apache/geronimo/specs/geronimo-jms_1.1_spec/1.1.1/geronimo-jms_1.1_spec-1.1.1.pom
Downloading: http://repo.fusesource.com/nexus/content/groups/public/org/apache/geronimo/specs/geronimo-jms_1.1_spec/1.1.1/geronimo-jms_1.1_spec-1.1.1.pom
Downloading: http://repo1.maven.org/maven2/org/apache/geronimo/specs/geronimo-jms_1.1_spec/1.1.1/geronimo-jms_1.1_spec-1.1.1.pom
Downloaded: http://repo1.maven.org/maven2/org/apache/geronimo/specs/geronimo-jms_1.1_spec/1.1.1/geronimo-jms_1.1_spec-1.1.1.pom
(3 KB at 33.6 KB/sec)
Downloading: http://download.oracle.com/maven/org/apache/geronimo/specs/specs/1.4/specs-1.4.pom
Downloading: http://repo.fusesource.com/nexus/content/groups/public/org/apache/geronimo/specs/specs/1.4/specs-1.4.pom
Downloading: http://repo1.maven.org/maven2/org/apache/geronimo/specs/specs/1.4/specs-1.4.pom
Downloaded: http://repo1.maven.org/maven2/org/apache/geronimo/specs/specs/1.4/specs-1.4.pom
(12 KB at 239.1 KB/sec)
Downloading: http://download.oracle.com/maven/org/apache/geronimo/genesis/config/project-config/1.2/project-config-1.2.pom
Downloading: http://repo.fusesource.com/nexus/content/groups/public/org/apache/geronimo/genesis/config/project-config/1.2/project-config-1.2.pom
Downloading: http://repo1.maven.org/maven2/org/apache/geronimo/genesis/config/project-config/1.2/project-config-1.2.pom
Downloaded: http://repo1.maven.org/maven2/org/apache/geronimo/genesis/config/project-config/1.2/project-config-1.2.pom
(22 KB at 291.5 KB/sec)
Downloading: http://download.oracle.com/maven/org/apache/geronimo/genesis/config/config/1.2/config-1.2.pom
Downloading: http://repo.fusesource.com/nexus/content/groups/public/org/apache/geronimo/genesis/config/config/1.2/config-1.2.pom
Downloading: http://repo1.maven.org/maven2/org/apache/geronimo/genesis/config/config/1.2/config-1.2.pom
Downloaded: http://repo1.maven.org/maven2/org/apache/geronimo/genesis/config/config/1.2/config-1.2.pom
(2 KB at 34.7 KB/sec)
Downloading: http://download.oracle.com/maven/org/apache/geronimo/genesis/genesis/1.2/genesis-1.2.pom
Downloading: http://repo.fusesource.com/nexus/content/groups/public/org/apache/geronimo/genesis/genesis/1.2/genesis-1.2.pom
Downloading: http://repo1.maven.org/maven2/org/apache/geronimo/genesis/genesis/1.2/genesis-1.2.pom
Downloaded: http://repo1.maven.org/maven2/org/apache/geronimo/genesis/genesis/1.2/genesis-1.2.pom
(11 KB at 204.5 KB/sec)
Downloading: http://download.oracle.com/maven/org/slf4j/slf4j-api/1.6.1/slf4j-api-1.6.1.pom
Downloading: http://repo.fusesource.com/nexus/content/groups/public/org/slf4j/slf4j-api/1.6.1/slf4j-api-1.6.1.pom
Downloading: http://repo1.maven.org/maven2/org/slf4j/slf4j-api/1.6.1/slf4j-api-1.6.1.pom
Downloaded: http://repo1.maven.org/maven2/org/slf4j/slf4j-api/1.6.1/slf4j-api-1.6.1.pom (3
KB at 59.7 KB/sec)
Downloading: http://download.oracle.com/maven/org/slf4j/slf4j-parent/1.6.1/slf4j-parent-1.6.1.pom
Downloading: http://repo.fusesource.com/nexus/content/groups/public/org/slf4j/slf4j-parent/1.6.1/slf4j-parent-1.6.1.pom
Downloading: http://repo1.maven.org/maven2/org/slf4j/slf4j-parent/1.6.1/slf4j-parent-1.6.1.pom
Downloaded: http://repo1.maven.org/maven2/org/slf4j/slf4j-parent/1.6.1/slf4j-parent-1.6.1.pom
(10 KB at 185.8 KB/sec)
Downloading: http://download.oracle.com/maven/net/java/dev/jna/jna/3.4.0/jna-3.4.0.pom
Downloading: http://repo.fusesource.com/nexus/content/groups/public/net/java/dev/jna/jna/3.4.0/jna-3.4.0.pom
Downloading: http://repo1.maven.org/maven2/net/java/dev/jna/jna/3.4.0/jna-3.4.0.pom
Downloaded: http://repo1.maven.org/maven2/net/java/dev/jna/jna/3.4.0/jna-3.4.0.pom (3 KB at
18.2 KB/sec)
Downloading: http://download.oracle.com/maven/org/yaml/snakeyaml/1.7/snakeyaml-1.7.pom
Downloading: http://repo.fusesource.com/nexus/content/groups/public/org/yaml/snakeyaml/1.7/snakeyaml-1.7.pom
Downloading: http://repo1.maven.org/maven2/org/yaml/snakeyaml/1.7/snakeyaml-1.7.pom
Downloaded: http://repo1.maven.org/maven2/org/yaml/snakeyaml/1.7/snakeyaml-1.7.pom (12 KB
at 150.0 KB/sec)
Downloading: http://download.oracle.com/maven/org/osgi/org.osgi.core/4.2.0/org.osgi.core-4.2.0.pom
Downloading: http://repo.fusesource.com/nexus/content/groups/public/org/osgi/org.osgi.core/4.2.0/org.osgi.core-4.2.0.pom
Downloading: http://repo1.maven.org/maven2/org/osgi/org.osgi.core/4.2.0/org.osgi.core-4.2.0.pom
Downloaded: http://repo1.maven.org/maven2/org/osgi/org.osgi.core/4.2.0/org.osgi.core-4.2.0.pom
(457 B at 9.1 KB/sec)
Downloading: http://download.oracle.com/maven/org/scalatest/scalatest_2.10.0/1.8/scalatest_2.10.0-1.8.pom
Downloading: http://repo.fusesource.com/nexus/content/groups/public/org/scalatest/scalatest_2.10.0/1.8/scalatest_2.10.0-1.8.pom
Downloading: http://repo1.maven.org/maven2/org/scalatest/scalatest_2.10.0/1.8/scalatest_2.10.0-1.8.pom
Downloaded: http://repo1.maven.org/maven2/org/scalatest/scalatest_2.10.0/1.8/scalatest_2.10.0-1.8.pom
(5 KB at 13.5 KB/sec)
Downloading: http://download.oracle.com/maven/org/sonatype/oss/oss-parent/7/oss-parent-7.pom
Downloading: http://repo.fusesource.com/nexus/content/groups/public/org/sonatype/oss/oss-parent/7/oss-parent-7.pom
Downloading: http://repo1.maven.org/maven2/org/sonatype/oss/oss-parent/7/oss-parent-7.pom
Downloaded: http://repo1.maven.org/maven2/org/sonatype/oss/oss-parent/7/oss-parent-7.pom (5
KB at 94.2 KB/sec)
Downloading: http://download.oracle.com/maven/org/scala-lang/scala-actors/2.10.0/scala-actors-2.10.0.pom
Downloading: http://repo.fusesource.com/nexus/content/groups/public/org/scala-lang/scala-actors/2.10.0/scala-actors-2.10.0.pom
Downloading: http://repo1.maven.org/maven2/org/scala-lang/scala-actors/2.10.0/scala-actors-2.10.0.pom
Downloaded: http://repo1.maven.org/maven2/org/scala-lang/scala-actors/2.10.0/scala-actors-2.10.0.pom
(2 KB at 36.2 KB/sec)
Downloading: http://download.oracle.com/maven/org/scala-lang/scala-reflect/2.10.0/scala-reflect-2.10.0.pom
Downloading: http://repo.fusesource.com/nexus/content/groups/public/org/scala-lang/scala-reflect/2.10.0/scala-reflect-2.10.0.pom
Downloading: http://repo1.maven.org/maven2/org/scala-lang/scala-reflect/2.10.0/scala-reflect-2.10.0.pom
Downloaded: http://repo1.maven.org/maven2/org/scala-lang/scala-reflect/2.10.0/scala-reflect-2.10.0.pom
(2 KB at 36.7 KB/sec)
Downloading: http://download.oracle.com/maven/org/slf4j/slf4j-log4j12/1.6.1/slf4j-log4j12-1.6.1.pom
Downloading: http://repo.fusesource.com/nexus/content/groups/public/org/slf4j/slf4j-log4j12/1.6.1/slf4j-log4j12-1.6.1.pom
Downloading: http://repo1.maven.org/maven2/org/slf4j/slf4j-log4j12/1.6.1/slf4j-log4j12-1.6.1.pom
Downloaded: http://repo1.maven.org/maven2/org/slf4j/slf4j-log4j12/1.6.1/slf4j-log4j12-1.6.1.pom
(2 KB at 33.0 KB/sec)
Downloading: http://download.oracle.com/maven/log4j/log4j/1.2.16/log4j-1.2.16.pom
Downloading: http://repo.fusesource.com/nexus/content/groups/public/log4j/log4j/1.2.16/log4j-1.2.16.pom
Downloading: http://repo1.maven.org/maven2/log4j/log4j/1.2.16/log4j-1.2.16.pom
Downloaded: http://repo1.maven.org/maven2/log4j/log4j/1.2.16/log4j-1.2.16.pom (20 KB at 78.5
KB/sec)
Downloading: http://download.oracle.com/maven/org/fusesource/hawtbuf/hawtbuf/1.9/hawtbuf-1.9.jar
Downloading: http://download.oracle.com/maven/org/apache/geronimo/specs/geronimo-jms_1.1_spec/1.1.1/geronimo-jms_1.1_spec-1.1.1.jar
Downloading: http://download.oracle.com/maven/org/slf4j/slf4j-api/1.6.1/slf4j-api-1.6.1.jar
Downloading: http://download.oracle.com/maven/net/java/dev/jna/jna/3.4.0/jna-3.4.0.jar
Downloading: http://download.oracle.com/maven/org/yaml/snakeyaml/1.7/snakeyaml-1.7.jar
Downloading: http://download.oracle.com/maven/org/osgi/org.osgi.core/4.2.0/org.osgi.core-4.2.0.jar
Downloading: http://download.oracle.com/maven/org/scalatest/scalatest_2.10.0/1.8/scalatest_2.10.0-1.8.jar
Downloading: http://download.oracle.com/maven/org/scala-lang/scala-actors/2.10.0/scala-actors-2.10.0.jar
Downloading: http://download.oracle.com/maven/org/scala-lang/scala-reflect/2.10.0/scala-reflect-2.10.0.jar
Downloading: http://download.oracle.com/maven/org/slf4j/slf4j-log4j12/1.6.1/slf4j-log4j12-1.6.1.jar
Downloading: http://download.oracle.com/maven/log4j/log4j/1.2.16/log4j-1.2.16.jar
Downloading: http://repo.fusesource.com/nexus/content/groups/public/org/fusesource/hawtbuf/hawtbuf/1.9/hawtbuf-1.9.jar
Downloading: http://repo.fusesource.com/nexus/content/groups/public/org/apache/geronimo/specs/geronimo-jms_1.1_spec/1.1.1/geronimo-jms_1.1_spec-1.1.1.jar
Downloading: http://repo.fusesource.com/nexus/content/groups/public/org/slf4j/slf4j-api/1.6.1/slf4j-api-1.6.1.jar
Downloading: http://repo.fusesource.com/nexus/content/groups/public/net/java/dev/jna/jna/3.4.0/jna-3.4.0.jar
Downloading: http://repo.fusesource.com/nexus/content/groups/public/org/yaml/snakeyaml/1.7/snakeyaml-1.7.jar
Downloading: http://repo.fusesource.com/nexus/content/groups/public/org/osgi/org.osgi.core/4.2.0/org.osgi.core-4.2.0.jar
Downloading: http://repo.fusesource.com/nexus/content/groups/public/org/scalatest/scalatest_2.10.0/1.8/scalatest_2.10.0-1.8.jar
Downloading: http://repo.fusesource.com/nexus/content/groups/public/org/scala-lang/scala-actors/2.10.0/scala-actors-2.10.0.jar
Downloading: http://repo.fusesource.com/nexus/content/groups/public/org/scala-lang/scala-reflect/2.10.0/scala-reflect-2.10.0.jar
Downloading: http://repo.fusesource.com/nexus/content/groups/public/org/slf4j/slf4j-log4j12/1.6.1/slf4j-log4j12-1.6.1.jar
Downloading: http://repo.fusesource.com/nexus/content/groups/public/log4j/log4j/1.2.16/log4j-1.2.16.jar
Downloaded: http://repo.fusesource.com/nexus/content/groups/public/org/fusesource/hawtbuf/hawtbuf/1.9/hawtbuf-1.9.jar
(49 KB at 40.9 KB/sec)
Downloading: http://repo1.maven.org/maven2/org/apache/geronimo/specs/geronimo-jms_1.1_spec/1.1.1/geronimo-jms_1.1_spec-1.1.1.jar
Downloading: http://repo1.maven.org/maven2/org/slf4j/slf4j-api/1.6.1/slf4j-api-1.6.1.jar
Downloading: http://repo1.maven.org/maven2/net/java/dev/jna/jna/3.4.0/jna-3.4.0.jar
Downloading: http://repo1.maven.org/maven2/org/yaml/snakeyaml/1.7/snakeyaml-1.7.jar
Downloading: http://repo1.maven.org/maven2/org/osgi/org.osgi.core/4.2.0/org.osgi.core-4.2.0.jar
Downloaded: http://repo1.maven.org/maven2/org/apache/geronimo/specs/geronimo-jms_1.1_spec/1.1.1/geronimo-jms_1.1_spec-1.1.1.jar
(32 KB at 319.2 KB/sec)
Downloading: http://repo1.maven.org/maven2/org/scalatest/scalatest_2.10.0/1.8/scalatest_2.10.0-1.8.jar
Downloaded: http://repo1.maven.org/maven2/org/slf4j/slf4j-api/1.6.1/slf4j-api-1.6.1.jar (25
KB at 239.4 KB/sec)
Downloading: http://repo1.maven.org/maven2/org/scala-lang/scala-actors/2.10.0/scala-actors-2.10.0.jar
Downloaded: http://repo1.maven.org/maven2/org/osgi/org.osgi.core/4.2.0/org.osgi.core-4.2.0.jar
(242 KB at 814.7 KB/sec)
Downloading: http://repo1.maven.org/maven2/org/scala-lang/scala-reflect/2.10.0/scala-reflect-2.10.0.jar
Downloaded: http://repo1.maven.org/maven2/org/yaml/snakeyaml/1.7/snakeyaml-1.7.jar (248 KB
at 695.2 KB/sec)
Downloading: http://repo1.maven.org/maven2/org/slf4j/slf4j-log4j12/1.6.1/slf4j-log4j12-1.6.1.jar
Downloaded: http://repo1.maven.org/maven2/org/slf4j/slf4j-log4j12/1.6.1/slf4j-log4j12-1.6.1.jar
(10 KB at 194.4 KB/sec)
Downloading: http://repo1.maven.org/maven2/log4j/log4j/1.2.16/log4j-1.2.16.jar
Downloaded: http://repo1.maven.org/maven2/org/scala-lang/scala-actors/2.10.0/scala-actors-2.10.0.jar
(441 KB at 1227.7 KB/sec)
Downloaded: http://repo1.maven.org/maven2/net/java/dev/jna/jna/3.4.0/jna-3.4.0.jar (986 KB
at 1771.7 KB/sec)
Downloaded: http://repo1.maven.org/maven2/log4j/log4j/1.2.16/log4j-1.2.16.jar (471 KB at 1967.6
KB/sec)
Downloaded: http://repo1.maven.org/maven2/org/scala-lang/scala-reflect/2.10.0/scala-reflect-2.10.0.jar
(3076 KB at 5160.3 KB/sec)
Downloaded: http://repo1.maven.org/maven2/org/scalatest/scalatest_2.10.0/1.8/scalatest_2.10.0-1.8.jar
(3035 KB at 3065.5 KB/sec)
Downloading: http://repo.fusesource.com/nexus/content/groups/public-snapshots/org/fusesource/hawtdispatch/hawtdispatch-scala/1.14-SNAPSHOT/hawtdispatch-scala-1.14-20130403.141315-2.jar
Downloading: http://repo.fusesource.com/nexus/content/groups/public-snapshots/org/fusesource/hawtdispatch/hawtdispatch/1.14-SNAPSHOT/hawtdispatch-1.14-20130404.051653-6.jar
Downloaded: http://repo.fusesource.com/nexus/content/groups/public-snapshots/org/fusesource/hawtdispatch/hawtdispatch-scala/1.14-SNAPSHOT/hawtdispatch-scala-1.14-20130403.141315-2.jar
(135 KB at 89.9 KB/sec)
Downloaded: http://repo.fusesource.com/nexus/content/groups/public-snapshots/org/fusesource/hawtdispatch/hawtdispatch/1.14-SNAPSHOT/hawtdispatch-1.14-20130404.051653-6.jar
(107 KB at 70.9 KB/sec)
[INFO] 
[INFO] --- maven-clean-plugin:2.4.1:clean (default-clean) @ apollo-util ---
[INFO] 
[INFO] --- maven-enforcer-plugin:1.0:enforce (default) @ apollo-util ---
[INFO] 
[INFO] --- maven-remote-resources-plugin:1.1:process (default) @ apollo-util ---
[INFO] Using 'UTF-8' encoding to copy filtered resources.
[INFO] skip non existing resourceDirectory <https://builds.apache.org/job/ActiveMQ-Apollo-Deploy/org.apache.activemq$apollo-util/ws/target/schema>
[INFO] [INFO] Copying 0 resource
[INFO] Copying 3 resources

[INFO] --- maven-resources-plugin:2.4.3:resources (default-resources) @ apollo-util ---
[INFO] Add Source directory: /x1/jenkins/jenkins-slave/workspace/ActiveMQ-Apollo-Deploy/trunk/apollo-util/src/main/scala
[INFO] [INFO] Add Test Source directory: /x1/jenkins/jenkins-slave/workspace/ActiveMQ-Apollo-Deploy/trunk/apollo-util/dontcompile

[INFO] --- scala-maven-plugin:3.1.0:add-source (compile) @ apollo-util ---
[INFO] 
[INFO] --- scala-maven-plugin:3.1.0:compile (compile) @ apollo-util ---
[INFO] /x1/jenkins/jenkins-slave/workspace/ActiveMQ-Apollo-Deploy/trunk/apollo-util/src/main/scala:-1:
info: compiling
[INFO] Compiling 99 source files to /x1/jenkins/jenkins-slave/workspace/ActiveMQ-Apollo-Deploy/trunk/apollo-util/target/classes
at 1365058780045
Downloading: http://download.oracle.com/maven/org/scala-lang/scala-compiler/2.10.0/scala-compiler-2.10.0.jar
Downloading: http://repo.fusesource.com/nexus/content/groups/public/org/scala-lang/scala-compiler/2.10.0/scala-compiler-2.10.0.jar
Downloading: http://repo1.maven.org/maven2/org/scala-lang/scala-compiler/2.10.0/scala-compiler-2.10.0.jar
Downloaded: http://repo1.maven.org/maven2/org/scala-lang/scala-compiler/2.10.0/scala-compiler-2.10.0.jar
(13818 KB at 7032.0 KB/sec)
Downloading: http://download.oracle.com/maven/org/scala-lang/scala-compiler/2.10.0/scala-compiler-2.10.0.pom
Downloading: http://repo.fusesource.com/nexus/content/groups/public/org/scala-lang/scala-compiler/2.10.0/scala-compiler-2.10.0.pom
Downloading: http://repo1.maven.org/maven2/org/scala-lang/scala-compiler/2.10.0/scala-compiler-2.10.0.pom
Downloaded: http://repo1.maven.org/maven2/org/scala-lang/scala-compiler/2.10.0/scala-compiler-2.10.0.pom
(3 KB at 39.0 KB/sec)
[INFO] compiler plugin: BasicArtifact(org.fusesource.jvmassert,jvmassert,1.4,null)
Downloading: http://download.oracle.com/maven/org/fusesource/jvmassert/jvmassert/1.4/jvmassert-1.4.jar
Downloading: http://repo.fusesource.com/nexus/content/groups/public/org/fusesource/jvmassert/jvmassert/1.4/jvmassert-1.4.jar
Downloaded: http://repo.fusesource.com/nexus/content/groups/public/org/fusesource/jvmassert/jvmassert/1.4/jvmassert-1.4.jar
(26 KB at 18.8 KB/sec)
[WARNING] /x1/jenkins/jenkins-slave/workspace/ActiveMQ-Apollo-Deploy/trunk/apollo-util/src/main/scala/org/apache/activemq/apollo/util/Scala2JavaHelper.scala:19:
warning: imported `Log' is permanently hidden by definition of object Log in package util
[WARNING] import org.apache.activemq.apollo.util.Log
[WARNING]                                        ^
[WARNING] one warning found
[INFO] prepare-compile in 0 s
[INFO] compile in 18 s
[INFO] 
[INFO] --- maven-compiler-plugin:2.3.2:compile (default-compile) @ apollo-util ---
[INFO] Compiling 132 source files to <https://builds.apache.org/job/ActiveMQ-Apollo-Deploy/org.apache.activemq$apollo-util/ws/target/classes>
[INFO] -------------------------------------------------------------
[ERROR] COMPILATION ERROR : 
[INFO] -------------------------------------------------------------
[ERROR] <https://builds.apache.org/job/ActiveMQ-Apollo-Deploy/org.apache.activemq$apollo-util/ws/src/main/scala/org/apache/activemq/apollo/util/tar/TarOutputStream.java>:[36,7]
duplicate class: org.apache.activemq.apollo.util.tar.TarOutputStream
[ERROR] /x1/jenkins/jenkins-slave/workspace/ActiveMQ-Apollo-Deploy/trunk/apollo-util/src/main/scala/org/apache/activemq/apollo/util/tar/TarConstants.java:[31,7]
duplicate class: org.apache.activemq.apollo.util.tar.TarConstants
[ERROR] /x1/jenkins/jenkins-slave/workspace/ActiveMQ-Apollo-Deploy/trunk/apollo-util/src/main/scala/org/apache/activemq/apollo/util/cli/CommandLineSupport.java:[30,7]
duplicate class: org.apache.activemq.apollo.util.cli.CommandLineSupport
[ERROR] <https://builds.apache.org/job/ActiveMQ-Apollo-Deploy/org.apache.activemq$apollo-util/ws/src/main/scala/org/apache/activemq/apollo/util/Callback.java>:[27,7]
duplicate class: org.apache.activemq.apollo.util.Callback
[ERROR] /x1/jenkins/jenkins-slave/workspace/ActiveMQ-Apollo-Deploy/trunk/apollo-util/src/main/scala/org/apache/activemq/apollo/util/tar/TarEntry.java:[79,7]
duplicate class: org.apache.activemq.apollo.util.tar.TarEntry
[ERROR] <https://builds.apache.org/job/ActiveMQ-Apollo-Deploy/org.apache.activemq$apollo-util/ws/src/main/scala/org/apache/activemq/apollo/util/IntSequenceGenerator.java>:[19,7]
duplicate class: org.apache.activemq.apollo.util.IntSequenceGenerator
[ERROR] <https://builds.apache.org/job/ActiveMQ-Apollo-Deploy/org.apache.activemq$apollo-util/ws/src/main/scala/org/apache/activemq/apollo/util/IntrospectionSupport.java>:[34,13]
duplicate class: org.apache.activemq.apollo.util.IntrospectionSupport
[ERROR] <https://builds.apache.org/job/ActiveMQ-Apollo-Deploy/org.apache.activemq$apollo-util/ws/src/main/scala/org/apache/activemq/apollo/util/URIEditor.java>:[22,7]
duplicate class: org.apache.activemq.apollo.util.URIEditor
[ERROR] <https://builds.apache.org/job/ActiveMQ-Apollo-Deploy/org.apache.activemq$apollo-util/ws/src/main/scala/org/apache/activemq/apollo/util/list/SortedLinkedList.java>:[25,7]
duplicate class: org.apache.activemq.apollo.util.list.SortedLinkedList
[ERROR] <https://builds.apache.org/job/ActiveMQ-Apollo-Deploy/org.apache.activemq$apollo-util/ws/src/main/scala/org/apache/activemq/apollo/util/os/CLibrary.java>:[19,7]
duplicate class: org.apache.activemq.apollo.util.os.CLibrary
[ERROR] <https://builds.apache.org/job/ActiveMQ-Apollo-Deploy/org.apache.activemq$apollo-util/ws/src/main/scala/org/apache/activemq/apollo/util/tar/TarInputStream.java>:[38,7]
duplicate class: org.apache.activemq.apollo.util.tar.TarInputStream
[ERROR] /x1/jenkins/jenkins-slave/workspace/ActiveMQ-Apollo-Deploy/trunk/apollo-util/src/main/scala/org/apache/activemq/apollo/util/os/Kernel32JnaLibrary.java:[29,7]
duplicate class: org.apache.activemq.apollo.util.os.Kernel32JnaLibrary
[ERROR] /x1/jenkins/jenkins-slave/workspace/ActiveMQ-Apollo-Deploy/trunk/apollo-util/src/main/scala/org/apache/activemq/apollo/util/os/JnaCLibrary.java:[22,7]
duplicate class: org.apache.activemq.apollo.util.os.JnaCLibrary
[ERROR] <https://builds.apache.org/job/ActiveMQ-Apollo-Deploy/org.apache.activemq$apollo-util/ws/src/main/scala/org/apache/activemq/apollo/util/Service.java>:[27,7]
duplicate class: org.apache.activemq.apollo.util.Service
[ERROR] <https://builds.apache.org/job/ActiveMQ-Apollo-Deploy/org.apache.activemq$apollo-util/ws/src/main/scala/org/apache/activemq/apollo/util/VoidFunction1.java>:[25,7]
duplicate class: org.apache.activemq.apollo.util.VoidFunction1
[ERROR] /x1/jenkins/jenkins-slave/workspace/ActiveMQ-Apollo-Deploy/trunk/apollo-util/src/main/scala/org/apache/activemq/apollo/util/metric/Period.java:[19,7]
duplicate class: org.apache.activemq.apollo.util.metric.Period
[ERROR] /x1/jenkins/jenkins-slave/workspace/ActiveMQ-Apollo-Deploy/trunk/apollo-util/src/main/scala/org/apache/activemq/apollo/util/IndentPrinter.java:[26,7]
duplicate class: org.apache.activemq.apollo.util.IndentPrinter
[ERROR] <https://builds.apache.org/job/ActiveMQ-Apollo-Deploy/org.apache.activemq$apollo-util/ws/src/main/scala/org/apache/activemq/apollo/util/IOHelper.java>:[29,13]
duplicate class: org.apache.activemq.apollo.util.IOHelper
[ERROR] /x1/jenkins/jenkins-slave/workspace/ActiveMQ-Apollo-Deploy/trunk/apollo-util/src/main/scala/org/apache/activemq/apollo/util/ServiceSupport.java:[33,16]
duplicate class: org.apache.activemq.apollo.util.ServiceSupport
[ERROR] <https://builds.apache.org/job/ActiveMQ-Apollo-Deploy/org.apache.activemq$apollo-util/ws/src/main/scala/org/apache/activemq/apollo/util/metric/MetricAggregator.java>:[21,7]
duplicate class: org.apache.activemq.apollo.util.metric.MetricAggregator
[ERROR] /x1/jenkins/jenkins-slave/workspace/ActiveMQ-Apollo-Deploy/trunk/apollo-util/src/main/scala/org/apache/activemq/apollo/util/ListenableFuture.java:[29,7]
duplicate class: org.apache.activemq.apollo.util.ListenableFuture
[ERROR] <https://builds.apache.org/job/ActiveMQ-Apollo-Deploy/org.apache.activemq$apollo-util/ws/src/main/scala/org/apache/activemq/apollo/util/JMXSupport.java>:[19,13]
duplicate class: org.apache.activemq.apollo.util.JMXSupport
[ERROR] <https://builds.apache.org/job/ActiveMQ-Apollo-Deploy/org.apache.activemq$apollo-util/ws/src/main/scala/org/apache/activemq/apollo/util/JMSExceptionSupport.java>:[24,13]
duplicate class: org.apache.activemq.apollo.util.JMSExceptionSupport
[ERROR] <https://builds.apache.org/job/ActiveMQ-Apollo-Deploy/org.apache.activemq$apollo-util/ws/src/main/scala/org/apache/activemq/apollo/util/Comparators.java>:[25,7]
duplicate class: org.apache.activemq.apollo.util.Comparators
[ERROR] <https://builds.apache.org/job/ActiveMQ-Apollo-Deploy/org.apache.activemq$apollo-util/ws/src/main/scala/org/apache/activemq/apollo/util/ServiceListener.java>:[24,7]
duplicate class: org.apache.activemq.apollo.util.ServiceListener
[ERROR] <https://builds.apache.org/job/ActiveMQ-Apollo-Deploy/org.apache.activemq$apollo-util/ws/src/main/scala/org/apache/activemq/apollo/util/cli/OptionBuilder.java>:[27,7]
duplicate class: org.apache.activemq.apollo.util.cli.OptionBuilder
[ERROR] /x1/jenkins/jenkins-slave/workspace/ActiveMQ-Apollo-Deploy/trunk/apollo-util/src/main/scala/org/apache/activemq/apollo/util/FutureListener.java:[29,7]
duplicate class: org.apache.activemq.apollo.util.FutureListener
[ERROR] /x1/jenkins/jenkins-slave/workspace/ActiveMQ-Apollo-Deploy/trunk/apollo-util/src/main/scala/org/apache/activemq/apollo/util/HashList.java:[25,7]
duplicate class: org.apache.activemq.apollo.util.HashList
[ERROR] /x1/jenkins/jenkins-slave/workspace/ActiveMQ-Apollo-Deploy/trunk/apollo-util/src/main/scala/org/apache/activemq/apollo/util/metric/Metric.java:[19,16]
duplicate class: org.apache.activemq.apollo.util.metric.Metric
[ERROR] <https://builds.apache.org/job/ActiveMQ-Apollo-Deploy/org.apache.activemq$apollo-util/ws/src/main/scala/org/apache/activemq/apollo/util/Hasher.java>:[39,7]
duplicate class: org.apache.activemq.apollo.util.Hasher
[ERROR] <https://builds.apache.org/job/ActiveMQ-Apollo-Deploy/org.apache.activemq$apollo-util/ws/src/main/scala/org/apache/activemq/apollo/util/StringSupport.java>:[26,7]
duplicate class: org.apache.activemq.apollo.util.StringSupport
[ERROR] /x1/jenkins/jenkins-slave/workspace/ActiveMQ-Apollo-Deploy/trunk/apollo-util/src/main/scala/org/apache/activemq/apollo/util/JavaBaseService.java:[31,16]
duplicate class: org.apache.activemq.apollo.util.JavaBaseService
[ERROR] <https://builds.apache.org/job/ActiveMQ-Apollo-Deploy/org.apache.activemq$apollo-util/ws/src/main/scala/org/apache/activemq/apollo/util/LRUCache.java>:[29,7]
duplicate class: org.apache.activemq.apollo.util.LRUCache
[ERROR] /x1/jenkins/jenkins-slave/workspace/ActiveMQ-Apollo-Deploy/trunk/apollo-util/src/main/scala/org/apache/activemq/apollo/util/URISupport.java:[33,7]
duplicate class: org.apache.activemq.apollo.util.URISupport
[ERROR] <https://builds.apache.org/job/ActiveMQ-Apollo-Deploy/org.apache.activemq$apollo-util/ws/src/main/scala/org/apache/activemq/apollo/util/tar/TarBuffer.java>:[44,7]
duplicate class: org.apache.activemq.apollo.util.tar.TarBuffer
[ERROR] <https://builds.apache.org/job/ActiveMQ-Apollo-Deploy/org.apache.activemq$apollo-util/ws/src/main/scala/org/apache/activemq/apollo/util/list/LinkedNodeList.java>:[27,7]
duplicate class: org.apache.activemq.apollo.util.list.LinkedNodeList
[ERROR] /x1/jenkins/jenkins-slave/workspace/ActiveMQ-Apollo-Deploy/trunk/apollo-util/src/main/scala/org/apache/activemq/apollo/util/PriorityMap.java:[21,7]
duplicate class: org.apache.activemq.apollo.util.PriorityMap
[ERROR] <https://builds.apache.org/job/ActiveMQ-Apollo-Deploy/org.apache.activemq$apollo-util/ws/src/main/scala/org/apache/activemq/apollo/util/LockFile.java>:[30,7]
duplicate class: org.apache.activemq.apollo.util.LockFile
[ERROR] <https://builds.apache.org/job/ActiveMQ-Apollo-Deploy/org.apache.activemq$apollo-util/ws/src/main/scala/org/apache/activemq/apollo/util/ApolloThreadPool.java>:[34,7]
duplicate class: org.apache.activemq.apollo.util.ApolloThreadPool
[ERROR] <https://builds.apache.org/job/ActiveMQ-Apollo-Deploy/org.apache.activemq$apollo-util/ws/src/main/scala/org/apache/activemq/apollo/util/tar/TarUtils.java>:[31,7]
duplicate class: org.apache.activemq.apollo.util.tar.TarUtils
[ERROR] <https://builds.apache.org/job/ActiveMQ-Apollo-Deploy/org.apache.activemq$apollo-util/ws/src/main/scala/org/apache/activemq/apollo/util/MemoryPropertyEditor.java>:[26,7]
duplicate class: org.apache.activemq.apollo.util.MemoryPropertyEditor
[ERROR] <https://builds.apache.org/job/ActiveMQ-Apollo-Deploy/org.apache.activemq$apollo-util/ws/src/main/scala/org/apache/activemq/apollo/util/IdGenerator.java>:[28,7]
duplicate class: org.apache.activemq.apollo.util.IdGenerator
[ERROR] <https://builds.apache.org/job/ActiveMQ-Apollo-Deploy/org.apache.activemq$apollo-util/ws/src/main/scala/org/apache/activemq/apollo/util/SslContext.java>:[34,7]
duplicate class: org.apache.activemq.apollo.util.SslContext
[ERROR] <https://builds.apache.org/job/ActiveMQ-Apollo-Deploy/org.apache.activemq$apollo-util/ws/src/main/scala/org/apache/activemq/apollo/util/SchedulerTimerTask.java>:[25,7]
duplicate class: org.apache.activemq.apollo.util.SchedulerTimerTask
[ERROR] <https://builds.apache.org/job/ActiveMQ-Apollo-Deploy/org.apache.activemq$apollo-util/ws/src/main/scala/org/apache/activemq/apollo/util/IOExceptionSupport.java>:[21,13]
duplicate class: org.apache.activemq.apollo.util.IOExceptionSupport
[ERROR] <https://builds.apache.org/job/ActiveMQ-Apollo-Deploy/org.apache.activemq$apollo-util/ws/src/main/scala/org/apache/activemq/apollo/util/cli/CommonsCLISupport.java>:[27,7]
duplicate class: org.apache.activemq.apollo.util.cli.CommonsCLISupport
[ERROR] /x1/jenkins/jenkins-slave/workspace/ActiveMQ-Apollo-Deploy/trunk/apollo-util/src/main/scala/org/apache/activemq/apollo/util/Scheduler.java:[25,13]
duplicate class: org.apache.activemq.apollo.util.Scheduler
[ERROR] /x1/jenkins/jenkins-slave/workspace/ActiveMQ-Apollo-Deploy/trunk/apollo-util/src/main/scala/org/apache/activemq/apollo/util/list/LinkedNode.java:[25,7]
duplicate class: org.apache.activemq.apollo.util.list.LinkedNode
[ERROR] <https://builds.apache.org/job/ActiveMQ-Apollo-Deploy/org.apache.activemq$apollo-util/ws/src/main/scala/org/apache/activemq/apollo/util/os/Kernel32Library.java>:[25,7]
duplicate class: org.apache.activemq.apollo.util.os.Kernel32Library
[ERROR] /x1/jenkins/jenkins-slave/workspace/ActiveMQ-Apollo-Deploy/trunk/apollo-util/src/main/scala/org/apache/activemq/apollo/util/ClassLoadingAwareObjectInputStream.java:[26,7]
duplicate class: org.apache.activemq.apollo.util.ClassLoadingAwareObjectInputStream
[ERROR] /x1/jenkins/jenkins-slave/workspace/ActiveMQ-Apollo-Deploy/trunk/apollo-util/src/main/scala/org/apache/activemq/apollo/util/list/Sequence.java:[25,7]
duplicate class: org.apache.activemq.apollo.util.list.Sequence
[ERROR] /x1/jenkins/jenkins-slave/workspace/ActiveMQ-Apollo-Deploy/trunk/apollo-util/src/main/scala/org/apache/activemq/apollo/util/list/SortedLinkedListNode.java:[19,16]
duplicate class: org.apache.activemq.apollo.util.list.SortedLinkedListNode
[ERROR] /x1/jenkins/jenkins-slave/workspace/ActiveMQ-Apollo-Deploy/trunk/apollo-util/src/main/scala/org/apache/activemq/apollo/util/Combinator.java:[41,7]
duplicate class: org.apache.activemq.apollo.util.Combinator
[ERROR] /x1/jenkins/jenkins-slave/workspace/ActiveMQ-Apollo-Deploy/trunk/apollo-util/src/main/scala/org/apache/activemq/apollo/util/BooleanEditor.java:[21,7]
duplicate class: org.apache.activemq.apollo.util.BooleanEditor
[ERROR] <https://builds.apache.org/job/ActiveMQ-Apollo-Deploy/org.apache.activemq$apollo-util/ws/src/main/scala/org/apache/activemq/apollo/util/HashRing.java>:[48,7]
duplicate class: org.apache.activemq.apollo.util.HashRing
[ERROR] <https://builds.apache.org/job/ActiveMQ-Apollo-Deploy/org.apache.activemq$apollo-util/ws/src/main/scala/org/apache/activemq/apollo/util/list/SequenceSet.java>:[35,7]
duplicate class: org.apache.activemq.apollo.util.list.SequenceSet
[ERROR] <https://builds.apache.org/job/ActiveMQ-Apollo-Deploy/org.apache.activemq$apollo-util/ws/src/main/scala/org/apache/activemq/apollo/util/metric/MetricCounter.java>:[21,7]
duplicate class: org.apache.activemq.apollo.util.metric.MetricCounter
[ERROR] <https://builds.apache.org/job/ActiveMQ-Apollo-Deploy/org.apache.activemq$apollo-util/ws/src/main/scala/org/apache/activemq/apollo/util/PriorityLinkedList.java>:[24,7]
duplicate class: org.apache.activemq.apollo.util.PriorityLinkedList
[ERROR] /x1/jenkins/jenkins-slave/workspace/ActiveMQ-Apollo-Deploy/trunk/apollo-util/src/main/scala/org/apache/activemq/apollo/util/Scala2Java.java:[36,7]
duplicate class: org.apache.activemq.apollo.util.Scala2Java
[ERROR] <https://builds.apache.org/job/ActiveMQ-Apollo-Deploy/org.apache.activemq$apollo-util/ws/src/main/scala/org/apache/activemq/apollo/util/TimerHeap.java>:[23,16]
duplicate class: org.apache.activemq.apollo.util.TimerHeap
[ERROR] /x1/jenkins/jenkins-slave/workspace/ActiveMQ-Apollo-Deploy/trunk/apollo-util/src/main/scala/org/apache/activemq/apollo/util/ServiceStopper.java:[31,7]
duplicate class: org.apache.activemq.apollo.util.ServiceStopper
[ERROR] <https://builds.apache.org/job/ActiveMQ-Apollo-Deploy/org.apache.activemq$apollo-util/ws/src/main/scala/org/apache/activemq/apollo/util/TreeMap.java>:[35,7]
duplicate class: org.apache.activemq.apollo.util.TreeMap
[ERROR] /x1/jenkins/jenkins-slave/workspace/ActiveMQ-Apollo-Deploy/trunk/apollo-util/src/main/scala/org/apache/activemq/apollo/util/BitArrayBin.java:[26,7]
duplicate class: org.apache.activemq.apollo.util.BitArrayBin
[ERROR] <https://builds.apache.org/job/ActiveMQ-Apollo-Deploy/org.apache.activemq$apollo-util/ws/src/main/scala/org/apache/activemq/apollo/util/LongSequenceGenerator.java>:[19,7]
duplicate class: org.apache.activemq.apollo.util.LongSequenceGenerator
[ERROR] /x1/jenkins/jenkins-slave/workspace/ActiveMQ-Apollo-Deploy/trunk/apollo-util/src/main/scala/org/apache/activemq/apollo/util/BitArray.java:[30,7]
duplicate class: org.apache.activemq.apollo.util.BitArray
[ERROR] /x1/jenkins/jenkins-slave/workspace/ActiveMQ-Apollo-Deploy/trunk/apollo-util/src/main/scala/org/apache/activemq/apollo/util/Mapper.java:[19,7]
duplicate class: org.apache.activemq.apollo.util.Mapper
[INFO] 66 errors 
[INFO] -------------------------------------------------------------

Mime
View raw message