activemq-commits mailing list archives

Site index · List index
Message view « Date » · « Thread »
Top « Date » · « Thread »
From Apache Jenkins Server <jenk...@builds.apache.org>
Subject Build failed in Jenkins: ActiveMQ-Apollo-Deploy #388
Date Thu, 04 Apr 2013 07:01:59 GMT
See <https://builds.apache.org/job/ActiveMQ-Apollo-Deploy/388/changes>

Changes:

[chirino] Removing Option from some interfaces to further reduce dependency on scala.

[chirino] protect against APLO-315: Added a test case and protection against 'evil' clients
that send many request /w receipt frames but that don't read their sockets for responses.

[chirino] Switch to the development version of hawtdispatch.

[chirino] Enhancing the wait_for_receipt test function.

------------------------------------------
[...truncated 3961 lines...]
Downloaded: http://repo.fusesource.com/nexus/content/groups/public/commons-logging/commons-logging/1.1/commons-logging-1.1.jar
(52 KB at 55.3 KB/sec)
Downloading: http://repo1.maven.org/maven2/rhino/js/1.7R2/js-1.7R2.jar
Downloading: http://repo1.maven.org/maven2/junit/junit/4.8.2/junit-4.8.2.jar
Downloading: http://repo1.maven.org/maven2/org/seleniumhq/selenium/selenium-htmlunit-driver/2.0a5/selenium-htmlunit-driver-2.0a5.jar
Downloading: http://repo1.maven.org/maven2/org/seleniumhq/selenium/selenium-common/2.0a5/selenium-common-2.0a5.jar
Downloading: http://repo1.maven.org/maven2/net/sourceforge/htmlunit/htmlunit/2.7/htmlunit-2.7.jar
Downloaded: http://repo1.maven.org/maven2/junit/junit/4.8.2/junit-4.8.2.jar (232 KB at 285.1
KB/sec)
Downloading: http://repo1.maven.org/maven2/xalan/xalan/2.7.1/xalan-2.7.1.jar
Downloaded: http://repo1.maven.org/maven2/org/seleniumhq/selenium/selenium-htmlunit-driver/2.0a5/selenium-htmlunit-driver-2.0a5.jar
(34 KB at 35.0 KB/sec)
Downloading: http://repo1.maven.org/maven2/xalan/serializer/2.7.1/serializer-2.7.1.jar
Downloaded: http://repo1.maven.org/maven2/rhino/js/1.7R2/js-1.7R2.jar (851 KB at 850.0 KB/sec)
Downloading: http://repo1.maven.org/maven2/commons-lang/commons-lang/2.4/commons-lang-2.4.jar
Downloaded: http://repo1.maven.org/maven2/net/sourceforge/htmlunit/htmlunit/2.7/htmlunit-2.7.jar
(879 KB at 834.1 KB/sec)
Downloading: http://repo1.maven.org/maven2/commons-httpclient/commons-httpclient/3.1/commons-httpclient-3.1.jar
Downloaded: http://repo1.maven.org/maven2/org/seleniumhq/selenium/selenium-common/2.0a5/selenium-common-2.0a5.jar
(114 KB at 108.0 KB/sec)
Downloading: http://repo1.maven.org/maven2/commons-codec/commons-codec/1.4/commons-codec-1.4.jar
Downloaded: http://repo1.maven.org/maven2/commons-lang/commons-lang/2.4/commons-lang-2.4.jar
(256 KB at 2663.3 KB/sec)
Downloading: http://repo1.maven.org/maven2/net/sourceforge/htmlunit/htmlunit-core-js/2.7/htmlunit-core-js-2.7.jar
Downloaded: http://repo1.maven.org/maven2/commons-codec/commons-codec/1.4/commons-codec-1.4.jar
(57 KB at 778.0 KB/sec)
Downloading: http://repo1.maven.org/maven2/net/sourceforge/nekohtml/nekohtml/1.9.14/nekohtml-1.9.14.jar
Downloaded: http://repo1.maven.org/maven2/commons-httpclient/commons-httpclient/3.1/commons-httpclient-3.1.jar
(298 KB at 3008.6 KB/sec)
Downloading: http://repo1.maven.org/maven2/net/sourceforge/cssparser/cssparser/0.9.5/cssparser-0.9.5.jar
Downloaded: http://repo1.maven.org/maven2/xalan/serializer/2.7.1/serializer-2.7.1.jar (272
KB at 1123.0 KB/sec)
Downloading: http://repo1.maven.org/maven2/org/w3c/css/sac/1.3/sac-1.3.jar
Downloaded: http://repo1.maven.org/maven2/net/sourceforge/cssparser/cssparser/0.9.5/cssparser-0.9.5.jar
(248 KB at 3179.5 KB/sec)
Downloading: http://repo1.maven.org/maven2/org/eclipse/jetty/jetty-server/7.2.1.v20101111/jetty-server-7.2.1.v20101111.jar
Downloaded: http://repo1.maven.org/maven2/org/w3c/css/sac/1.3/sac-1.3.jar (16 KB at 308.8
KB/sec)
Downloading: http://repo1.maven.org/maven2/org/eclipse/jetty/jetty-continuation/7.2.1.v20101111/jetty-continuation-7.2.1.v20101111.jar
Downloaded: http://repo1.maven.org/maven2/net/sourceforge/htmlunit/htmlunit-core-js/2.7/htmlunit-core-js-2.7.jar
(890 KB at 5111.4 KB/sec)
Downloading: http://repo1.maven.org/maven2/org/eclipse/jetty/jetty-http/7.2.1.v20101111/jetty-http-7.2.1.v20101111.jar
Downloaded: http://repo1.maven.org/maven2/net/sourceforge/nekohtml/nekohtml/1.9.14/nekohtml-1.9.14.jar
(122 KB at 749.7 KB/sec)
Downloading: http://repo1.maven.org/maven2/org/eclipse/jetty/jetty-io/7.2.1.v20101111/jetty-io-7.2.1.v20101111.jar
Downloaded: http://repo1.maven.org/maven2/org/eclipse/jetty/jetty-continuation/7.2.1.v20101111/jetty-continuation-7.2.1.v20101111.jar
(20 KB at 385.2 KB/sec)
Downloading: http://repo1.maven.org/maven2/org/eclipse/jetty/jetty-webapp/7.2.1.v20101111/jetty-webapp-7.2.1.v20101111.jar
Downloaded: http://repo1.maven.org/maven2/org/eclipse/jetty/jetty-http/7.2.1.v20101111/jetty-http-7.2.1.v20101111.jar
(97 KB at 1859.4 KB/sec)
Downloading: http://repo1.maven.org/maven2/org/eclipse/jetty/jetty-xml/7.2.1.v20101111/jetty-xml-7.2.1.v20101111.jar
Downloaded: http://repo1.maven.org/maven2/org/eclipse/jetty/jetty-io/7.2.1.v20101111/jetty-io-7.2.1.v20101111.jar
(75 KB at 986.2 KB/sec)
Downloading: http://repo1.maven.org/maven2/org/eclipse/jetty/jetty-servlet/7.2.1.v20101111/jetty-servlet-7.2.1.v20101111.jar
Downloaded: http://repo1.maven.org/maven2/xalan/xalan/2.7.1/xalan-2.7.1.jar (3102 KB at 5143.8
KB/sec)
Downloading: http://repo1.maven.org/maven2/org/eclipse/jetty/jetty-security/7.2.1.v20101111/jetty-security-7.2.1.v20101111.jar
Downloaded: http://repo1.maven.org/maven2/org/eclipse/jetty/jetty-servlet/7.2.1.v20101111/jetty-servlet-7.2.1.v20101111.jar
(77 KB at 1015.5 KB/sec)
Downloading: http://repo1.maven.org/maven2/org/eclipse/jetty/jetty-util/7.2.1.v20101111/jetty-util-7.2.1.v20101111.jar
Downloaded: http://repo1.maven.org/maven2/org/eclipse/jetty/jetty-server/7.2.1.v20101111/jetty-server-7.2.1.v20101111.jar
(275 KB at 1182.2 KB/sec)
Downloaded: http://repo1.maven.org/maven2/org/eclipse/jetty/jetty-security/7.2.1.v20101111/jetty-security-7.2.1.v20101111.jar
(75 KB at 415.9 KB/sec)
Downloaded: http://repo1.maven.org/maven2/org/eclipse/jetty/jetty-util/7.2.1.v20101111/jetty-util-7.2.1.v20101111.jar
(192 KB at 705.6 KB/sec)
Downloaded: http://repo1.maven.org/maven2/org/eclipse/jetty/jetty-xml/7.2.1.v20101111/jetty-xml-7.2.1.v20101111.jar
(29 KB at 65.6 KB/sec)
Downloaded: http://repo1.maven.org/maven2/org/eclipse/jetty/jetty-webapp/7.2.1.v20101111/jetty-webapp-7.2.1.v20101111.jar
(90 KB at 160.5 KB/sec)
[INFO] 
[INFO] --- maven-clean-plugin:2.4.1:clean (default-clean) @ apollo-website ---
[INFO] 
[INFO] --- maven-enforcer-plugin:1.0:enforce (default) @ apollo-website ---
[INFO] 
[INFO] Downloading: http://repo1.maven.org/maven2/org/apache/maven/maven-plugin-api/2.0.11/maven-plugin-api-2.0.11.pom
--- maven-antrun-plugin:1.7:run (default) @ apollo-website ---
Downloaded: http://repo1.maven.org/maven2/org/apache/maven/maven-plugin-api/2.0.11/maven-plugin-api-2.0.11.pom
(2 KB at 28.6 KB/sec)
Downloading: http://repo1.maven.org/maven2/org/apache/maven/maven/2.0.11/maven-2.0.11.pom
Downloaded: http://repo1.maven.org/maven2/org/apache/maven/maven/2.0.11/maven-2.0.11.pom (22
KB at 418.1 KB/sec)
Downloading: http://repo1.maven.org/maven2/org/apache/maven/maven-parent/12/maven-parent-12.pom
Downloaded: http://repo1.maven.org/maven2/org/apache/maven/maven-parent/12/maven-parent-12.pom
(22 KB at 424.6 KB/sec)
Downloading: http://repo1.maven.org/maven2/org/apache/maven/maven-project/2.0.11/maven-project-2.0.11.pom
Downloaded: http://repo1.maven.org/maven2/org/apache/maven/maven-project/2.0.11/maven-project-2.0.11.pom
(3 KB at 16.4 KB/sec)
Downloading: http://repo1.maven.org/maven2/org/apache/maven/maven-settings/2.0.11/maven-settings-2.0.11.pom
Downloaded: http://repo1.maven.org/maven2/org/apache/maven/maven-settings/2.0.11/maven-settings-2.0.11.pom
(3 KB at 42.6 KB/sec)
Downloading: http://repo1.maven.org/maven2/org/apache/maven/maven-model/2.0.11/maven-model-2.0.11.pom
Downloaded: http://repo1.maven.org/maven2/org/apache/maven/maven-model/2.0.11/maven-model-2.0.11.pom
(4 KB at 63.4 KB/sec)
Downloading: http://repo1.maven.org/maven2/org/codehaus/plexus/plexus-interpolation/1.1/plexus-interpolation-1.1.pom
Downloaded: http://repo1.maven.org/maven2/org/codehaus/plexus/plexus-interpolation/1.1/plexus-interpolation-1.1.pom
(2 KB at 11.0 KB/sec)
Downloading: http://repo1.maven.org/maven2/org/apache/maven/maven-profile/2.0.11/maven-profile-2.0.11.pom
Downloaded: http://repo1.maven.org/maven2/org/apache/maven/maven-profile/2.0.11/maven-profile-2.0.11.pom
(2 KB at 39.9 KB/sec)
Downloading: http://repo1.maven.org/maven2/org/apache/maven/maven-artifact-manager/2.0.11/maven-artifact-manager-2.0.11.pom
Downloaded: http://repo1.maven.org/maven2/org/apache/maven/maven-artifact-manager/2.0.11/maven-artifact-manager-2.0.11.pom
(3 KB at 51.4 KB/sec)
Downloading: http://repo1.maven.org/maven2/org/apache/maven/maven-repository-metadata/2.0.11/maven-repository-metadata-2.0.11.pom
Downloaded: http://repo1.maven.org/maven2/org/apache/maven/maven-repository-metadata/2.0.11/maven-repository-metadata-2.0.11.pom
(3 KB at 45.0 KB/sec)
Downloading: http://repo1.maven.org/maven2/org/apache/maven/maven-artifact/2.0.11/maven-artifact-2.0.11.pom
Downloaded: http://repo1.maven.org/maven2/org/apache/maven/maven-artifact/2.0.11/maven-artifact-2.0.11.pom
(2 KB at 31.0 KB/sec)
Downloading: http://repo1.maven.org/maven2/org/apache/maven/maven-plugin-registry/2.0.11/maven-plugin-registry-2.0.11.pom
Downloaded: http://repo1.maven.org/maven2/org/apache/maven/maven-plugin-registry/2.0.11/maven-plugin-registry-2.0.11.pom
(2 KB at 38.5 KB/sec)
Downloading: http://repo1.maven.org/maven2/org/apache/ant/ant/1.8.2/ant-1.8.2.pom
Downloaded: http://repo1.maven.org/maven2/org/apache/ant/ant/1.8.2/ant-1.8.2.pom (10 KB at
192.9 KB/sec)
Downloading: http://repo1.maven.org/maven2/org/apache/ant/ant-parent/1.8.2/ant-parent-1.8.2.pom
Downloaded: http://repo1.maven.org/maven2/org/apache/ant/ant-parent/1.8.2/ant-parent-1.8.2.pom
(5 KB at 91.6 KB/sec)
Downloading: http://repo1.maven.org/maven2/org/apache/ant/ant-launcher/1.8.2/ant-launcher-1.8.2.pom
Downloaded: http://repo1.maven.org/maven2/org/apache/ant/ant-launcher/1.8.2/ant-launcher-1.8.2.pom
(3 KB at 48.2 KB/sec)
Downloading: http://repo1.maven.org/maven2/org/codehaus/plexus/plexus-interpolation/1.1/plexus-interpolation-1.1.jar
Downloading: http://repo1.maven.org/maven2/org/apache/ant/ant/1.8.2/ant-1.8.2.jar
Downloading: http://repo1.maven.org/maven2/org/apache/ant/ant-launcher/1.8.2/ant-launcher-1.8.2.jar
Downloaded: http://repo1.maven.org/maven2/org/apache/ant/ant-launcher/1.8.2/ant-launcher-1.8.2.jar
(13 KB at 231.4 KB/sec)
Downloaded: http://repo1.maven.org/maven2/org/codehaus/plexus/plexus-interpolation/1.1/plexus-interpolation-1.1.jar
(35 KB at 468.2 KB/sec)
Downloaded: http://repo1.maven.org/maven2/org/apache/ant/ant/1.8.2/ant-1.8.2.jar (1889 KB
at 2626.5 KB/sec)
[WARNING] Parameter tasks is deprecated, use target instead
[INFO] Executing tasks

main:
    [mkdir] Created dir: <https://builds.apache.org/job/ActiveMQ-Apollo-Deploy/ws/trunk/apollo-website/target/sitegen/documentation/schema>
[INFO]                                                                         
[INFO] ------------------------------------------------------------------------
[INFO] Skipping apache-apollo
[INFO] This project has been banned from the build due to previous failures.
[INFO] ------------------------------------------------------------------------
[INFO] ------------------------------------------------------------------------
[INFO] Reactor Summary:
[INFO] 
[INFO] Apache ActiveMQ Apollo Project .................... SUCCESS [27.373s]
[INFO] apollo-boot ....................................... SUCCESS [11.073s]
[INFO] apollo-scala ...................................... SUCCESS [10.340s]
[INFO] apollo-util ....................................... FAILURE [49.731s]
[INFO] apollo-dto ........................................ SKIPPED
[INFO] apollo-selector ................................... SUCCESS [14.713s]
[INFO] apollo-broker ..................................... SKIPPED
[INFO] apollo-web ........................................ SKIPPED
[INFO] apollo-leveldb .................................... SKIPPED
[INFO] apollo-bdb ........................................ SKIPPED
[INFO] apollo-stomp ...................................... SKIPPED
[INFO] apollo-amqp ....................................... SKIPPED
[INFO] apollo-mqtt ....................................... SKIPPED
[INFO] apollo-openwire-generator ......................... SUCCESS [31.149s]
[INFO] apollo-openwire ................................... SKIPPED
[INFO] apollo-jmx ........................................ SKIPPED
[INFO] apollo-network .................................... SKIPPED
[INFO] apollo-cli ........................................ SKIPPED
[INFO] apollo-website .................................... FAILURE [1:01.908s]
[INFO] apache-apollo ..................................... SKIPPED
[INFO] ------------------------------------------------------------------------
[INFO] BUILD FAILURE
[INFO] ------------------------------------------------------------------------
[INFO] Total time: 3:29.496s
[INFO] Finished at: Thu Apr 04 07:01:47 UTC 2013
[INFO] Final Memory: 40M/990M
[INFO] ------------------------------------------------------------------------
[JENKINS] Archiving disabled
[JENKINS] Archiving disabled
[JENKINS] Archiving disabled
[JENKINS] Archiving disabled
[JENKINS] Archiving disabled
[JENKINS] Archiving disabled
[JENKINS] Archiving disabled
[JENKINS] Archiving disabled
[JENKINS] Archiving disabled
[JENKINS] Archiving disabled
[JENKINS] Archiving disabled
[JENKINS] Archiving disabled
[JENKINS] Archiving disabled
[JENKINS] Archiving disabled
[JENKINS] Archiving disabled
[JENKINS] Archiving disabled
[JENKINS] Archiving disabled
[JENKINS] Archiving disabled
[JENKINS] Archiving disabled
[JENKINS] Archiving disabled
Waiting for Jenkins to finish collecting data
mavenExecutionResult exceptions not empty
message : Failed to execute goal org.apache.maven.plugins:maven-compiler-plugin:2.3.2:compile
(default-compile) on project apollo-util: Compilation failure
cause : Compilation failure
Stack trace : 
org.apache.maven.lifecycle.LifecycleExecutionException: Failed to execute goal org.apache.maven.plugins:maven-compiler-plugin:2.3.2:compile
(default-compile) on project apollo-util: Compilation failure
	at org.apache.maven.lifecycle.internal.MojoExecutor.execute(MojoExecutor.java:213)
	at org.apache.maven.lifecycle.internal.MojoExecutor.execute(MojoExecutor.java:153)
	at org.apache.maven.lifecycle.internal.MojoExecutor.execute(MojoExecutor.java:145)
	at org.apache.maven.lifecycle.internal.LifecycleModuleBuilder.buildProject(LifecycleModuleBuilder.java:84)
	at org.apache.maven.lifecycle.internal.LifecycleModuleBuilder.buildProject(LifecycleModuleBuilder.java:59)
	at org.apache.maven.lifecycle.internal.LifecycleStarter.singleThreadedBuild(LifecycleStarter.java:183)
	at org.apache.maven.lifecycle.internal.LifecycleStarter.execute(LifecycleStarter.java:161)
	at org.apache.maven.DefaultMaven.doExecute(DefaultMaven.java:319)
	at org.apache.maven.DefaultMaven.execute(DefaultMaven.java:156)
	at org.jvnet.hudson.maven3.launcher.Maven3Launcher.main(Maven3Launcher.java:79)
	at sun.reflect.NativeMethodAccessorImpl.invoke0(Native Method)
	at sun.reflect.NativeMethodAccessorImpl.invoke(NativeMethodAccessorImpl.java:39)
	at sun.reflect.DelegatingMethodAccessorImpl.invoke(DelegatingMethodAccessorImpl.java:25)
	at java.lang.reflect.Method.invoke(Method.java:597)
	at org.codehaus.plexus.classworlds.launcher.Launcher.launchStandard(Launcher.java:329)
	at org.codehaus.plexus.classworlds.launcher.Launcher.launch(Launcher.java:239)
	at org.jvnet.hudson.maven3.agent.Maven3Main.launch(Maven3Main.java:158)
	at hudson.maven.Maven3Builder.call(Maven3Builder.java:100)
	at hudson.maven.Maven3Builder.call(Maven3Builder.java:66)
	at hudson.remoting.UserRequest.perform(UserRequest.java:118)
	at hudson.remoting.UserRequest.perform(UserRequest.java:48)
	at hudson.remoting.Request$2.run(Request.java:326)
	at hudson.remoting.InterceptingExecutorService$1.call(InterceptingExecutorService.java:72)
	at java.util.concurrent.FutureTask$Sync.innerRun(FutureTask.java:303)
	at java.util.concurrent.FutureTask.run(FutureTask.java:138)
	at java.util.concurrent.ThreadPoolExecutor$Worker.runTask(ThreadPoolExecutor.java:886)
	at java.util.concurrent.ThreadPoolExecutor$Worker.run(ThreadPoolExecutor.java:908)
	at java.lang.Thread.run(Thread.java:662)
Caused by: org.apache.maven.plugin.CompilationFailureException: Compilation failure
	at org.apache.maven.plugin.AbstractCompilerMojo.execute(AbstractCompilerMojo.java:656)
	at org.apache.maven.plugin.CompilerMojo.execute(CompilerMojo.java:128)
	at org.apache.maven.plugin.DefaultBuildPluginManager.executeMojo(DefaultBuildPluginManager.java:107)
	at org.apache.maven.lifecycle.internal.MojoExecutor.execute(MojoExecutor.java:209)
	... 27 more
message : Failed to execute goal org.apache.maven.plugins:maven-antrun-plugin:1.7:run (default)
on project apollo-website: An Ant BuildException has occured: Warning: Could not find file
<https://builds.apache.org/job/ActiveMQ-Apollo-Deploy/ws/trunk/apollo-dto/target/schema/org/apache/activemq/apollo/dto/apollo.xsd>
to copy.
around Ant part ...<copy file="<https://builds.apache.org/job/ActiveMQ-Apollo-Deploy/ws/trunk/apollo-website/../apollo-dto/target/schema/org/apache/activemq/apollo/dto/apollo.xsd">
tofile="<https://builds.apache.org/job/ActiveMQ-Apollo-Deploy/ws/trunk/apollo-website/target/sitegen/documentation/schema/apollo.xsd"/>...>
@ 5:307 in <https://builds.apache.org/job/ActiveMQ-Apollo-Deploy/ws/trunk/apollo-website/target/antrun/build-main.xml>
cause : An Ant BuildException has occured: Warning: Could not find file <https://builds.apache.org/job/ActiveMQ-Apollo-Deploy/ws/trunk/apollo-dto/target/schema/org/apache/activemq/apollo/dto/apollo.xsd>
to copy.
around Ant part ...<copy file="<https://builds.apache.org/job/ActiveMQ-Apollo-Deploy/ws/trunk/apollo-website/../apollo-dto/target/schema/org/apache/activemq/apollo/dto/apollo.xsd">
tofile="<https://builds.apache.org/job/ActiveMQ-Apollo-Deploy/ws/trunk/apollo-website/target/sitegen/documentation/schema/apollo.xsd"/>...>
@ 5:307 in <https://builds.apache.org/job/ActiveMQ-Apollo-Deploy/ws/trunk/apollo-website/target/antrun/build-main.xml>
Stack trace : 
org.apache.maven.lifecycle.LifecycleExecutionException: Failed to execute goal org.apache.maven.plugins:maven-antrun-plugin:1.7:run
(default) on project apollo-website: An Ant BuildException has occured: Warning: Could not
find file <https://builds.apache.org/job/ActiveMQ-Apollo-Deploy/ws/trunk/apollo-dto/target/schema/org/apache/activemq/apollo/dto/apollo.xsd>
to copy.
around Ant part ...<copy file="<https://builds.apache.org/job/ActiveMQ-Apollo-Deploy/ws/trunk/apollo-website/../apollo-dto/target/schema/org/apache/activemq/apollo/dto/apollo.xsd">
tofile="<https://builds.apache.org/job/ActiveMQ-Apollo-Deploy/ws/trunk/apollo-website/target/sitegen/documentation/schema/apollo.xsd"/>...>
@ 5:307 in <https://builds.apache.org/job/ActiveMQ-Apollo-Deploy/ws/trunk/apollo-website/target/antrun/build-main.xml>
	at org.apache.maven.lifecycle.internal.MojoExecutor.execute(MojoExecutor.java:217)
	at org.apache.maven.lifecycle.internal.MojoExecutor.execute(MojoExecutor.java:153)
	at org.apache.maven.lifecycle.internal.MojoExecutor.execute(MojoExecutor.java:145)
	at org.apache.maven.lifecycle.internal.LifecycleModuleBuilder.buildProject(LifecycleModuleBuilder.java:84)
	at org.apache.maven.lifecycle.internal.LifecycleModuleBuilder.buildProject(LifecycleModuleBuilder.java:59)
	at org.apache.maven.lifecycle.internal.LifecycleStarter.singleThreadedBuild(LifecycleStarter.java:183)
	at org.apache.maven.lifecycle.internal.LifecycleStarter.execute(LifecycleStarter.java:161)
	at org.apache.maven.DefaultMaven.doExecute(DefaultMaven.java:319)
	at org.apache.maven.DefaultMaven.execute(DefaultMaven.java:156)
	at org.jvnet.hudson.maven3.launcher.Maven3Launcher.main(Maven3Launcher.java:79)
	at sun.reflect.NativeMethodAccessorImpl.invoke0(Native Method)
	at sun.reflect.NativeMethodAccessorImpl.invoke(NativeMethodAccessorImpl.java:39)
	at sun.reflect.DelegatingMethodAccessorImpl.invoke(DelegatingMethodAccessorImpl.java:25)
	at java.lang.reflect.Method.invoke(Method.java:597)
	at org.codehaus.plexus.classworlds.launcher.Launcher.launchStandard(Launcher.java:329)
	at org.codehaus.plexus.classworlds.launcher.Launcher.launch(Launcher.java:239)
	at org.jvnet.hudson.maven3.agent.Maven3Main.launch(Maven3Main.java:158)
	at hudson.maven.Maven3Builder.call(Maven3Builder.java:100)
	at hudson.maven.Maven3Builder.call(Maven3Builder.java:66)
	at hudson.remoting.UserRequest.perform(UserRequest.java:118)
	at hudson.remoting.UserRequest.perform(UserRequest.java:48)
	at hudson.remoting.Request$2.run(Request.java:326)
	at hudson.remoting.InterceptingExecutorService$1.call(InterceptingExecutorService.java:72)
	at java.util.concurrent.FutureTask$Sync.innerRun(FutureTask.java:303)
	at java.util.concurrent.FutureTask.run(FutureTask.java:138)
	at java.util.concurrent.ThreadPoolExecutor$Worker.runTask(ThreadPoolExecutor.java:886)
	at java.util.concurrent.ThreadPoolExecutor$Worker.run(ThreadPoolExecutor.java:908)
	at java.lang.Thread.run(Thread.java:662)
Caused by: org.apache.maven.plugin.MojoExecutionException: An Ant BuildException has occured:
Warning: Could not find file <https://builds.apache.org/job/ActiveMQ-Apollo-Deploy/ws/trunk/apollo-dto/target/schema/org/apache/activemq/apollo/dto/apollo.xsd>
to copy.
around Ant part ...<copy file="<https://builds.apache.org/job/ActiveMQ-Apollo-Deploy/ws/trunk/apollo-website/../apollo-dto/target/schema/org/apache/activemq/apollo/dto/apollo.xsd">
tofile="<https://builds.apache.org/job/ActiveMQ-Apollo-Deploy/ws/trunk/apollo-website/target/sitegen/documentation/schema/apollo.xsd"/>...>
@ 5:307 in <https://builds.apache.org/job/ActiveMQ-Apollo-Deploy/ws/trunk/apollo-website/target/antrun/build-main.xml>
	at org.apache.maven.plugin.antrun.AntRunMojo.execute(AntRunMojo.java:355)
	at org.apache.maven.plugin.DefaultBuildPluginManager.executeMojo(DefaultBuildPluginManager.java:107)
	at org.apache.maven.lifecycle.internal.MojoExecutor.execute(MojoExecutor.java:209)
	... 27 more
Caused by: <https://builds.apache.org/job/ActiveMQ-Apollo-Deploy/ws/trunk/apollo-website/target/antrun/build-main.xml>:5:
Warning: Could not find file <https://builds.apache.org/job/ActiveMQ-Apollo-Deploy/ws/trunk/apollo-dto/target/schema/org/apache/activemq/apollo/dto/apollo.xsd>
to copy.
	at org.apache.tools.ant.taskdefs.Copy.copySingleFile(Copy.java:619)
	at org.apache.tools.ant.taskdefs.Copy.execute(Copy.java:444)
	at org.apache.tools.ant.UnknownElement.execute(UnknownElement.java:291)
	at sun.reflect.NativeMethodAccessorImpl.invoke0(Native Method)
	at sun.reflect.NativeMethodAccessorImpl.invoke(NativeMethodAccessorImpl.java:39)
	at sun.reflect.DelegatingMethodAccessorImpl.invoke(DelegatingMethodAccessorImpl.java:25)
	at java.lang.reflect.Method.invoke(Method.java:597)
	at org.apache.tools.ant.dispatch.DispatchUtils.execute(DispatchUtils.java:106)
	at org.apache.tools.ant.Task.perform(Task.java:348)
	at org.apache.tools.ant.Target.execute(Target.java:390)
	at org.apache.tools.ant.Target.performTasks(Target.java:411)
	at org.apache.tools.ant.Project.executeSortedTargets(Project.java:1399)
	at org.apache.tools.ant.Project.executeTarget(Project.java:1368)
	at org.apache.maven.plugin.antrun.AntRunMojo.execute(AntRunMojo.java:327)
	... 29 more
Sending e-mails to: commits@activemq.apache.org
Sending e-mails to: commits@activemq.apache.org
channel stopped

Mime
View raw message