activemq-commits mailing list archives

Site index · List index
Message view « Date » · « Thread »
Top « Date » · « Thread »
From Apache Jenkins Server <jenk...@builds.apache.org>
Subject Build failed in Jenkins: ActiveMQ-Apollo #934
Date Fri, 29 Mar 2013 00:30:59 GMT
See <https://builds.apache.org/job/ActiveMQ-Apollo/934/changes>

Changes:

[chirino] move src files to the java directory.

[chirino] Porting more logic from scala to java.

[chirino] Starting to port the MQTT module to be a pure java impl, just to see how much effort
that would take.

------------------------------------------
[...truncated 2305 lines...]
[INFO] 
[INFO] --- maven-clean-plugin:2.4.1:clean (default-clean) @ apollo-openwire-generator ---
[INFO] 
[INFO] --- maven-enforcer-plugin:1.0:enforce (default) @ apollo-openwire-generator ---
[INFO] 
[INFO] --- maven-remote-resources-plugin:1.1:process (default) @ apollo-openwire-generator
---
[INFO] Using 'UTF-8' encoding to copy filtered resources.
[INFO] [INFO] skip non existing resourceDirectory <https://builds.apache.org/job/ActiveMQ-Apollo/ws/trunk/apollo-openwire-generator/target/schema>
[INFO] skip non existing resourceDirectory <https://builds.apache.org/job/ActiveMQ-Apollo/ws/trunk/apollo-openwire-generator/src/main/resources>
[INFO] Copying 3 resources

[INFO] --- maven-resources-plugin:2.4.3:resources (default-resources) @ apollo-openwire-generator
---
[INFO] [INFO] Add Source directory: /x1/jenkins/jenkins-slave/workspace/ActiveMQ-Apollo/trunk/apollo-openwire-generator/src/main/scala
[INFO] Add Test Source directory: /x1/jenkins/jenkins-slave/workspace/ActiveMQ-Apollo/trunk/apollo-openwire-generator/dontcompile

[INFO] --- scala-maven-plugin:3.1.0:add-source (compile) @ apollo-openwire-generator ---
[INFO] 
[INFO] --- scala-maven-plugin:3.1.0:compile (compile) @ apollo-openwire-generator ---
[INFO] /x1/jenkins/jenkins-slave/workspace/ActiveMQ-Apollo/trunk/apollo-openwire-generator/src/main/scala:-1:
info: compiling
[INFO] Compiling 2 source files to /x1/jenkins/jenkins-slave/workspace/ActiveMQ-Apollo/trunk/apollo-openwire-generator/target/classes
at 1364517017314
[INFO] compiler plugin: BasicArtifact(org.fusesource.jvmassert,jvmassert,1.4,null)
[INFO] prepare-compile in 0 s
[INFO] compile in 5 s
[INFO] 
[INFO] --- maven-compiler-plugin:2.3.2:compile (default-compile) @ apollo-openwire-generator
---
[INFO] Nothing to compile - all classes are up to date
[INFO] [INFO] Using 'UTF-8' encoding to copy filtered resources.
[INFO] skip non existing resourceDirectory <https://builds.apache.org/job/ActiveMQ-Apollo/ws/trunk/apollo-openwire-generator/src/test/resources>
[INFO] Copying 3 resources

[INFO] --- maven-resources-plugin:2.4.3:testResources (default-testResources) @ apollo-openwire-generator
---
[INFO] [INFO] No sources to compile

[INFO] --- maven-compiler-plugin:2.3.2:testCompile (default-testCompile) @ apollo-openwire-generator
---
[INFO] 
[INFO] --- scala-maven-plugin:3.1.0:testCompile (test) @ apollo-openwire-generator ---
[WARNING] No source files found.
[INFO] 
[INFO] --- maven-surefire-plugin:2.12:test (default-test) @ apollo-openwire-generator ---
[INFO] Surefire report directory: <https://builds.apache.org/job/ActiveMQ-Apollo/ws/trunk/apollo-openwire-generator/target/surefire-reports>

-------------------------------------------------------
 T E S T S
-------------------------------------------------------

Results :

Tests run: 0, Failures: 0, Errors: 0, Skipped: 0

[JENKINS] Recording test results
[INFO] 
[INFO] --- maven-jar-plugin:2.3.1:jar (default-jar) @ apollo-openwire-generator ---
[INFO] Building jar: <https://builds.apache.org/job/ActiveMQ-Apollo/ws/trunk/apollo-openwire-generator/target/apollo-openwire-generator-99-trunk-SNAPSHOT.jar>
[INFO] 
[INFO] --- maven-site-plugin:3.0:attach-descriptor (attach-descriptor) @ apollo-openwire-generator
---
[INFO] [INFO] Installing <https://builds.apache.org/job/ActiveMQ-Apollo/ws/trunk/apollo-openwire-generator/target/apollo-openwire-generator-99-trunk-SNAPSHOT.jar>
to /home/jenkins/jenkins-slave/maven-repositories/1/org/apache/activemq/apollo-openwire-generator/99-trunk-SNAPSHOT/apollo-openwire-generator-99-trunk-SNAPSHOT.jar

[INFO] --- maven-install-plugin:2.3.1:install (default-install) @ apollo-openwire-generator
---
[INFO] Installing <https://builds.apache.org/job/ActiveMQ-Apollo/ws/trunk/apollo-openwire-generator/pom.xml>
to /home/jenkins/jenkins-slave/maven-repositories/1/org/apache/activemq/apollo-openwire-generator/99-trunk-SNAPSHOT/apollo-openwire-generator-99-trunk-SNAPSHOT.pom
[INFO]                                                                         
[INFO] ------------------------------------------------------------------------
[INFO] Skipping apollo-openwire
[INFO] This project has been banned from the build due to previous failures.
[INFO] ------------------------------------------------------------------------
[INFO]                                                                         
[INFO] ------------------------------------------------------------------------
[INFO] Skipping apollo-jmx
[INFO] This project has been banned from the build due to previous failures.
[INFO] ------------------------------------------------------------------------
[INFO]                                                                         
[INFO] ------------------------------------------------------------------------
[INFO] Skipping apollo-cli
[INFO] This project has been banned from the build due to previous failures.
[INFO] ------------------------------------------------------------------------
[INFO]                                                                         
[INFO] ------------------------------------------------------------------------
[INFO] Building apollo-website 99-trunk-SNAPSHOT
[INFO] ------------------------------------------------------------------------
[INFO] 
[INFO] --- maven-clean-plugin:2.4.1:clean (default-clean) @ apollo-website ---
[INFO] 
[INFO] --- maven-enforcer-plugin:1.0:enforce (default) @ apollo-website ---
[INFO] 
[INFO] --- maven-antrun-plugin:1.7:run (default) @ apollo-website ---
[WARNING] Parameter tasks is deprecated, use target instead
[INFO] Executing tasks

main:
    [mkdir] Created dir: <https://builds.apache.org/job/ActiveMQ-Apollo/ws/trunk/apollo-website/target/sitegen/documentation/schema>
[INFO]                                                                         
[INFO] ------------------------------------------------------------------------
[INFO] Skipping apache-apollo
[INFO] This project has been banned from the build due to previous failures.
[INFO] ------------------------------------------------------------------------
[INFO]                                                                         
[INFO] ------------------------------------------------------------------------
[INFO] Skipping apollo-itests
[INFO] This project has been banned from the build due to previous failures.
[INFO] ------------------------------------------------------------------------
[INFO] ------------------------------------------------------------------------
[INFO] Reactor Summary:
[INFO] 
[INFO] Apache ActiveMQ Apollo Project .................... SUCCESS [7.752s]
[INFO] apollo-boot ....................................... SUCCESS [6.518s]
[INFO] apollo-scala ...................................... SUCCESS [1.149s]
[INFO] apollo-util ....................................... FAILURE [22.007s]
[INFO] apollo-dto ........................................ SKIPPED
[INFO] apollo-selector ................................... SUCCESS [3.013s]
[INFO] apollo-broker ..................................... SKIPPED
[INFO] apollo-web ........................................ SKIPPED
[INFO] apollo-leveldb .................................... SKIPPED
[INFO] apollo-bdb ........................................ SKIPPED
[INFO] apollo-stomp ...................................... SKIPPED
[INFO] apollo-amqp ....................................... SKIPPED
[INFO] apollo-mqtt ....................................... SKIPPED
[INFO] apollo-openwire-generator ......................... SUCCESS [7.077s]
[INFO] apollo-openwire ................................... SKIPPED
[INFO] apollo-jmx ........................................ SKIPPED
[INFO] apollo-cli ........................................ SKIPPED
[INFO] apollo-website .................................... FAILURE [1.973s]
[INFO] apache-apollo ..................................... SKIPPED
[INFO] apollo-itests ..................................... SKIPPED
[INFO] ------------------------------------------------------------------------
[INFO] BUILD FAILURE
[INFO] ------------------------------------------------------------------------
[INFO] Total time: 50.919s
[INFO] Finished at: Fri Mar 29 00:30:25 UTC 2013
[INFO] Final Memory: 36M/981M
[INFO] ------------------------------------------------------------------------
[JENKINS] Archiving disabled
[JENKINS] Archiving disabled
[JENKINS] Archiving disabled
[JENKINS] Archiving disabled
[JENKINS] Archiving disabled
[JENKINS] Archiving disabled
[JENKINS] Archiving disabled
[JENKINS] Archiving disabled
[JENKINS] Archiving disabled
[JENKINS] Archiving disabled
[JENKINS] Archiving disabled
[JENKINS] Archiving disabled
[JENKINS] Archiving disabled
[JENKINS] Archiving disabled
[JENKINS] Archiving disabled
[JENKINS] Archiving disabled
[JENKINS] Archiving disabled
[JENKINS] Archiving disabled
[JENKINS] Archiving disabled
[JENKINS] Archiving disabled
Waiting for Jenkins to finish collecting data
mavenExecutionResult exceptions not empty
message : Failed to execute goal org.apache.maven.plugins:maven-compiler-plugin:2.3.2:compile
(default-compile) on project apollo-util: Compilation failure
cause : Compilation failure
Stack trace : 
org.apache.maven.lifecycle.LifecycleExecutionException: Failed to execute goal org.apache.maven.plugins:maven-compiler-plugin:2.3.2:compile
(default-compile) on project apollo-util: Compilation failure
	at org.apache.maven.lifecycle.internal.MojoExecutor.execute(MojoExecutor.java:213)
	at org.apache.maven.lifecycle.internal.MojoExecutor.execute(MojoExecutor.java:153)
	at org.apache.maven.lifecycle.internal.MojoExecutor.execute(MojoExecutor.java:145)
	at org.apache.maven.lifecycle.internal.LifecycleModuleBuilder.buildProject(LifecycleModuleBuilder.java:84)
	at org.apache.maven.lifecycle.internal.LifecycleModuleBuilder.buildProject(LifecycleModuleBuilder.java:59)
	at org.apache.maven.lifecycle.internal.LifecycleStarter.singleThreadedBuild(LifecycleStarter.java:183)
	at org.apache.maven.lifecycle.internal.LifecycleStarter.execute(LifecycleStarter.java:161)
	at org.apache.maven.DefaultMaven.doExecute(DefaultMaven.java:319)
	at org.apache.maven.DefaultMaven.execute(DefaultMaven.java:156)
	at org.jvnet.hudson.maven3.launcher.Maven3Launcher.main(Maven3Launcher.java:79)
	at sun.reflect.NativeMethodAccessorImpl.invoke0(Native Method)
	at sun.reflect.NativeMethodAccessorImpl.invoke(NativeMethodAccessorImpl.java:39)
	at sun.reflect.DelegatingMethodAccessorImpl.invoke(DelegatingMethodAccessorImpl.java:25)
	at java.lang.reflect.Method.invoke(Method.java:597)
	at org.codehaus.plexus.classworlds.launcher.Launcher.launchStandard(Launcher.java:329)
	at org.codehaus.plexus.classworlds.launcher.Launcher.launch(Launcher.java:239)
	at org.jvnet.hudson.maven3.agent.Maven3Main.launch(Maven3Main.java:158)
	at hudson.maven.Maven3Builder.call(Maven3Builder.java:100)
	at hudson.maven.Maven3Builder.call(Maven3Builder.java:66)
	at hudson.remoting.UserRequest.perform(UserRequest.java:118)
	at hudson.remoting.UserRequest.perform(UserRequest.java:48)
	at hudson.remoting.Request$2.run(Request.java:326)
	at hudson.remoting.InterceptingExecutorService$1.call(InterceptingExecutorService.java:72)
	at java.util.concurrent.FutureTask$Sync.innerRun(FutureTask.java:303)
	at java.util.concurrent.FutureTask.run(FutureTask.java:138)
	at java.util.concurrent.ThreadPoolExecutor$Worker.runTask(ThreadPoolExecutor.java:886)
	at java.util.concurrent.ThreadPoolExecutor$Worker.run(ThreadPoolExecutor.java:908)
	at java.lang.Thread.run(Thread.java:662)
Caused by: org.apache.maven.plugin.CompilationFailureException: Compilation failure
	at org.apache.maven.plugin.AbstractCompilerMojo.execute(AbstractCompilerMojo.java:656)
	at org.apache.maven.plugin.CompilerMojo.execute(CompilerMojo.java:128)
	at org.apache.maven.plugin.DefaultBuildPluginManager.executeMojo(DefaultBuildPluginManager.java:107)
	at org.apache.maven.lifecycle.internal.MojoExecutor.execute(MojoExecutor.java:209)
	... 27 more
message : Failed to execute goal org.apache.maven.plugins:maven-antrun-plugin:1.7:run (default)
on project apollo-website: An Ant BuildException has occured: Warning: Could not find file
<https://builds.apache.org/job/ActiveMQ-Apollo/ws/trunk/apollo-dto/target/schema/org/apache/activemq/apollo/dto/apollo.xsd>
to copy.
around Ant part ...<copy file="<https://builds.apache.org/job/ActiveMQ-Apollo/ws/trunk/apollo-website/../apollo-dto/target/schema/org/apache/activemq/apollo/dto/apollo.xsd">
tofile="<https://builds.apache.org/job/ActiveMQ-Apollo/ws/trunk/apollo-website/target/sitegen/documentation/schema/apollo.xsd"/>...>
@ 5:293 in <https://builds.apache.org/job/ActiveMQ-Apollo/ws/trunk/apollo-website/target/antrun/build-main.xml>
cause : An Ant BuildException has occured: Warning: Could not find file <https://builds.apache.org/job/ActiveMQ-Apollo/ws/trunk/apollo-dto/target/schema/org/apache/activemq/apollo/dto/apollo.xsd>
to copy.
around Ant part ...<copy file="<https://builds.apache.org/job/ActiveMQ-Apollo/ws/trunk/apollo-website/../apollo-dto/target/schema/org/apache/activemq/apollo/dto/apollo.xsd">
tofile="<https://builds.apache.org/job/ActiveMQ-Apollo/ws/trunk/apollo-website/target/sitegen/documentation/schema/apollo.xsd"/>...>
@ 5:293 in <https://builds.apache.org/job/ActiveMQ-Apollo/ws/trunk/apollo-website/target/antrun/build-main.xml>
Stack trace : 
org.apache.maven.lifecycle.LifecycleExecutionException: Failed to execute goal org.apache.maven.plugins:maven-antrun-plugin:1.7:run
(default) on project apollo-website: An Ant BuildException has occured: Warning: Could not
find file <https://builds.apache.org/job/ActiveMQ-Apollo/ws/trunk/apollo-dto/target/schema/org/apache/activemq/apollo/dto/apollo.xsd>
to copy.
around Ant part ...<copy file="<https://builds.apache.org/job/ActiveMQ-Apollo/ws/trunk/apollo-website/../apollo-dto/target/schema/org/apache/activemq/apollo/dto/apollo.xsd">
tofile="<https://builds.apache.org/job/ActiveMQ-Apollo/ws/trunk/apollo-website/target/sitegen/documentation/schema/apollo.xsd"/>...>
@ 5:293 in <https://builds.apache.org/job/ActiveMQ-Apollo/ws/trunk/apollo-website/target/antrun/build-main.xml>
	at org.apache.maven.lifecycle.internal.MojoExecutor.execute(MojoExecutor.java:217)
	at org.apache.maven.lifecycle.internal.MojoExecutor.execute(MojoExecutor.java:153)
	at org.apache.maven.lifecycle.internal.MojoExecutor.execute(MojoExecutor.java:145)
	at org.apache.maven.lifecycle.internal.LifecycleModuleBuilder.buildProject(LifecycleModuleBuilder.java:84)
	at org.apache.maven.lifecycle.internal.LifecycleModuleBuilder.buildProject(LifecycleModuleBuilder.java:59)
	at org.apache.maven.lifecycle.internal.LifecycleStarter.singleThreadedBuild(LifecycleStarter.java:183)
	at org.apache.maven.lifecycle.internal.LifecycleStarter.execute(LifecycleStarter.java:161)
	at org.apache.maven.DefaultMaven.doExecute(DefaultMaven.java:319)
	at org.apache.maven.DefaultMaven.execute(DefaultMaven.java:156)
	at org.jvnet.hudson.maven3.launcher.Maven3Launcher.main(Maven3Launcher.java:79)
	at sun.reflect.NativeMethodAccessorImpl.invoke0(Native Method)
	at sun.reflect.NativeMethodAccessorImpl.invoke(NativeMethodAccessorImpl.java:39)
	at sun.reflect.DelegatingMethodAccessorImpl.invoke(DelegatingMethodAccessorImpl.java:25)
	at java.lang.reflect.Method.invoke(Method.java:597)
	at org.codehaus.plexus.classworlds.launcher.Launcher.launchStandard(Launcher.java:329)
	at org.codehaus.plexus.classworlds.launcher.Launcher.launch(Launcher.java:239)
	at org.jvnet.hudson.maven3.agent.Maven3Main.launch(Maven3Main.java:158)
	at hudson.maven.Maven3Builder.call(Maven3Builder.java:100)
	at hudson.maven.Maven3Builder.call(Maven3Builder.java:66)
	at hudson.remoting.UserRequest.perform(UserRequest.java:118)
	at hudson.remoting.UserRequest.perform(UserRequest.java:48)
	at hudson.remoting.Request$2.run(Request.java:326)
	at hudson.remoting.InterceptingExecutorService$1.call(InterceptingExecutorService.java:72)
	at java.util.concurrent.FutureTask$Sync.innerRun(FutureTask.java:303)
	at java.util.concurrent.FutureTask.run(FutureTask.java:138)
	at java.util.concurrent.ThreadPoolExecutor$Worker.runTask(ThreadPoolExecutor.java:886)
	at java.util.concurrent.ThreadPoolExecutor$Worker.run(ThreadPoolExecutor.java:908)
	at java.lang.Thread.run(Thread.java:662)
Caused by: org.apache.maven.plugin.MojoExecutionException: An Ant BuildException has occured:
Warning: Could not find file <https://builds.apache.org/job/ActiveMQ-Apollo/ws/trunk/apollo-dto/target/schema/org/apache/activemq/apollo/dto/apollo.xsd>
to copy.
around Ant part ...<copy file="<https://builds.apache.org/job/ActiveMQ-Apollo/ws/trunk/apollo-website/../apollo-dto/target/schema/org/apache/activemq/apollo/dto/apollo.xsd">
tofile="<https://builds.apache.org/job/ActiveMQ-Apollo/ws/trunk/apollo-website/target/sitegen/documentation/schema/apollo.xsd"/>...>
@ 5:293 in <https://builds.apache.org/job/ActiveMQ-Apollo/ws/trunk/apollo-website/target/antrun/build-main.xml>
	at org.apache.maven.plugin.antrun.AntRunMojo.execute(AntRunMojo.java:355)
	at org.apache.maven.plugin.DefaultBuildPluginManager.executeMojo(DefaultBuildPluginManager.java:107)
	at org.apache.maven.lifecycle.internal.MojoExecutor.execute(MojoExecutor.java:209)
	... 27 more
Caused by: <https://builds.apache.org/job/ActiveMQ-Apollo/ws/trunk/apollo-website/target/antrun/build-main.xml>:5:
Warning: Could not find file <https://builds.apache.org/job/ActiveMQ-Apollo/ws/trunk/apollo-dto/target/schema/org/apache/activemq/apollo/dto/apollo.xsd>
to copy.
	at org.apache.tools.ant.taskdefs.Copy.copySingleFile(Copy.java:619)
	at org.apache.tools.ant.taskdefs.Copy.execute(Copy.java:444)
	at org.apache.tools.ant.UnknownElement.execute(UnknownElement.java:291)
	at sun.reflect.NativeMethodAccessorImpl.invoke0(Native Method)
	at sun.reflect.NativeMethodAccessorImpl.invoke(NativeMethodAccessorImpl.java:39)
	at sun.reflect.DelegatingMethodAccessorImpl.invoke(DelegatingMethodAccessorImpl.java:25)
	at java.lang.reflect.Method.invoke(Method.java:597)
	at org.apache.tools.ant.dispatch.DispatchUtils.execute(DispatchUtils.java:106)
	at org.apache.tools.ant.Task.perform(Task.java:348)
	at org.apache.tools.ant.Target.execute(Target.java:390)
	at org.apache.tools.ant.Target.performTasks(Target.java:411)
	at org.apache.tools.ant.Project.executeSortedTargets(Project.java:1399)
	at org.apache.tools.ant.Project.executeTarget(Project.java:1368)
	at org.apache.maven.plugin.antrun.AntRunMojo.execute(AntRunMojo.java:327)
	... 29 more
Sending e-mails to: commits@activemq.apache.org
Sending e-mails to: commits@activemq.apache.org
channel stopped

Mime
View raw message