activemq-commits mailing list archives

Site index · List index
Message view « Date » · « Thread »
Top « Date » · « Thread »
From Apache Jenkins Server <jenk...@builds.apache.org>
Subject Build failed in Jenkins: ActiveMQ-Apollo-Deploy #338
Date Mon, 24 Dec 2012 03:12:26 GMT
See <https://builds.apache.org/job/ActiveMQ-Apollo-Deploy/338/changes>

Changes:

[chirino] Upgrade to scala 2.10

------------------------------------------
[...truncated 4110 lines...]
Downloading: http://repo1.maven.org/maven2/org/apache/maven/surefire/surefire-junit3/2.12/surefire-junit3-2.12.pom

Downloaded: http://repo1.maven.org/maven2/org/apache/maven/surefire/surefire-junit3/2.12/surefire-junit3-2.12.pom
(2 KB at 37.0 KB/sec)
[INFO] 
[INFO] --- maven-surefire-plugin:2.12:test (default-test) @ apollo-openwire-generator ---
Downloading: http://repo1.maven.org/maven2/org/apache/maven/surefire/surefire-junit3/2.12/surefire-junit3-2.12.jar
Downloaded: http://repo1.maven.org/maven2/org/apache/maven/surefire/surefire-junit3/2.12/surefire-junit3-2.12.jar
(26 KB at 118.7 KB/sec)

-------------------------------------------------------
 T E S T S
-------------------------------------------------------

Results :

Tests run: 0, Failures: 0, Errors: 0, Skipped: 0

mojoSucceeded org.apache.maven.plugins:maven-surefire-plugin:2.12(default-test)
[JENKINS] Recording test results
mojoStarted org.apache.maven.plugins:maven-jar-plugin:2.3.1(default-jar)
[INFO] [INFO] Building jar: <https://builds.apache.org/job/ActiveMQ-Apollo-Deploy/ws/trunk/apollo-openwire-generator/target/apollo-openwire-generator-99-trunk-SNAPSHOT.jar>

[INFO] --- maven-jar-plugin:2.3.1:jar (default-jar) @ apollo-openwire-generator ---
mojoSucceeded org.apache.maven.plugins:maven-jar-plugin:2.3.1(default-jar)
mojoStarted org.apache.maven.plugins:maven-site-plugin:3.0(attach-descriptor)
[INFO] 
[INFO] --- maven-site-plugin:3.0:attach-descriptor (attach-descriptor) @ apollo-openwire-generator
---
mojoSucceeded org.apache.maven.plugins:maven-site-plugin:3.0(attach-descriptor)
mojoStarted org.apache.maven.plugins:maven-install-plugin:2.3.1(default-install)[INFO] Installing
<https://builds.apache.org/job/ActiveMQ-Apollo-Deploy/ws/trunk/apollo-openwire-generator/target/apollo-openwire-generator-99-trunk-SNAPSHOT.jar>
to <https://builds.apache.org/job/ActiveMQ-Apollo-Deploy/ws/.repository/org/apache/activemq/apollo-openwire-generator/99-trunk-SNAPSHOT/apollo-openwire-generator-99-trunk-SNAPSHOT.jar>
[INFO] Installing <https://builds.apache.org/job/ActiveMQ-Apollo-Deploy/ws/trunk/apollo-openwire-generator/pom.xml>
to <https://builds.apache.org/job/ActiveMQ-Apollo-Deploy/ws/.repository/org/apache/activemq/apollo-openwire-generator/99-trunk-SNAPSHOT/apollo-openwire-generator-99-trunk-SNAPSHOT.pom>

[INFO] 
[INFO] --- maven-install-plugin:2.3.1:install (default-install) @ apollo-openwire-generator
---
mojoSucceeded org.apache.maven.plugins:maven-install-plugin:2.3.1(default-install)
mojoStarted org.apache.maven.plugins:maven-deploy-plugin:2.5(default-deploy)Downloading: https://repository.apache.org/content/repositories/snapshots/org/apache/activemq/apollo-openwire-generator/99-trunk-SNAPSHOT/maven-metadata.xml

[INFO] 
[INFO] --- maven-deploy-plugin:2.5:deploy (default-deploy) @ apollo-openwire-generator ---
Downloaded: https://repository.apache.org/content/repositories/snapshots/org/apache/activemq/apollo-openwire-generator/99-trunk-SNAPSHOT/maven-metadata.xml
(809 B at 2.9 KB/sec)
Uploading: https://repository.apache.org/content/repositories/snapshots/org/apache/activemq/apollo-openwire-generator/99-trunk-SNAPSHOT/apollo-openwire-generator-99-trunk-20121224.031214-157.jar
Uploaded: https://repository.apache.org/content/repositories/snapshots/org/apache/activemq/apollo-openwire-generator/99-trunk-SNAPSHOT/apollo-openwire-generator-99-trunk-20121224.031214-157.jar
(43 KB at 153.7 KB/sec)
Uploading: https://repository.apache.org/content/repositories/snapshots/org/apache/activemq/apollo-openwire-generator/99-trunk-SNAPSHOT/apollo-openwire-generator-99-trunk-20121224.031214-157.pom
Uploaded: https://repository.apache.org/content/repositories/snapshots/org/apache/activemq/apollo-openwire-generator/99-trunk-SNAPSHOT/apollo-openwire-generator-99-trunk-20121224.031214-157.pom
(3 KB at 20.9 KB/sec)
Downloading: https://repository.apache.org/content/repositories/snapshots/org/apache/activemq/apollo-openwire-generator/maven-metadata.xml
Downloaded: https://repository.apache.org/content/repositories/snapshots/org/apache/activemq/apollo-openwire-generator/maven-metadata.xml
(370 B at 1.9 KB/sec)
Uploading: https://repository.apache.org/content/repositories/snapshots/org/apache/activemq/apollo-openwire-generator/99-trunk-SNAPSHOT/maven-metadata.xml
Uploaded: https://repository.apache.org/content/repositories/snapshots/org/apache/activemq/apollo-openwire-generator/99-trunk-SNAPSHOT/maven-metadata.xml
(809 B at 3.6 KB/sec)
Uploading: https://repository.apache.org/content/repositories/snapshots/org/apache/activemq/apollo-openwire-generator/maven-metadata.xml
Uploaded: https://repository.apache.org/content/repositories/snapshots/org/apache/activemq/apollo-openwire-generator/maven-metadata.xml
(370 B at 2.3 KB/sec)
mojoSucceeded org.apache.maven.plugins:maven-deploy-plugin:2.5(default-deploy)
projectSucceeded org.apache.activemq:apollo-openwire-generator:99-trunk-SNAPSHOT
projectSkipped org.apache.activemq:apollo-openwire:99-trunk-SNAPSHOT
[INFO]                                                                         
[INFO] ------------------------------------------------------------------------
[INFO] Skipping apollo-openwire
[INFO] This project has been banned from the build due to previous failures.
[INFO] ------------------------------------------------------------------------
projectSkipped org.apache.activemq:apollo-jmx:99-trunk-SNAPSHOT
[INFO]                                                                         
[INFO] ------------------------------------------------------------------------
[INFO] Skipping apollo-jmx
[INFO] This project has been banned from the build due to previous failures.
[INFO] ------------------------------------------------------------------------
projectSkipped org.apache.activemq:apollo-network:99-trunk-SNAPSHOT
[INFO]                                                                         
[INFO] ------------------------------------------------------------------------
[INFO] Skipping apollo-network
[INFO] This project has been banned from the build due to previous failures.
[INFO] ------------------------------------------------------------------------
projectSkipped org.apache.activemq:apollo-cli:99-trunk-SNAPSHOT
[INFO]                                                                         
[INFO] ------------------------------------------------------------------------
[INFO] Skipping apollo-cli
[INFO] This project has been banned from the build due to previous failures.
[INFO] ------------------------------------------------------------------------
projectStarted org.apache.activemq:apollo-website:99-trunk-SNAPSHOT
[INFO] Downloading: http://repo1.maven.org/maven2/org/apache/maven/plugins/maven-source-plugin/2.1.2/maven-source-plugin-2.1.2.pom
Downloaded: http://repo1.maven.org/maven2/org/apache/maven/plugins/maven-source-plugin/2.1.2/maven-source-plugin-2.1.2.pom
(6 KB at 840.7 KB/sec)
Downloading: http://repo1.maven.org/maven2/org/apache/maven/plugins/maven-source-plugin/2.1.2/maven-source-plugin-2.1.2.jar
                                                                        
[INFO] ------------------------------------------------------------------------
[INFO] Building apollo-website 99-trunk-SNAPSHOT
[INFO] ------------------------------------------------------------------------
Downloaded: http://repo1.maven.org/maven2/org/apache/maven/plugins/maven-source-plugin/2.1.2/maven-source-plugin-2.1.2.jar
(24 KB at 391.6 KB/sec)
[WARNING] The POM for org.fusesource.scalate:maven-scalate-plugin_2.10:jar:1.6.0-SNAPSHOT
is missing, no dependency information available
projectFailed org.apache.activemq:apollo-website:99-trunk-SNAPSHOT
projectSkipped org.apache.activemq:apache-apollo:99-trunk-SNAPSHOT
[INFO]                                                                         
[INFO] ------------------------------------------------------------------------
[INFO] Skipping apache-apollo
[INFO] This project has been banned from the build due to previous failures.
[INFO] ------------------------------------------------------------------------
sessionEnded
[INFO] ------------------------------------------------------------------------
[INFO] Reactor Summary:
[INFO] 
[INFO] Apache ActiveMQ Apollo Project .................... SUCCESS [55.702s]
[INFO] apollo-boot ....................................... SUCCESS [23.470s]
[INFO] apollo-scala ...................................... SUCCESS [8.330s]
[INFO] apollo-util ....................................... SUCCESS [1:13.880s]
[INFO] apollo-dto ........................................ SUCCESS [18.109s]
[INFO] apollo-selector ................................... SUCCESS [19.028s]
[INFO] apollo-broker ..................................... SUCCESS [1:33.022s]
[INFO] apollo-web ........................................ FAILURE [0.184s]
[INFO] apollo-leveldb .................................... SKIPPED
[INFO] apollo-bdb ........................................ SKIPPED
[INFO] apollo-stomp ...................................... SKIPPED
[INFO] apollo-amqp ....................................... SKIPPED
[INFO] apollo-mqtt ....................................... SKIPPED
[INFO] apollo-openwire-generator ......................... SUCCESS [20.224s]
[INFO] apollo-openwire ................................... SKIPPED
[INFO] apollo-jmx ........................................ SKIPPED
[INFO] apollo-network .................................... SKIPPED
[INFO] apollo-cli ........................................ SKIPPED
[INFO] apollo-website .................................... FAILURE [0.358s]
[INFO] apache-apollo ..................................... SKIPPED
[INFO] ------------------------------------------------------------------------
[INFO] BUILD FAILURE
[INFO] ------------------------------------------------------------------------
[INFO] Total time: 5:16.885s
[INFO] Finished at: Mon Dec 24 03:12:16 UTC 2012
[INFO] Final Memory: 67M/968M
[INFO] ------------------------------------------------------------------------
Projects to build: [MavenProject: org.apache.activemq:apollo-project:99-trunk-SNAPSHOT @ <https://builds.apache.org/job/ActiveMQ-Apollo-Deploy/ws/trunk/pom.xml,>
MavenProject: org.apache.activemq:apollo-boot:99-trunk-SNAPSHOT @ <https://builds.apache.org/job/ActiveMQ-Apollo-Deploy/ws/trunk/apollo-boot/pom.xml,>
MavenProject: org.apache.activemq:apollo-scala:99-trunk-SNAPSHOT @ <https://builds.apache.org/job/ActiveMQ-Apollo-Deploy/ws/trunk/apollo-scala/pom.xml,>
MavenProject: org.apache.activemq:apollo-util:99-trunk-SNAPSHOT @ <https://builds.apache.org/job/ActiveMQ-Apollo-Deploy/ws/trunk/apollo-util/pom.xml,>
MavenProject: org.apache.activemq:apollo-dto:99-trunk-SNAPSHOT @ <https://builds.apache.org/job/ActiveMQ-Apollo-Deploy/ws/trunk/apollo-dto/pom.xml,>
MavenProject: org.apache.activemq:apollo-selector:99-trunk-SNAPSHOT @ <https://builds.apache.org/job/ActiveMQ-Apollo-Deploy/ws/trunk/apollo-selector/pom.xml,>
MavenProject: org.apache.activemq:apollo-broker:99-trunk-SNAPSHOT @ <https://builds.apache.org/job/ActiveMQ-Apollo-Deploy/ws/trunk/apollo-broker/pom.xml,>
MavenProject: org.apache.activemq:apollo-web:99-trunk-SNAPSHOT @ <https://builds.apache.org/job/ActiveMQ-Apollo-Deploy/ws/trunk/apollo-web/pom.xml,>
MavenProject: org.apache.activemq:apollo-leveldb:99-trunk-SNAPSHOT @ <https://builds.apache.org/job/ActiveMQ-Apollo-Deploy/ws/trunk/apollo-leveldb/pom.xml,>
MavenProject: org.apache.activemq:apollo-bdb:99-trunk-SNAPSHOT @ <https://builds.apache.org/job/ActiveMQ-Apollo-Deploy/ws/trunk/apollo-bdb/pom.xml,>
MavenProject: org.apache.activemq:apollo-stomp:99-trunk-SNAPSHOT @ <https://builds.apache.org/job/ActiveMQ-Apollo-Deploy/ws/trunk/apollo-stomp/pom.xml,>
MavenProject: org.apache.activemq:apollo-amqp:99-trunk-SNAPSHOT @ <https://builds.apache.org/job/ActiveMQ-Apollo-Deploy/ws/trunk/apollo-amqp/pom.xml,>
MavenProject: org.apache.activemq:apollo-mqtt:99-trunk-SNAPSHOT @ <https://builds.apache.org/job/ActiveMQ-Apollo-Deploy/ws/trunk/apollo-mqtt/pom.xml,>
MavenProject: org.apache.activemq:apollo-openwire-generator:99-trunk-SNAPSHOT @ <https://builds.apache.org/job/ActiveMQ-Apollo-Deploy/ws/trunk/apollo-openwire-generator/pom.xml,>
MavenProject: org.apache.activemq:apollo-openwire:99-trunk-SNAPSHOT @ <https://builds.apache.org/job/ActiveMQ-Apollo-Deploy/ws/trunk/apollo-openwire/pom.xml,>
MavenProject: org.apache.activemq:apollo-jmx:99-trunk-SNAPSHOT @ <https://builds.apache.org/job/ActiveMQ-Apollo-Deploy/ws/trunk/apollo-jmx/pom.xml,>
MavenProject: org.apache.activemq:apollo-network:99-trunk-SNAPSHOT @ <https://builds.apache.org/job/ActiveMQ-Apollo-Deploy/ws/trunk/apollo-network/pom.xml,>
MavenProject: org.apache.activemq:apollo-cli:99-trunk-SNAPSHOT @ <https://builds.apache.org/job/ActiveMQ-Apollo-Deploy/ws/trunk/apollo-cli/pom.xml,>
MavenProject: org.apache.activemq:apollo-website:99-trunk-SNAPSHOT @ <https://builds.apache.org/job/ActiveMQ-Apollo-Deploy/ws/trunk/apollo-website/pom.xml,>
MavenProject: org.apache.activemq:apache-apollo:99-trunk-SNAPSHOT @ <https://builds.apache.org/job/ActiveMQ-Apollo-Deploy/ws/trunk/apollo-distro/pom.xml]>
[JENKINS] Archiving disabled
[JENKINS] Archiving disabled
[JENKINS] Archiving disabled
[JENKINS] Archiving disabled
[JENKINS] Archiving disabled
[JENKINS] Archiving disabled
[JENKINS] Archiving disabled
[JENKINS] Archiving disabled
[JENKINS] Archiving disabled
[JENKINS] Archiving disabled
[JENKINS] Archiving disabled
[JENKINS] Archiving disabled
[JENKINS] Archiving disabled
[JENKINS] Archiving disabled
[JENKINS] Archiving disabled
[JENKINS] Archiving disabled
[JENKINS] Archiving disabled
[JENKINS] Archiving disabled
[JENKINS] Archiving disabled
[JENKINS] Archiving disabled
Waiting for Jenkins to finish collecting data
mavenExecutionResult exceptions not empty
message : Plugin org.fusesource.scalate:maven-scalate-plugin_2.10:1.6.0-SNAPSHOT or one of
its dependencies could not be resolved: Failed to read artifact descriptor for org.fusesource.scalate:maven-scalate-plugin_2.10:jar:1.6.0-SNAPSHOT
cause : Failed to read artifact descriptor for org.fusesource.scalate:maven-scalate-plugin_2.10:jar:1.6.0-SNAPSHOT
Stack trace : 
org.apache.maven.plugin.PluginResolutionException: Plugin org.fusesource.scalate:maven-scalate-plugin_2.10:1.6.0-SNAPSHOT
or one of its dependencies could not be resolved: Failed to read artifact descriptor for org.fusesource.scalate:maven-scalate-plugin_2.10:jar:1.6.0-SNAPSHOT
	at org.apache.maven.plugin.internal.DefaultPluginDependenciesResolver.resolve(DefaultPluginDependenciesResolver.java:122)
	at org.apache.maven.plugin.internal.DefaultMavenPluginManager.getPluginDescriptor(DefaultMavenPluginManager.java:142)
	at org.apache.maven.plugin.internal.DefaultMavenPluginManager.getMojoDescriptor(DefaultMavenPluginManager.java:261)
	at org.apache.maven.plugin.DefaultBuildPluginManager.getMojoDescriptor(DefaultBuildPluginManager.java:192)
	at org.apache.maven.lifecycle.internal.DefaultLifecycleExecutionPlanCalculator.calculateLifecycleMappings(DefaultLifecycleExecutionPlanCalculator.java:263)
	at org.apache.maven.lifecycle.internal.DefaultLifecycleExecutionPlanCalculator.calculateMojoExecutions(DefaultLifecycleExecutionPlanCalculator.java:176)
	at org.apache.maven.lifecycle.internal.DefaultLifecycleExecutionPlanCalculator.calculateExecutionPlan(DefaultLifecycleExecutionPlanCalculator.java:114)
	at org.apache.maven.lifecycle.internal.BuilderCommon.resolveBuildPlan(BuilderCommon.java:92)
	at org.apache.maven.lifecycle.internal.LifecycleModuleBuilder.buildProject(LifecycleModuleBuilder.java:81)
	at org.apache.maven.lifecycle.internal.LifecycleModuleBuilder.buildProject(LifecycleModuleBuilder.java:59)
	at org.apache.maven.lifecycle.internal.LifecycleStarter.singleThreadedBuild(LifecycleStarter.java:183)
	at org.apache.maven.lifecycle.internal.LifecycleStarter.execute(LifecycleStarter.java:161)
	at org.apache.maven.DefaultMaven.doExecute(DefaultMaven.java:319)
	at org.apache.maven.DefaultMaven.execute(DefaultMaven.java:156)
	at org.jvnet.hudson.maven3.launcher.Maven3Launcher.main(Maven3Launcher.java:79)
	at sun.reflect.NativeMethodAccessorImpl.invoke0(Native Method)
	at sun.reflect.NativeMethodAccessorImpl.invoke(NativeMethodAccessorImpl.java:39)
	at sun.reflect.DelegatingMethodAccessorImpl.invoke(DelegatingMethodAccessorImpl.java:25)
	at java.lang.reflect.Method.invoke(Method.java:597)
	at org.codehaus.plexus.classworlds.launcher.Launcher.launchStandard(Launcher.java:329)
	at org.codehaus.plexus.classworlds.launcher.Launcher.launch(Launcher.java:239)
	at org.jvnet.hudson.maven3.agent.Maven3Main.launch(Maven3Main.java:158)
	at hudson.maven.Maven3Builder.call(Maven3Builder.java:98)
	at hudson.maven.Maven3Builder.call(Maven3Builder.java:64)
	at hudson.remoting.UserRequest.perform(UserRequest.java:118)
	at hudson.remoting.UserRequest.perform(UserRequest.java:48)
	at hudson.remoting.Request$2.run(Request.java:326)
	at hudson.remoting.InterceptingExecutorService$1.call(InterceptingExecutorService.java:72)
	at java.util.concurrent.FutureTask$Sync.innerRun(FutureTask.java:303)
	at java.util.concurrent.FutureTask.run(FutureTask.java:138)
	at java.util.concurrent.ThreadPoolExecutor$Worker.runTask(ThreadPoolExecutor.java:886)
	at java.util.concurrent.ThreadPoolExecutor$Worker.run(ThreadPoolExecutor.java:908)
	at java.lang.Thread.run(Thread.java:662)
Caused by: org.sonatype.aether.resolution.ArtifactDescriptorException: Failed to read artifact
descriptor for org.fusesource.scalate:maven-scalate-plugin_2.10:jar:1.6.0-SNAPSHOT
	at org.apache.maven.repository.internal.DefaultArtifactDescriptorReader.loadPom(DefaultArtifactDescriptorReader.java:283)
	at org.apache.maven.repository.internal.DefaultArtifactDescriptorReader.readArtifactDescriptor(DefaultArtifactDescriptorReader.java:173)
	at org.sonatype.aether.impl.internal.DefaultRepositorySystem.readArtifactDescriptor(DefaultRepositorySystem.java:289)
	at org.apache.maven.plugin.internal.DefaultPluginDependenciesResolver.resolve(DefaultPluginDependenciesResolver.java:108)
	... 32 more
Caused by: org.sonatype.aether.resolution.ArtifactResolutionException: Could not find artifact
org.fusesource.scalate:maven-scalate-plugin_2.10:pom:1.6.0-SNAPSHOT
	at org.sonatype.aether.impl.internal.DefaultArtifactResolver.resolveArtifacts(DefaultArtifactResolver.java:526)
	at org.sonatype.aether.impl.internal.DefaultArtifactResolver.resolveArtifact(DefaultArtifactResolver.java:214)
	at org.apache.maven.repository.internal.DefaultArtifactDescriptorReader.loadPom(DefaultArtifactDescriptorReader.java:268)
	... 35 more
Caused by: org.sonatype.aether.transfer.ArtifactNotFoundException: Could not find artifact
org.fusesource.scalate:maven-scalate-plugin_2.10:pom:1.6.0-SNAPSHOT
	at org.sonatype.aether.impl.internal.DefaultArtifactResolver.resolveArtifacts(DefaultArtifactResolver.java:517)
	... 37 more
message : Plugin org.fusesource.scalate:maven-scalate-plugin_2.10:1.6.0-SNAPSHOT or one of
its dependencies could not be resolved: Failed to read artifact descriptor for org.fusesource.scalate:maven-scalate-plugin_2.10:jar:1.6.0-SNAPSHOT
cause : Failed to read artifact descriptor for org.fusesource.scalate:maven-scalate-plugin_2.10:jar:1.6.0-SNAPSHOT
Stack trace : 
org.apache.maven.plugin.PluginResolutionException: Plugin org.fusesource.scalate:maven-scalate-plugin_2.10:1.6.0-SNAPSHOT
or one of its dependencies could not be resolved: Failed to read artifact descriptor for org.fusesource.scalate:maven-scalate-plugin_2.10:jar:1.6.0-SNAPSHOT
	at org.apache.maven.plugin.internal.DefaultPluginDependenciesResolver.resolve(DefaultPluginDependenciesResolver.java:122)
	at org.apache.maven.plugin.internal.DefaultMavenPluginManager.getPluginDescriptor(DefaultMavenPluginManager.java:142)
	at org.apache.maven.plugin.internal.DefaultMavenPluginManager.getMojoDescriptor(DefaultMavenPluginManager.java:261)
	at org.apache.maven.plugin.DefaultBuildPluginManager.getMojoDescriptor(DefaultBuildPluginManager.java:192)
	at org.apache.maven.lifecycle.internal.DefaultLifecycleExecutionPlanCalculator.setupMojoExections(DefaultLifecycleExecutionPlanCalculator.java:134)
	at org.apache.maven.lifecycle.internal.DefaultLifecycleExecutionPlanCalculator.calculateExecutionPlan(DefaultLifecycleExecutionPlanCalculator.java:116)
	at org.apache.maven.lifecycle.internal.BuilderCommon.resolveBuildPlan(BuilderCommon.java:92)
	at org.apache.maven.lifecycle.internal.LifecycleModuleBuilder.buildProject(LifecycleModuleBuilder.java:81)
	at org.apache.maven.lifecycle.internal.LifecycleModuleBuilder.buildProject(LifecycleModuleBuilder.java:59)
	at org.apache.maven.lifecycle.internal.LifecycleStarter.singleThreadedBuild(LifecycleStarter.java:183)
	at org.apache.maven.lifecycle.internal.LifecycleStarter.execute(LifecycleStarter.java:161)
	at org.apache.maven.DefaultMaven.doExecute(DefaultMaven.java:319)
	at org.apache.maven.DefaultMaven.execute(DefaultMaven.java:156)
	at org.jvnet.hudson.maven3.launcher.Maven3Launcher.main(Maven3Launcher.java:79)
	at sun.reflect.NativeMethodAccessorImpl.invoke0(Native Method)
	at sun.reflect.NativeMethodAccessorImpl.invoke(NativeMethodAccessorImpl.java:39)
	at sun.reflect.DelegatingMethodAccessorImpl.invoke(DelegatingMethodAccessorImpl.java:25)
	at java.lang.reflect.Method.invoke(Method.java:597)
	at org.codehaus.plexus.classworlds.launcher.Launcher.launchStandard(Launcher.java:329)
	at org.codehaus.plexus.classworlds.launcher.Launcher.launch(Launcher.java:239)
	at org.jvnet.hudson.maven3.agent.Maven3Main.launch(Maven3Main.java:158)
	at hudson.maven.Maven3Builder.call(Maven3Builder.java:98)
	at hudson.maven.Maven3Builder.call(Maven3Builder.java:64)
	at hudson.remoting.UserRequest.perform(UserRequest.java:118)
	at hudson.remoting.UserRequest.perform(UserRequest.java:48)
	at hudson.remoting.Request$2.run(Request.java:326)
	at hudson.remoting.InterceptingExecutorService$1.call(InterceptingExecutorService.java:72)
	at java.util.concurrent.FutureTask$Sync.innerRun(FutureTask.java:303)
	at java.util.concurrent.FutureTask.run(FutureTask.java:138)
	at java.util.concurrent.ThreadPoolExecutor$Worker.runTask(ThreadPoolExecutor.java:886)
	at java.util.concurrent.ThreadPoolExecutor$Worker.run(ThreadPoolExecutor.java:908)
	at java.lang.Thread.run(Thread.java:662)
Caused by: org.sonatype.aether.resolution.ArtifactDescriptorException: Failed to read artifact
descriptor for org.fusesource.scalate:maven-scalate-plugin_2.10:jar:1.6.0-SNAPSHOT
	at org.apache.maven.repository.internal.DefaultArtifactDescriptorReader.loadPom(DefaultArtifactDescriptorReader.java:283)
	at org.apache.maven.repository.internal.DefaultArtifactDescriptorReader.readArtifactDescriptor(DefaultArtifactDescriptorReader.java:173)
	at org.sonatype.aether.impl.internal.DefaultRepositorySystem.readArtifactDescriptor(DefaultRepositorySystem.java:289)
	at org.apache.maven.plugin.internal.DefaultPluginDependenciesResolver.resolve(DefaultPluginDependenciesResolver.java:108)
	... 31 more
Caused by: org.sonatype.aether.resolution.ArtifactResolutionException: Could not find artifact
org.fusesource.scalate:maven-scalate-plugin_2.10:pom:1.6.0-SNAPSHOT
	at org.sonatype.aether.impl.internal.DefaultArtifactResolver.resolveArtifacts(DefaultArtifactResolver.java:526)
	at org.sonatype.aether.impl.internal.DefaultArtifactResolver.resolveArtifact(DefaultArtifactResolver.java:214)
	at org.apache.maven.repository.internal.DefaultArtifactDescriptorReader.loadPom(DefaultArtifactDescriptorReader.java:268)
	... 34 more
Caused by: org.sonatype.aether.transfer.ArtifactNotFoundException: Could not find artifact
org.fusesource.scalate:maven-scalate-plugin_2.10:pom:1.6.0-SNAPSHOT
	at org.sonatype.aether.impl.internal.DefaultArtifactResolver.resolveArtifacts(DefaultArtifactResolver.java:517)
	... 36 more
Sending e-mails to: commits@activemq.apache.org
Sending e-mails to: commits@activemq.apache.org
channel stopped

Mime
View raw message