activemq-commits mailing list archives

Site index · List index
Message view « Date » · « Thread »
Top « Date » · « Thread »
From Apache Jenkins Server <jenk...@builds.apache.org>
Subject Build failed in Jenkins: ActiveMQ-Apollo #833
Date Thu, 13 Dec 2012 20:01:48 GMT
See <https://builds.apache.org/job/ActiveMQ-Apollo/833/changes>

Changes:

[chirino] Pick up proton API updates.

------------------------------------------
[...truncated 7165 lines...]
INFO  | pool-1-thread-1 | Loading broker configuration from the classpath with URI: xml:classpath:apollo.xml
INFO  | pool-1-thread-1 | Loading broker configuration from the classpath with URI: xml:classpath:apollo.xml
INFO  | pool-1-thread-1 | Loading broker configuration from the classpath with URI: xml:classpath:apollo.xml
INFO  | pool-1-thread-1 | Loading broker configuration from the classpath with URI: xml:classpath:apollo.xml
INFO  | pool-1-thread-1 | Loading broker configuration from the classpath with URI: xml:classpath:apollo.xml
INFO  | pool-1-thread-1 | Loading broker configuration from the classpath with URI: xml:classpath:apollo.xml
INFO  | pool-1-thread-1 | Loading broker configuration from the classpath with URI: xml:classpath:apollo.xml
INFO  | pool-1-thread-1 | Loading broker configuration from the classpath with URI: xml:classpath:apollo.xml
INFO  | pool-1-thread-1 | Loading broker configuration from the classpath with URI: xml:classpath:apollo.xml
INFO  | pool-1-thread-1 | Loading broker configuration from the classpath with URI: xml:classpath:apollo.xml
Tests run: 22, Failures: 0, Errors: 0, Skipped: 0, Time elapsed: 0.247 sec
Running org.objectweb.jtests.jms.conform.session.TopicSessionTest
INFO  | pool-1-thread-1 | Loading broker configuration from the classpath with URI: xml:classpath:apollo.xml
INFO  | pool-1-thread-1 | Loading broker configuration from the classpath with URI: xml:classpath:apollo.xml
INFO  | pool-1-thread-1 | Loading broker configuration from the classpath with URI: xml:classpath:apollo.xml
INFO  | pool-1-thread-1 | Loading broker configuration from the classpath with URI: xml:classpath:apollo.xml
INFO  | pool-1-thread-1 | Loading broker configuration from the classpath with URI: xml:classpath:apollo.xml
INFO  | pool-1-thread-1 | Loading broker configuration from the classpath with URI: xml:classpath:apollo.xml
INFO  | pool-1-thread-1 | Loading broker configuration from the classpath with URI: xml:classpath:apollo.xml
Tests run: 7, Failures: 0, Errors: 0, Skipped: 0, Time elapsed: 0.082 sec
Running org.objectweb.jtests.jms.conform.session.QueueSessionTest
INFO  | pool-1-thread-1 | Loading broker configuration from the classpath with URI: xml:classpath:apollo.xml
INFO  | pool-1-thread-1 | Loading broker configuration from the classpath with URI: xml:classpath:apollo.xml
INFO  | pool-1-thread-1 | Loading broker configuration from the classpath with URI: xml:classpath:apollo.xml
INFO  | pool-1-thread-1 | Loading broker configuration from the classpath with URI: xml:classpath:apollo.xml
INFO  | pool-1-thread-1 | Loading broker configuration from the classpath with URI: xml:classpath:apollo.xml
Tests run: 5, Failures: 0, Errors: 0, Skipped: 0, Time elapsed: 0.069 sec
Running org.apache.activemq.apollo.joramtests.OpenwireJoramJmsTest
Tests run: 1, Failures: 0, Errors: 0, Skipped: 0, Time elapsed: 0.001 sec
Running org.objectweb.jtests.jms.conform.message.properties.JMSXPropertyTest
INFO  | pool-1-thread-1 | Loading broker configuration from the classpath with URI: xml:classpath:apollo.xml
INFO  | pool-1-thread-1 | Loading broker configuration from the classpath with URI: xml:classpath:apollo.xml
INFO  | pool-1-thread-1 | Loading broker configuration from the classpath with URI: xml:classpath:apollo.xml
Tests run: 3, Failures: 0, Errors: 0, Skipped: 0, Time elapsed: 1.4 sec
Running org.apache.activemq.apollo.ProducerFlowControlTest
INFO  | pool-1-thread-1 | Running test : test2ndPubisherWithProducerWindowSendConnectionThatIsBlocked
{protocol=OpenWire}
INFO  | pool-1-thread-1 | Starting auto fail thread...
INFO  | pool-1-thread-1 | Starting auto fail thread...
INFO  | pool-1-thread-1 | Loading broker configuration from the classpath with URI: xml:classpath:apollo.xml
INFO  | pool-1-thread-1 | Stopping auto fail thread...
INFO  | pool-1-thread-1 | Stopping auto fail thread...
INFO  | pool-1-thread-1 | Running test : testSimpleSendReceive {protocol=OpenWire}
INFO  | pool-1-thread-1 | Starting auto fail thread...
INFO  | pool-1-thread-1 | Starting auto fail thread...
INFO  | pool-1-thread-1 | Loading broker configuration from the classpath with URI: xml:classpath:apollo.xml
INFO  | pool-1-thread-1 | Stopping auto fail thread...
INFO  | pool-1-thread-1 | Stopping auto fail thread...
INFO  | pool-1-thread-1 | Running test : test2ndPubisherWithStandardConnectionThatIsBlocked
{protocol=OpenWire}
INFO  | pool-1-thread-1 | Starting auto fail thread...
INFO  | pool-1-thread-1 | Starting auto fail thread...
INFO  | pool-1-thread-1 | Loading broker configuration from the classpath with URI: xml:classpath:apollo.xml
INFO  | pool-1-thread-1 | Stopping auto fail thread...
INFO  | pool-1-thread-1 | Stopping auto fail thread...
Tests run: 3, Failures: 0, Errors: 0, Skipped: 0, Time elapsed: 6.241 sec
Running org.apache.activemq.apollo.ProducerFlowControlSendFailTest
INFO  | pool-1-thread-1 | Running test : test2ndPubisherWithStandardConnectionThatIsBlocked
{protocol=OpenWire}
INFO  | pool-1-thread-1 | Starting auto fail thread...
INFO  | pool-1-thread-1 | Starting auto fail thread...
INFO  | pool-1-thread-1 | Loading broker configuration from the classpath with URI: xml:classpath:apollo.xml
INFO  | pool-1-thread-1 | Stopping auto fail thread...
INFO  | pool-1-thread-1 | Stopping auto fail thread...
INFO  | pool-1-thread-1 | Running test : test2ndPubisherWithProducerWindowSendConnectionThatIsBlocked
{protocol=OpenWire}
INFO  | pool-1-thread-1 | Starting auto fail thread...
INFO  | pool-1-thread-1 | Starting auto fail thread...
INFO  | pool-1-thread-1 | Loading broker configuration from the classpath with URI: xml:classpath:apollo.xml
INFO  | pool-1-thread-1 | Stopping auto fail thread...
INFO  | pool-1-thread-1 | Stopping auto fail thread...
INFO  | pool-1-thread-1 | Running test : testSimpleSendReceive {protocol=OpenWire}
INFO  | pool-1-thread-1 | Starting auto fail thread...
INFO  | pool-1-thread-1 | Starting auto fail thread...
INFO  | pool-1-thread-1 | Loading broker configuration from the classpath with URI: xml:classpath:apollo.xml
INFO  | pool-1-thread-1 | Stopping auto fail thread...
INFO  | pool-1-thread-1 | Stopping auto fail thread...
Tests run: 3, Failures: 0, Errors: 0, Skipped: 0, Time elapsed: 2.253 sec
Running org.objectweb.jtests.jms.conform.message.headers.MessageHeaderTest
INFO  | pool-1-thread-1 | Loading broker configuration from the classpath with URI: xml:classpath:apollo.xml
INFO  | pool-1-thread-1 | Loading broker configuration from the classpath with URI: xml:classpath:apollo.xml
INFO  | pool-1-thread-1 | Loading broker configuration from the classpath with URI: xml:classpath:apollo.xml
INFO  | pool-1-thread-1 | Loading broker configuration from the classpath with URI: xml:classpath:apollo.xml
INFO  | pool-1-thread-1 | Loading broker configuration from the classpath with URI: xml:classpath:apollo.xml
INFO  | pool-1-thread-1 | Loading broker configuration from the classpath with URI: xml:classpath:apollo.xml
INFO  | pool-1-thread-1 | Loading broker configuration from the classpath with URI: xml:classpath:apollo.xml
INFO  | pool-1-thread-1 | Loading broker configuration from the classpath with URI: xml:classpath:apollo.xml
INFO  | pool-1-thread-1 | Loading broker configuration from the classpath with URI: xml:classpath:apollo.xml
INFO  | pool-1-thread-1 | Loading broker configuration from the classpath with URI: xml:classpath:apollo.xml
INFO  | pool-1-thread-1 | Loading broker configuration from the classpath with URI: xml:classpath:apollo.xml
INFO  | pool-1-thread-1 | Loading broker configuration from the classpath with URI: xml:classpath:apollo.xml
INFO  | pool-1-thread-1 | Loading broker configuration from the classpath with URI: xml:classpath:apollo.xml
INFO  | pool-1-thread-1 | Loading broker configuration from the classpath with URI: xml:classpath:apollo.xml
INFO  | pool-1-thread-1 | Loading broker configuration from the classpath with URI: xml:classpath:apollo.xml
INFO  | pool-1-thread-1 | Loading broker configuration from the classpath with URI: xml:classpath:apollo.xml
INFO  | pool-1-thread-1 | Loading broker configuration from the classpath with URI: xml:classpath:apollo.xml
INFO  | pool-1-thread-1 | Loading broker configuration from the classpath with URI: xml:classpath:apollo.xml
Tests run: 18, Failures: 1, Errors: 1, Skipped: 0, Time elapsed: 1.073 sec <<< FAILURE!
Running org.apache.activemq.apollo.JmsQueueBrowserTest
INFO  | pool-1-thread-1 | Running test : testReceiveBrowseReceive {protocol=STOMP}
INFO  | pool-1-thread-1 | Loading broker configuration from the classpath with URI: xml:classpath:apollo.xml
INFO  | pool-1-thread-1 | Running test : testReceiveBrowseReceive {protocol=OpenWire}
INFO  | pool-1-thread-1 | Loading broker configuration from the classpath with URI: xml:classpath:apollo.xml
INFO  | pool-1-thread-1 | Running test : testBrowseReceive {protocol=STOMP}
INFO  | pool-1-thread-1 | Loading broker configuration from the classpath with URI: xml:classpath:apollo.xml
INFO  | pool-1-thread-1 | Running test : testBrowseReceive {protocol=OpenWire}
INFO  | pool-1-thread-1 | Loading broker configuration from the classpath with URI: xml:classpath:apollo.xml
INFO  | pool-1-thread-1 | Running test : testQueueBrowserWith2Consumers {protocol=STOMP}
INFO  | pool-1-thread-1 | Loading broker configuration from the classpath with URI: xml:classpath:apollo.xml
INFO  | pool-1-thread-1 | Running test : testQueueBrowserWith2Consumers {protocol=OpenWire}
INFO  | pool-1-thread-1 | Loading broker configuration from the classpath with URI: xml:classpath:apollo.xml
INFO  | pool-1-thread-1 | Running test : testBrowseClose {protocol=STOMP}
INFO  | pool-1-thread-1 | Loading broker configuration from the classpath with URI: xml:classpath:apollo.xml
INFO  | pool-1-thread-1 | Running test : testBrowseClose {protocol=OpenWire}
INFO  | pool-1-thread-1 | Loading broker configuration from the classpath with URI: xml:classpath:apollo.xml
Tests run: 8, Failures: 0, Errors: 0, Skipped: 0, Time elapsed: 4.185 sec

Results :

Failed tests:   testJMSDestination(org.objectweb.jtests.jms.conform.message.headers.MessageHeaderTest):
sec. 3.4.1 After completion of the send it holds the destination object specified by the sending
method.(..)

Tests in error: 
  testJMSDestination(org.objectweb.jtests.jms.conform.message.headers.MessageHeaderTest):
javax.naming.NameAlreadyBoundException: anotherQueue

Tests run: 496, Failures: 1, Errors: 1, Skipped: 0

[ERROR] There are test failures.

Please refer to <https://builds.apache.org/job/ActiveMQ-Apollo/ws/trunk/apollo-itests/target/surefire-reports>
for the individual test results.
mojoSucceeded org.apache.maven.plugins:maven-surefire-plugin:2.12(default-test)
[JENKINS] Recording test results
mojoStarted org.apache.maven.plugins:maven-jar-plugin:2.3.1(default-jar)
[INFO] [INFO] Building jar: <https://builds.apache.org/job/ActiveMQ-Apollo/ws/trunk/apollo-itests/target/apollo-itests-99-trunk-SNAPSHOT.jar>

[INFO] --- maven-jar-plugin:2.3.1:jar (default-jar) @ apollo-itests ---
mojoSucceeded org.apache.maven.plugins:maven-jar-plugin:2.3.1(default-jar)
mojoStarted org.apache.maven.plugins:maven-site-plugin:3.0(attach-descriptor)
[INFO] 
[INFO] --- maven-site-plugin:3.0:attach-descriptor (attach-descriptor) @ apollo-itests ---
mojoSucceeded org.apache.maven.plugins:maven-site-plugin:3.0(attach-descriptor)
mojoStarted org.apache.maven.plugins:maven-install-plugin:2.3.1(default-install)[INFO] Installing
<https://builds.apache.org/job/ActiveMQ-Apollo/ws/trunk/apollo-itests/target/apollo-itests-99-trunk-SNAPSHOT.jar>
to /home/jenkins/jenkins-slave/maven-repositories/0/org/apache/activemq/apollo-itests/99-trunk-SNAPSHOT/apollo-itests-99-trunk-SNAPSHOT.jar
[INFO] Installing <https://builds.apache.org/job/ActiveMQ-Apollo/ws/trunk/apollo-itests/pom.xml>
to /home/jenkins/jenkins-slave/maven-repositories/0/org/apache/activemq/apollo-itests/99-trunk-SNAPSHOT/apollo-itests-99-trunk-SNAPSHOT.pom

[INFO] 
[INFO] --- maven-install-plugin:2.3.1:install (default-install) @ apollo-itests ---
mojoSucceeded org.apache.maven.plugins:maven-install-plugin:2.3.1(default-install)
projectSucceeded org.apache.activemq:apollo-itests:99-trunk-SNAPSHOT
sessionEnded
[INFO] ------------------------------------------------------------------------
[INFO] Reactor Summary:
[INFO] 
[INFO] Apache ActiveMQ Apollo Project .................... SUCCESS [33.126s]
[INFO] apollo-boot ....................................... SUCCESS [19.741s]
[INFO] apollo-scala ...................................... SUCCESS [3.113s]
[INFO] apollo-util ....................................... SUCCESS [37.242s]
[INFO] apollo-dto ........................................ SUCCESS [9.472s]
[INFO] apollo-selector ................................... SUCCESS [6.669s]
[INFO] apollo-broker ..................................... SUCCESS [53.815s]
[INFO] apollo-web ........................................ SUCCESS [39.153s]
[INFO] apollo-leveldb .................................... SUCCESS [47.094s]
[INFO] apollo-bdb ........................................ SUCCESS [29.081s]
[INFO] apollo-stomp ...................................... SUCCESS [2:25.544s]
[INFO] apollo-amqp ....................................... FAILURE [16.626s]
[INFO] apollo-mqtt ....................................... SUCCESS [41.974s]
[INFO] apollo-openwire-generator ......................... SUCCESS [12.330s]
[INFO] apollo-openwire ................................... SUCCESS [1:03.100s]
[INFO] apollo-jmx ........................................ SUCCESS [8.733s]
[INFO] apollo-cli ........................................ SKIPPED
[INFO] apollo-website .................................... SUCCESS [26.362s]
[INFO] apache-apollo ..................................... SKIPPED
[INFO] apollo-itests ..................................... SUCCESS [2:20.559s]
[INFO] ------------------------------------------------------------------------
[INFO] BUILD FAILURE
[INFO] ------------------------------------------------------------------------
[INFO] Total time: 12:20.208s
[INFO] Finished at: Thu Dec 13 20:01:34 UTC 2012
[INFO] Final Memory: 406M/1173M
[INFO] ------------------------------------------------------------------------
Projects to build: [MavenProject: org.apache.activemq:apollo-project:99-trunk-SNAPSHOT @ <https://builds.apache.org/job/ActiveMQ-Apollo/ws/trunk/pom.xml,>
MavenProject: org.apache.activemq:apollo-boot:99-trunk-SNAPSHOT @ <https://builds.apache.org/job/ActiveMQ-Apollo/ws/trunk/apollo-boot/pom.xml,>
MavenProject: org.apache.activemq:apollo-scala:99-trunk-SNAPSHOT @ <https://builds.apache.org/job/ActiveMQ-Apollo/ws/trunk/apollo-scala/pom.xml,>
MavenProject: org.apache.activemq:apollo-util:99-trunk-SNAPSHOT @ <https://builds.apache.org/job/ActiveMQ-Apollo/ws/trunk/apollo-util/pom.xml,>
MavenProject: org.apache.activemq:apollo-dto:99-trunk-SNAPSHOT @ <https://builds.apache.org/job/ActiveMQ-Apollo/ws/trunk/apollo-dto/pom.xml,>
MavenProject: org.apache.activemq:apollo-selector:99-trunk-SNAPSHOT @ <https://builds.apache.org/job/ActiveMQ-Apollo/ws/trunk/apollo-selector/pom.xml,>
MavenProject: org.apache.activemq:apollo-broker:99-trunk-SNAPSHOT @ <https://builds.apache.org/job/ActiveMQ-Apollo/ws/trunk/apollo-broker/pom.xml,>
MavenProject: org.apache.activemq:apollo-web:99-trunk-SNAPSHOT @ <https://builds.apache.org/job/ActiveMQ-Apollo/ws/trunk/apollo-web/pom.xml,>
MavenProject: org.apache.activemq:apollo-leveldb:99-trunk-SNAPSHOT @ <https://builds.apache.org/job/ActiveMQ-Apollo/ws/trunk/apollo-leveldb/pom.xml,>
MavenProject: org.apache.activemq:apollo-bdb:99-trunk-SNAPSHOT @ <https://builds.apache.org/job/ActiveMQ-Apollo/ws/trunk/apollo-bdb/pom.xml,>
MavenProject: org.apache.activemq:apollo-stomp:99-trunk-SNAPSHOT @ <https://builds.apache.org/job/ActiveMQ-Apollo/ws/trunk/apollo-stomp/pom.xml,>
MavenProject: org.apache.activemq:apollo-amqp:99-trunk-SNAPSHOT @ <https://builds.apache.org/job/ActiveMQ-Apollo/ws/trunk/apollo-amqp/pom.xml,>
MavenProject: org.apache.activemq:apollo-mqtt:99-trunk-SNAPSHOT @ <https://builds.apache.org/job/ActiveMQ-Apollo/ws/trunk/apollo-mqtt/pom.xml,>
MavenProject: org.apache.activemq:apollo-openwire-generator:99-trunk-SNAPSHOT @ <https://builds.apache.org/job/ActiveMQ-Apollo/ws/trunk/apollo-openwire-generator/pom.xml,>
MavenProject: org.apache.activemq:apollo-openwire:99-trunk-SNAPSHOT @ <https://builds.apache.org/job/ActiveMQ-Apollo/ws/trunk/apollo-openwire/pom.xml,>
MavenProject: org.apache.activemq:apollo-jmx:99-trunk-SNAPSHOT @ <https://builds.apache.org/job/ActiveMQ-Apollo/ws/trunk/apollo-jmx/pom.xml,>
MavenProject: org.apache.activemq:apollo-cli:99-trunk-SNAPSHOT @ <https://builds.apache.org/job/ActiveMQ-Apollo/ws/trunk/apollo-cli/pom.xml,>
MavenProject: org.apache.activemq:apollo-website:99-trunk-SNAPSHOT @ <https://builds.apache.org/job/ActiveMQ-Apollo/ws/trunk/apollo-website/pom.xml,>
MavenProject: org.apache.activemq:apache-apollo:99-trunk-SNAPSHOT @ <https://builds.apache.org/job/ActiveMQ-Apollo/ws/trunk/apollo-distro/pom.xml,>
MavenProject: org.apache.activemq:apollo-itests:99-trunk-SNAPSHOT @ <https://builds.apache.org/job/ActiveMQ-Apollo/ws/trunk/apollo-itests/pom.xml]>
[JENKINS] Archiving disabled
[JENKINS] Archiving disabled
[JENKINS] Archiving disabled
[JENKINS] Archiving disabled
[JENKINS] Archiving disabled
[JENKINS] Archiving disabled
[JENKINS] Archiving disabled
[JENKINS] Archiving disabled
[JENKINS] Archiving disabled
[JENKINS] Archiving disabled
[JENKINS] Archiving disabled
[JENKINS] Archiving disabled
[JENKINS] Archiving disabled
[JENKINS] Archiving disabled
[JENKINS] Archiving disabled
[JENKINS] Archiving disabled
[JENKINS] Archiving disabled
[JENKINS] Archiving disabled
[JENKINS] Archiving disabled
[JENKINS] Archiving disabled
Waiting for Jenkins to finish collecting data
mavenExecutionResult exceptions not empty
message : Failed to execute goal org.scala-tools:maven-scala-plugin:2.15.2:compile (compile)
on project apollo-amqp: wrap: org.apache.commons.exec.ExecuteException: Process exited with
an error: 1(Exit value: 1)
cause : wrap: org.apache.commons.exec.ExecuteException: Process exited with an error: 1(Exit
value: 1)
Stack trace : 
org.apache.maven.lifecycle.LifecycleExecutionException: Failed to execute goal org.scala-tools:maven-scala-plugin:2.15.2:compile
(compile) on project apollo-amqp: wrap: org.apache.commons.exec.ExecuteException: Process
exited with an error: 1(Exit value: 1)
	at org.apache.maven.lifecycle.internal.MojoExecutor.execute(MojoExecutor.java:217)
	at org.apache.maven.lifecycle.internal.MojoExecutor.execute(MojoExecutor.java:153)
	at org.apache.maven.lifecycle.internal.MojoExecutor.execute(MojoExecutor.java:145)
	at org.apache.maven.lifecycle.internal.LifecycleModuleBuilder.buildProject(LifecycleModuleBuilder.java:84)
	at org.apache.maven.lifecycle.internal.LifecycleModuleBuilder.buildProject(LifecycleModuleBuilder.java:59)
	at org.apache.maven.lifecycle.internal.LifecycleStarter.singleThreadedBuild(LifecycleStarter.java:183)
	at org.apache.maven.lifecycle.internal.LifecycleStarter.execute(LifecycleStarter.java:161)
	at org.apache.maven.DefaultMaven.doExecute(DefaultMaven.java:319)
	at org.apache.maven.DefaultMaven.execute(DefaultMaven.java:156)
	at org.jvnet.hudson.maven3.launcher.Maven3Launcher.main(Maven3Launcher.java:79)
	at sun.reflect.NativeMethodAccessorImpl.invoke0(Native Method)
	at sun.reflect.NativeMethodAccessorImpl.invoke(NativeMethodAccessorImpl.java:39)
	at sun.reflect.DelegatingMethodAccessorImpl.invoke(DelegatingMethodAccessorImpl.java:25)
	at java.lang.reflect.Method.invoke(Method.java:597)
	at org.codehaus.plexus.classworlds.launcher.Launcher.launchStandard(Launcher.java:329)
	at org.codehaus.plexus.classworlds.launcher.Launcher.launch(Launcher.java:239)
	at org.jvnet.hudson.maven3.agent.Maven3Main.launch(Maven3Main.java:158)
	at hudson.maven.Maven3Builder.call(Maven3Builder.java:98)
	at hudson.maven.Maven3Builder.call(Maven3Builder.java:64)
	at hudson.remoting.UserRequest.perform(UserRequest.java:118)
	at hudson.remoting.UserRequest.perform(UserRequest.java:48)
	at hudson.remoting.Request$2.run(Request.java:326)
	at hudson.remoting.InterceptingExecutorService$1.call(InterceptingExecutorService.java:72)
	at java.util.concurrent.FutureTask$Sync.innerRun(FutureTask.java:303)
	at java.util.concurrent.FutureTask.run(FutureTask.java:138)
	at java.util.concurrent.ThreadPoolExecutor$Worker.runTask(ThreadPoolExecutor.java:886)
	at java.util.concurrent.ThreadPoolExecutor$Worker.run(ThreadPoolExecutor.java:908)
	at java.lang.Thread.run(Thread.java:662)
Caused by: org.apache.maven.plugin.MojoExecutionException: wrap: org.apache.commons.exec.ExecuteException:
Process exited with an error: 1(Exit value: 1)
	at org_scala_tools_maven.ScalaMojoSupport.execute(ScalaMojoSupport.java:350)
	at org.apache.maven.plugin.DefaultBuildPluginManager.executeMojo(DefaultBuildPluginManager.java:107)
	at org.apache.maven.lifecycle.internal.MojoExecutor.execute(MojoExecutor.java:209)
	... 27 more
Caused by: org.apache.commons.exec.ExecuteException: Process exited with an error: 1(Exit
value: 1)
	at org.apache.commons.exec.DefaultExecutor.executeInternal(DefaultExecutor.java:346)
	at org.apache.commons.exec.DefaultExecutor.execute(DefaultExecutor.java:149)
	at org.apache.commons.exec.DefaultExecutor.execute(DefaultExecutor.java:136)
	at org_scala_tools_maven_executions.JavaMainCallerByFork.run(JavaMainCallerByFork.java:80)
	at org_scala_tools_maven.ScalaCompilerSupport.compile(ScalaCompilerSupport.java:124)
	at org_scala_tools_maven.ScalaCompilerSupport.doExecute(ScalaCompilerSupport.java:80)
	at org_scala_tools_maven.ScalaMojoSupport.execute(ScalaMojoSupport.java:342)
	... 29 more
Maven failed with error.
Sending e-mails to: commits@activemq.apache.org
Sending e-mails to: commits@activemq.apache.org
Sending e-mails to: commits@activemq.apache.org
Sending e-mails to: commits@activemq.apache.org
channel stopped

Mime
View raw message