activemq-commits mailing list archives

Site index · List index
Message view « Date » · « Thread »
Top « Date » · « Thread »
From Apache Jenkins Server <jenk...@builds.apache.org>
Subject Build failed in Jenkins: ActiveMQ-Apollo-Deploy » apollo-amqp #330
Date Thu, 13 Dec 2012 03:59:20 GMT
See <https://builds.apache.org/job/ActiveMQ-Apollo-Deploy/org.apache.activemq$apollo-amqp/330/changes>

Changes:

[chirino] Return the right type of exception to the openwire clients when they try to unsubscribe
with an invalid sub name.

------------------------------------------
projectStarted org.apache.activemq:apollo-amqp:99-trunk-SNAPSHOT
[INFO]                                                                         
[INFO] ------------------------------------------------------------------------
[INFO] Building apollo-amqp 99-trunk-SNAPSHOT
[INFO] ------------------------------------------------------------------------
Downloading: http://repository.apache.org/snapshots/org/apache/qpid/proton-hawtdispatch/1.0-SNAPSHOT/maven-metadata.xml
Downloading: http://download.oracle.com/maven/org/apache/qpid/proton-hawtdispatch/1.0-SNAPSHOT/maven-metadata.xml
Downloading: http://repo.fusesource.com/nexus/content/groups/public-snapshots/org/apache/qpid/proton-hawtdispatch/1.0-SNAPSHOT/maven-metadata.xml
Downloaded: http://repository.apache.org/snapshots/org/apache/qpid/proton-hawtdispatch/1.0-SNAPSHOT/maven-metadata.xml
(778 B at 2.2 KB/sec)
Downloading: http://repository.apache.org/snapshots/org/apache/qpid/proton-hawtdispatch/1.0-SNAPSHOT/proton-hawtdispatch-1.0-20121213.034533-9.pom
Downloaded: http://repository.apache.org/snapshots/org/apache/qpid/proton-hawtdispatch/1.0-SNAPSHOT/proton-hawtdispatch-1.0-20121213.034533-9.pom
(3 KB at 21.3 KB/sec)
Downloading: http://repository.apache.org/snapshots/org/apache/qpid/proton-project/1.0-SNAPSHOT/maven-metadata.xml
Downloading: http://repo.fusesource.com/nexus/content/groups/public-snapshots/org/apache/qpid/proton-project/1.0-SNAPSHOT/maven-metadata.xml
Downloading: http://download.oracle.com/maven/org/apache/qpid/proton-project/1.0-SNAPSHOT/maven-metadata.xml
Downloaded: http://repository.apache.org/snapshots/org/apache/qpid/proton-project/1.0-SNAPSHOT/maven-metadata.xml
(604 B at 1.6 KB/sec)
Downloading: http://repository.apache.org/snapshots/org/apache/qpid/proton-project/1.0-SNAPSHOT/proton-project-1.0-20121213.034504-12.pom
Downloaded: http://repository.apache.org/snapshots/org/apache/qpid/proton-project/1.0-SNAPSHOT/proton-project-1.0-20121213.034504-12.pom
(3 KB at 27.4 KB/sec)
Downloading: http://repository.apache.org/snapshots/org/apache/qpid/proton/1.0-SNAPSHOT/maven-metadata.xml
Downloading: http://repo.fusesource.com/nexus/content/groups/public-snapshots/org/apache/qpid/proton/1.0-SNAPSHOT/maven-metadata.xml
Downloading: http://download.oracle.com/maven/org/apache/qpid/proton/1.0-SNAPSHOT/maven-metadata.xml
Downloaded: http://repository.apache.org/snapshots/org/apache/qpid/proton/1.0-SNAPSHOT/maven-metadata.xml
(768 B at 3.1 KB/sec)
Downloading: http://repository.apache.org/snapshots/org/apache/qpid/proton/1.0-SNAPSHOT/proton-1.0-20121213.034522-11.pom
Downloaded: http://repository.apache.org/snapshots/org/apache/qpid/proton/1.0-SNAPSHOT/proton-1.0-20121213.034522-11.pom
(3 KB at 21.6 KB/sec)
Downloading: http://repository.apache.org/snapshots/org/apache/qpid/proton-api/1.0-SNAPSHOT/maven-metadata.xml
Downloading: http://download.oracle.com/maven/org/apache/qpid/proton-api/1.0-SNAPSHOT/maven-metadata.xml
Downloading: http://repo.fusesource.com/nexus/content/groups/public-snapshots/org/apache/qpid/proton-api/1.0-SNAPSHOT/maven-metadata.xml
Downloaded: http://repository.apache.org/snapshots/org/apache/qpid/proton-api/1.0-SNAPSHOT/maven-metadata.xml
(769 B at 2.3 KB/sec)
Downloading: http://repository.apache.org/snapshots/org/apache/qpid/proton-api/1.0-SNAPSHOT/proton-api-1.0-20121213.034514-1.pom
Downloaded: http://repository.apache.org/snapshots/org/apache/qpid/proton-api/1.0-SNAPSHOT/proton-api-1.0-20121213.034514-1.pom
(2 KB at 6.6 KB/sec)
Downloading: http://repository.apache.org/snapshots/org/apache/qpid/qpid-amqp-1-0-client-jms/0.22-SNAPSHOT/maven-metadata.xml
Downloading: http://repo.fusesource.com/nexus/content/groups/public-snapshots/org/apache/qpid/qpid-amqp-1-0-client-jms/0.22-SNAPSHOT/maven-metadata.xml
Downloading: http://download.oracle.com/maven/org/apache/qpid/qpid-amqp-1-0-client-jms/0.22-SNAPSHOT/maven-metadata.xml
Downloaded: http://repository.apache.org/snapshots/org/apache/qpid/qpid-amqp-1-0-client-jms/0.22-SNAPSHOT/maven-metadata.xml
(375 B at 0.8 KB/sec)
Downloading: http://repository.apache.org/snapshots/org/apache/qpid/qpid-amqp-1-0-client-jms/0.22-SNAPSHOT/qpid-amqp-1-0-client-jms-0.22-20121212.234802-16.pom
Downloaded: http://repository.apache.org/snapshots/org/apache/qpid/qpid-amqp-1-0-client-jms/0.22-SNAPSHOT/qpid-amqp-1-0-client-jms-0.22-20121212.234802-16.pom
(2 KB at 6.5 KB/sec)
Downloading: http://repository.apache.org/snapshots/org/apache/qpid/qpid-amqp-1-0-common/0.22-SNAPSHOT/maven-metadata.xml
Downloading: http://repo.fusesource.com/nexus/content/groups/public-snapshots/org/apache/qpid/qpid-amqp-1-0-common/0.22-SNAPSHOT/maven-metadata.xml
Downloading: http://download.oracle.com/maven/org/apache/qpid/qpid-amqp-1-0-common/0.22-SNAPSHOT/maven-metadata.xml
Downloaded: http://repository.apache.org/snapshots/org/apache/qpid/qpid-amqp-1-0-common/0.22-SNAPSHOT/maven-metadata.xml
(371 B at 2.1 KB/sec)
Downloading: http://repository.apache.org/snapshots/org/apache/qpid/qpid-amqp-1-0-common/0.22-SNAPSHOT/qpid-amqp-1-0-common-0.22-20121212.234643-16.pom
Downloaded: http://repository.apache.org/snapshots/org/apache/qpid/qpid-amqp-1-0-common/0.22-SNAPSHOT/qpid-amqp-1-0-common-0.22-20121212.234643-16.pom
(876 B at 2.4 KB/sec)
Downloading: http://repository.apache.org/snapshots/org/apache/qpid/qpid-amqp-1-0-client/0.22-SNAPSHOT/maven-metadata.xml
Downloading: http://repo.fusesource.com/nexus/content/groups/public-snapshots/org/apache/qpid/qpid-amqp-1-0-client/0.22-SNAPSHOT/maven-metadata.xml
Downloading: http://download.oracle.com/maven/org/apache/qpid/qpid-amqp-1-0-client/0.22-SNAPSHOT/maven-metadata.xml
Downloaded: http://repository.apache.org/snapshots/org/apache/qpid/qpid-amqp-1-0-client/0.22-SNAPSHOT/maven-metadata.xml
(371 B at 1.6 KB/sec)
Downloading: http://repository.apache.org/snapshots/org/apache/qpid/qpid-amqp-1-0-client/0.22-SNAPSHOT/qpid-amqp-1-0-client-0.22-20121212.234743-16.pom
Downloaded: http://repository.apache.org/snapshots/org/apache/qpid/qpid-amqp-1-0-client/0.22-SNAPSHOT/qpid-amqp-1-0-client-0.22-20121212.234743-16.pom
(2 KB at 1.2 KB/sec)
Downloading: http://repository.apache.org/snapshots/org/apache/qpid/proton-hawtdispatch/1.0-SNAPSHOT/proton-hawtdispatch-1.0-20121213.034533-9.jar
Downloading: http://repository.apache.org/snapshots/org/apache/qpid/proton/1.0-SNAPSHOT/proton-1.0-20121213.034522-11.jar
Downloading: http://repository.apache.org/snapshots/org/apache/qpid/proton-api/1.0-SNAPSHOT/proton-api-1.0-20121213.034514-1.jar
Downloading: http://repository.apache.org/snapshots/org/apache/qpid/qpid-amqp-1-0-client-jms/0.22-SNAPSHOT/qpid-amqp-1-0-client-jms-0.22-20121212.234802-16.jar
Downloading: http://repository.apache.org/snapshots/org/apache/qpid/qpid-amqp-1-0-common/0.22-SNAPSHOT/qpid-amqp-1-0-common-0.22-20121212.234643-16.jar
Downloaded: http://repository.apache.org/snapshots/org/apache/qpid/proton-hawtdispatch/1.0-SNAPSHOT/proton-hawtdispatch-1.0-20121213.034533-9.jar
(82 KB at 141.2 KB/sec)
Downloading: http://repository.apache.org/snapshots/org/apache/qpid/qpid-amqp-1-0-client/0.22-SNAPSHOT/qpid-amqp-1-0-client-0.22-20121212.234743-16.jar
Downloaded: http://repository.apache.org/snapshots/org/apache/qpid/qpid-amqp-1-0-client-jms/0.22-SNAPSHOT/qpid-amqp-1-0-client-jms-0.22-20121212.234802-16.jar
(114 KB at 176.1 KB/sec)
Downloaded: http://repository.apache.org/snapshots/org/apache/qpid/proton-api/1.0-SNAPSHOT/proton-api-1.0-20121213.034514-1.jar
(95 KB at 145.1 KB/sec)
Downloaded: http://repository.apache.org/snapshots/org/apache/qpid/proton/1.0-SNAPSHOT/proton-1.0-20121213.034522-11.jar
(378 KB at 525.1 KB/sec)
Downloaded: http://repository.apache.org/snapshots/org/apache/qpid/qpid-amqp-1-0-client/0.22-SNAPSHOT/qpid-amqp-1-0-client-0.22-20121212.234743-16.jar
(38 KB at 149.2 KB/sec)
Downloaded: http://repository.apache.org/snapshots/org/apache/qpid/qpid-amqp-1-0-common/0.22-SNAPSHOT/qpid-amqp-1-0-common-0.22-20121212.234643-16.jar
(517 KB at 600.9 KB/sec)
mojoStarted org.apache.maven.plugins:maven-clean-plugin:2.4.1(default-clean)
[INFO] 
[INFO] --- maven-clean-plugin:2.4.1:clean (default-clean) @ apollo-amqp ---
mojoSucceeded org.apache.maven.plugins:maven-clean-plugin:2.4.1(default-clean)
mojoStarted org.apache.maven.plugins:maven-enforcer-plugin:1.0(default)
[INFO] 
[INFO] --- maven-enforcer-plugin:1.0:enforce (default) @ apollo-amqp ---
mojoSucceeded org.apache.maven.plugins:maven-enforcer-plugin:1.0(default)
mojoStarted org.apache.maven.plugins:maven-remote-resources-plugin:1.1(default)
[INFO] 
[INFO] --- maven-remote-resources-plugin:1.1:process (default) @ apollo-amqp ---
mojoSucceeded org.apache.maven.plugins:maven-remote-resources-plugin:1.1(default)
mojoStarted org.apache.maven.plugins:maven-resources-plugin:2.4.3(default-resources)[INFO]
Using 'UTF-8' encoding to copy filtered resources.
[INFO] skip non existing resourceDirectory <https://builds.apache.org/job/ActiveMQ-Apollo-Deploy/org.apache.activemq$apollo-amqp/ws/target/schema>

[INFO] [INFO] Copying 5 resources

[INFO] --- maven-resources-plugin:2.4.3:resources (default-resources) @ apollo-amqp ---
[INFO] Copying 3 resources
mojoSucceeded org.apache.maven.plugins:maven-resources-plugin:2.4.3(default-resources)
mojoStarted org.apache.maven.plugins:maven-compiler-plugin:2.3.2(default-compile)
[INFO] 
[INFO] [INFO] Compiling 3 source files to <https://builds.apache.org/job/ActiveMQ-Apollo-Deploy/org.apache.activemq$apollo-amqp/ws/target/classes>
--- maven-compiler-plugin:2.3.2:compile (default-compile) @ apollo-amqp ---
mojoSucceeded org.apache.maven.plugins:maven-compiler-plugin:2.3.2(default-compile)
mojoStarted org.scala-tools:maven-scala-plugin:2.15.2(compile)[INFO] Checking for multiple
versions of scala

[INFO] 
[INFO] --- maven-scala-plugin:2.15.2:compile (compile) @ apollo-amqp ---
[WARNING]  Expected all dependencies to require Scala version: 2.9.2
[WARNING]  org.apache.activemq:apollo-util:99-trunk-SNAPSHOT requires scala version: 2.9.2
[WARNING]  org.apache.activemq:apollo-broker:99-trunk-SNAPSHOT requires scala version: 2.9.2
[WARNING]  org.fusesource.scalate:scalate-util:1.5.3 requires scala version: 2.9.1
[WARNING] Multiple versions of scala libraries detected!
[INFO] includes = [**/*.scala,**/*.java,]
[INFO] excludes = []
[INFO] /x1/jenkins/jenkins-slave/workspace/ActiveMQ-Apollo-Deploy/trunk/apollo-amqp/src/main/scala:-1:
info: compiling
[INFO] Compiling 7 source files to /x1/jenkins/jenkins-slave/workspace/ActiveMQ-Apollo-Deploy/trunk/apollo-amqp/target/classes
at 1355371044346
[INFO] compiler plugin: BasicArtifact(org.fusesource.jvmassert,jvmassert,1.3)
[ERROR] /x1/jenkins/jenkins-slave/workspace/ActiveMQ-Apollo-Deploy/trunk/apollo-amqp/src/main/scala/org/apache/activemq/apollo/amqp/AmqpMessage.scala:31:
error: object type is not a member of package org.apache.qpid.proton
[INFO] import org.apache.qpid.proton.`type`.{UnsignedLong, UnsignedInteger}
[INFO]                               ^
[ERROR] /x1/jenkins/jenkins-slave/workspace/ActiveMQ-Apollo-Deploy/trunk/apollo-amqp/src/main/scala/org/apache/activemq/apollo/amqp/AmqpMessage.scala:32:
error: object type is not a member of package org.apache.qpid.proton
[INFO] import org.apache.qpid.proton.`type`.messaging.{Properties, Header}
[INFO]                               ^
[ERROR] /x1/jenkins/jenkins-slave/workspace/ActiveMQ-Apollo-Deploy/trunk/apollo-amqp/src/main/scala/org/apache/activemq/apollo/amqp/AmqpMessage.scala:85:
error: trait Message is abstract; cannot be instantiated
[INFO]       val amqp = new org.apache.qpid.proton.message.Message();
[INFO]                  ^
[ERROR] /x1/jenkins/jenkins-slave/workspace/ActiveMQ-Apollo-Deploy/trunk/apollo-amqp/src/main/scala/org/apache/activemq/apollo/amqp/AmqpMessage.scala:104:
error: not enough arguments for method encode: (x$1: Array[Byte], x$2: Int, x$3: Int)Int.
[INFO] Unspecified value parameters x$2, x$3.
[INFO]       var c = decoded_message.encode(new CompositeWritableBuffer(new WritableBuffer.ByteBufferWrapper(buffer),
overflow));
[INFO]                                     ^
[ERROR] /x1/jenkins/jenkins-slave/workspace/ActiveMQ-Apollo-Deploy/trunk/apollo-amqp/src/main/scala/org/apache/activemq/apollo/amqp/AmqpMessage.scala:107:
error: not enough arguments for method encode: (x$1: Array[Byte], x$2: Int, x$3: Int)Int.
[INFO] Unspecified value parameters x$2, x$3.
[INFO]           c = decoded_message.encode(new WritableBuffer.ByteBufferWrapper(buffer));
[INFO]                                     ^
[ERROR] /x1/jenkins/jenkins-slave/workspace/ActiveMQ-Apollo-Deploy/trunk/apollo-amqp/src/main/scala/org/apache/activemq/apollo/amqp/AmqpMessage.scala:152:
error: object type is not a member of package org.apache.qpid.proton
[INFO]         rc = ma.getValue.get(org.apache.qpid.proton.`type`.Symbol.valueOf(name))
[INFO]                                                     ^
[ERROR] /x1/jenkins/jenkins-slave/workspace/ActiveMQ-Apollo-Deploy/trunk/apollo-amqp/src/main/scala/org/apache/activemq/apollo/amqp/AmqpMessage.scala:244:
error: value longValue is not a member of java.lang.Object
[INFO]       case x:UnsignedInteger => new java.lang.Long(x.longValue());
[INFO]                                                      ^
[ERROR] /x1/jenkins/jenkins-slave/workspace/ActiveMQ-Apollo-Deploy/trunk/apollo-amqp/src/main/scala/org/apache/activemq/apollo/amqp/AmqpMessage.scala:245:
error: value longValue is not a member of java.lang.Object
[INFO]       case x:UnsignedLong => new java.lang.Long(x.longValue());
[INFO]                                                   ^
[ERROR] /x1/jenkins/jenkins-slave/workspace/ActiveMQ-Apollo-Deploy/trunk/apollo-amqp/src/main/scala/org/apache/activemq/apollo/amqp/AmqpProtocolHandler.scala:49:
error: type is not a member of org.apache.qpid.proton
[INFO] import org.apache.qpid.proton.{`type` => proton_type}
[INFO]        ^
[ERROR] /x1/jenkins/jenkins-slave/workspace/ActiveMQ-Apollo-Deploy/trunk/apollo-amqp/src/main/scala/org/apache/activemq/apollo/amqp/AmqpProtocolHandler.scala:52:
error: not found: object proton_type
[INFO] import proton_type.messaging._
[INFO]        ^
[ERROR] /x1/jenkins/jenkins-slave/workspace/ActiveMQ-Apollo-Deploy/trunk/apollo-amqp/src/main/scala/org/apache/activemq/apollo/amqp/AmqpProtocolHandler.scala:50:
error: not found: object proton_type
[INFO] import proton_type.{Symbol => AmqpSymbol, UnsignedInteger, Binary, DescribedType}
[INFO]        ^
[ERROR] /x1/jenkins/jenkins-slave/workspace/ActiveMQ-Apollo-Deploy/trunk/apollo-amqp/src/main/scala/org/apache/activemq/apollo/amqp/AmqpProtocolHandler.scala:51:
error: not found: object proton_type
[INFO] import proton_type.transport.SenderSettleMode
[INFO]        ^
[ERROR] /x1/jenkins/jenkins-slave/workspace/ActiveMQ-Apollo-Deploy/trunk/apollo-amqp/src/main/scala/org/apache/activemq/apollo/amqp/AmqpProtocolHandler.scala:137:
error: too many arguments for constructor Object: ()java.lang.Object
[INFO]   class ProtocolException(msg: String) extends RuntimeException(msg)
[INFO]                          ^
[ERROR] /x1/jenkins/jenkins-slave/workspace/ActiveMQ-Apollo-Deploy/trunk/apollo-amqp/src/main/scala/org/apache/activemq/apollo/amqp/AmqpProtocolHandler.scala:645:
error: value rollback is not a member of type parameter B
[INFO]         tx.rollback
[INFO]            ^
[ERROR] /x1/jenkins/jenkins-slave/workspace/ActiveMQ-Apollo-Deploy/trunk/apollo-amqp/src/main/scala/org/apache/activemq/apollo/amqp/AmqpProtocolHandler.scala:169:
error: type mismatch;
[INFO]  found   : AmqpProtocolHandler.this.Break
[INFO]  required: java.lang.Throwable
[INFO]     throw new Break()
[INFO]           ^
[ERROR] /x1/jenkins/jenkins-slave/workspace/ActiveMQ-Apollo-Deploy/trunk/apollo-amqp/src/main/scala/org/apache/activemq/apollo/amqp/AmqpProtocolHandler.scala:536:
error: value length is not a member of Any
[INFO]       def is_multi_destination = if (requested_addresses.length > 1) {
[INFO]                                                          ^
[ERROR] /x1/jenkins/jenkins-slave/workspace/ActiveMQ-Apollo-Deploy/trunk/apollo-amqp/src/main/scala/org/apache/activemq/apollo/amqp/AmqpProtocolHandler.scala:539:
error: Any does not take parameters
[INFO]         PathParser.containsWildCards(requested_addresses(0).path)
[INFO]                                                         ^
[ERROR] /x1/jenkins/jenkins-slave/workspace/ActiveMQ-Apollo-Deploy/trunk/apollo-amqp/src/main/scala/org/apache/activemq/apollo/amqp/AmqpProtocolHandler.scala:553:
error: value foreach is not a member of Any
[INFO]         requested_addresses.foreach {
[INFO]                             ^
[ERROR] /x1/jenkins/jenkins-slave/workspace/ActiveMQ-Apollo-Deploy/trunk/apollo-amqp/src/main/scala/org/apache/activemq/apollo/amqp/AmqpProtocolHandler.scala:568:
error: could not find implicit value for evidence parameter of type ClassManifest[A]
[INFO]           dsubs += SubscriptionAddress(destination_parser.decode_path(sender.getName),
s, topics.toArray)
[INFO]                                                                                   
              ^
[ERROR] /x1/jenkins/jenkins-slave/workspace/ActiveMQ-Apollo-Deploy/trunk/apollo-amqp/src/main/scala/org/apache/activemq/apollo/amqp/AmqpProtocolHandler.scala:570:
error: could not find implicit value for evidence parameter of type ClassManifest[A]
[INFO]         dsubs.toArray
[INFO]               ^
[ERROR] /x1/jenkins/jenkins-slave/workspace/ActiveMQ-Apollo-Deploy/trunk/apollo-amqp/src/main/scala/org/apache/activemq/apollo/amqp/AmqpProtocolHandler.scala:780:
error: too many arguments for constructor Object: ()java.lang.Object
[INFO]   class AmqpProducerRoute(val id:Long, val receiver: Receiver, val addresses: Array[SimpleAddress])
extends DeliveryProducerRoute(host.router) with ProducerSupport {
[INFO]                          ^
[ERROR] /x1/jenkins/jenkins-slave/workspace/ActiveMQ-Apollo-Deploy/trunk/apollo-amqp/src/main/scala/org/apache/activemq/apollo/amqp/AmqpProtocolHandler.scala:793:
error: too many arguments for constructor Object: ()java.lang.Object
[INFO]     val producer_overflow = new OverflowSink[Delivery](this) {
[INFO]                                 ^
[ERROR] /x1/jenkins/jenkins-slave/workspace/ActiveMQ-Apollo-Deploy/trunk/apollo-amqp/src/main/scala/org/apache/activemq/apollo/amqp/AmqpProtocolHandler.scala:841:
error: value getTxnId is not a member of org.apache.qpid.proton.amqp.transport.DeliveryState
[INFO]           transactions.get(toLong(state.getTxnId())) match {
[INFO]                                         ^
[ERROR] /x1/jenkins/jenkins-slave/workspace/ActiveMQ-Apollo-Deploy/trunk/apollo-amqp/src/main/scala/org/apache/activemq/apollo/amqp/AmqpProtocolHandler.scala:853:
error: value offer is not a member of AnyRef
[INFO]           val accepted = producer_overflow.offer(d)
[INFO]                                            ^
[ERROR] /x1/jenkins/jenkins-slave/workspace/ActiveMQ-Apollo-Deploy/trunk/apollo-amqp/src/main/scala/org/apache/activemq/apollo/amqp/AmqpProtocolHandler.scala:1193:
error: value getContext is not a member of type parameter A
[INFO]         val value = v.getContext.asInstanceOf[(Session[Delivery], Delivery)]
[INFO]                       ^
[ERROR] /x1/jenkins/jenkins-slave/workspace/ActiveMQ-Apollo-Deploy/trunk/apollo-amqp/src/main/scala/org/apache/activemq/apollo/amqp/AmqpProtocolHandler.scala:889:
error: value dispose is not a member of AnyRef
[INFO]         super.dispose()
[INFO]               ^
[ERROR] /x1/jenkins/jenkins-slave/workspace/ActiveMQ-Apollo-Deploy/trunk/apollo-amqp/src/main/scala/org/apache/activemq/apollo/amqp/AmqpProtocolHandler.scala:904:
error: value release is not a member of AnyRef{def dispose(): Unit}
[INFO]       base_retained.release()
[INFO]                     ^
[ERROR] /x1/jenkins/jenkins-slave/workspace/ActiveMQ-Apollo-Deploy/trunk/apollo-amqp/src/main/scala/org/apache/activemq/apollo/amqp/AmqpProtocolHandler.scala:908:
error: value retain is not a member of AnyRef{def dispose(): Unit}
[INFO]       base_retained.retain()
[INFO]                     ^
[ERROR] /x1/jenkins/jenkins-slave/workspace/ActiveMQ-Apollo-Deploy/trunk/apollo-amqp/src/main/scala/org/apache/activemq/apollo/amqp/AmqpProtocolHandler.scala:910:
error: value retained is not a member of AnyRef{def dispose(): Unit}
[INFO]     def retained() = base_retained.retained()
[INFO]                                    ^
[ERROR] /x1/jenkins/jenkins-slave/workspace/ActiveMQ-Apollo-Deploy/trunk/apollo-amqp/src/main/scala/org/apache/activemq/apollo/amqp/AmqpProtocolHandler.scala:997:
error: too many arguments for constructor Object: ()java.lang.Object
[INFO]     val session_manager = new SessionSinkMux[Delivery](FullSink(), queue, Delivery,
100, buffer_size) {
[INFO]                               ^
[ERROR] /x1/jenkins/jenkins-slave/workspace/ActiveMQ-Apollo-Deploy/trunk/apollo-amqp/src/main/scala/org/apache/activemq/apollo/amqp/AmqpProtocolHandler.scala:1068:
error: value poll is not a member of AnyRef
[INFO]           super.poll
[INFO]                 ^
[ERROR] /x1/jenkins/jenkins-slave/workspace/ActiveMQ-Apollo-Deploy/trunk/apollo-amqp/src/main/scala/org/apache/activemq/apollo/amqp/AmqpProtocolHandler.scala:1081:
error: value getTxnId is not a member of org.apache.qpid.proton.amqp.transport.DeliveryState
[INFO]           transactions.get(toLong(state.getTxnId())) match {
[INFO]                                         ^
[ERROR] /x1/jenkins/jenkins-slave/workspace/ActiveMQ-Apollo-Deploy/trunk/apollo-amqp/src/main/scala/org/apache/activemq/apollo/amqp/AmqpProtocolHandler.scala:1160:
error: value full is not a member of AnyRef with AnyRef with ScalaObject
[INFO]         val rc = super.full
[INFO]                        ^
[ERROR] 33 errors found
mojoFailed org.scala-tools:maven-scala-plugin:2.15.2(compile)
projectFailed org.apache.activemq:apollo-amqp:99-trunk-SNAPSHOT

Mime
View raw message