activemq-commits mailing list archives

Site index · List index
Message view « Date » · « Thread »
Top « Date » · « Thread »
From Apache Jenkins Server <jenk...@builds.apache.org>
Subject Build failed in Jenkins: ActiveMQ-Apollo #817
Date Fri, 16 Nov 2012 00:05:44 GMT
See <https://builds.apache.org/job/ActiveMQ-Apollo/817/changes>

Changes:

[chirino] Upgrade to jackson 2.1.0

[chirino] Clean up scala sources so the are more compatible /w Scala 2.10

------------------------------------------
[...truncated 6130 lines...]
[INFO]     processing <https://builds.apache.org/job/ActiveMQ-Apollo/ws/trunk/apollo-website/src/community/source.page>
with uri: /community/source.page => 
[INFO]     processing <https://builds.apache.org/job/ActiveMQ-Apollo/ws/trunk/apollo-website/src/community/faq.page>
with uri: /community/faq.page => 
[INFO]     processing <https://builds.apache.org/job/ActiveMQ-Apollo/ws/trunk/apollo-website/src/community/support.page>
with uri: /community/support.page => 
[INFO]     processing <https://builds.apache.org/job/ActiveMQ-Apollo/ws/trunk/apollo-website/src/community/developers.page>
with uri: /community/developers.page => 
[INFO]     processing <https://builds.apache.org/job/ActiveMQ-Apollo/ws/trunk/apollo-website/src/community/site.page>
with uri: /community/site.page => 
[INFO]     processing <https://builds.apache.org/job/ActiveMQ-Apollo/ws/trunk/apollo-website/src/index.page>
with uri: /index.page => 
Using dir: <https://builds.apache.org/job/ActiveMQ-Apollo/ws/trunk/apollo-website/src/blog>
at request path: /blog
[INFO]     processing <https://builds.apache.org/job/ActiveMQ-Apollo/ws/trunk/apollo-website/src/blog/index.rss.feed>
with uri: /blog/index.rss.feed => 
Using dir: <https://builds.apache.org/job/ActiveMQ-Apollo/ws/trunk/apollo-website/src/blog>
at request path: /blog
[INFO]     processing <https://builds.apache.org/job/ActiveMQ-Apollo/ws/trunk/apollo-website/src/blog/index.page>
with uri: /blog/index.page => 
[INFO]     processing <https://builds.apache.org/job/ActiveMQ-Apollo/ws/trunk/apollo-website/src/blog/releases/release-1.2.page>
with uri: /blog/releases/release-1.2.page => 
[INFO]     processing <https://builds.apache.org/job/ActiveMQ-Apollo/ws/trunk/apollo-website/src/blog/releases/release-1.5.page>
with uri: /blog/releases/release-1.5.page => 
[INFO]     processing <https://builds.apache.org/job/ActiveMQ-Apollo/ws/trunk/apollo-website/src/blog/releases/release-1-0-beta6.page>
with uri: /blog/releases/release-1-0-beta6.page => 
[INFO]     processing <https://builds.apache.org/job/ActiveMQ-Apollo/ws/trunk/apollo-website/src/blog/releases/release-1-0-beta3.page>
with uri: /blog/releases/release-1-0-beta3.page => 
[INFO]     processing <https://builds.apache.org/job/ActiveMQ-Apollo/ws/trunk/apollo-website/src/blog/releases/release-1-0-beta4.page>
with uri: /blog/releases/release-1-0-beta4.page => 
[INFO]     processing <https://builds.apache.org/job/ActiveMQ-Apollo/ws/trunk/apollo-website/src/blog/releases/release-1-0-beta5.page>
with uri: /blog/releases/release-1-0-beta5.page => 
[INFO]     processing <https://builds.apache.org/job/ActiveMQ-Apollo/ws/trunk/apollo-website/src/blog/releases/release-1-0-beta2.page>
with uri: /blog/releases/release-1-0-beta2.page => 
[INFO]     processing <https://builds.apache.org/job/ActiveMQ-Apollo/ws/trunk/apollo-website/src/blog/releases/release-1.4.page>
with uri: /blog/releases/release-1.4.page => 
[INFO]     processing <https://builds.apache.org/job/ActiveMQ-Apollo/ws/trunk/apollo-website/src/blog/releases/release-1.0.page>
with uri: /blog/releases/release-1.0.page => 
[INFO]     processing <https://builds.apache.org/job/ActiveMQ-Apollo/ws/trunk/apollo-website/src/blog/releases/release-1.1.page>
with uri: /blog/releases/release-1.1.page => 
[INFO]     processing <https://builds.apache.org/job/ActiveMQ-Apollo/ws/trunk/apollo-website/src/blog/releases/release-1-0-beta1.page>
with uri: /blog/releases/release-1-0-beta1.page => 
[INFO]     processing <https://builds.apache.org/job/ActiveMQ-Apollo/ws/trunk/apollo-website/src/blog/releases/release-1.3.page>
with uri: /blog/releases/release-1.3.page => 
[INFO]     processing <https://builds.apache.org/job/ActiveMQ-Apollo/ws/trunk/apollo-website/src/versions/index.page>
with uri: /versions/index.page => 
[INFO]     processing <https://builds.apache.org/job/ActiveMQ-Apollo/ws/trunk/apollo-website/src/privacy-policy.page>
with uri: /privacy-policy.page => 
[INFO]     processing <https://builds.apache.org/job/ActiveMQ-Apollo/ws/trunk/apollo-website/src/documentation/architecture.md>
with uri: /documentation/architecture.md => 
[INFO]     processing <https://builds.apache.org/job/ActiveMQ-Apollo/ws/trunk/apollo-website/src/documentation/index.page>
with uri: /documentation/index.page => 
[INFO]     processing <https://builds.apache.org/job/ActiveMQ-Apollo/ws/trunk/apollo-website/src/documentation/openwire-manual.md>
with uri: /documentation/openwire-manual.md => 
[INFO]     processing <https://builds.apache.org/job/ActiveMQ-Apollo/ws/trunk/apollo-website/src/documentation/performance-scaling.md>
with uri: /documentation/performance-scaling.md => 
[INFO]     processing <https://builds.apache.org/job/ActiveMQ-Apollo/ws/trunk/apollo-website/src/documentation/migration-guide.md>
with uri: /documentation/migration-guide.md => 
[INFO]     processing <https://builds.apache.org/job/ActiveMQ-Apollo/ws/trunk/apollo-website/src/documentation/user-manual.md>
with uri: /documentation/user-manual.md => 
[INFO]     processing <https://builds.apache.org/job/ActiveMQ-Apollo/ws/trunk/apollo-website/src/documentation/management-api.md>
with uri: /documentation/management-api.md => 
[INFO]     processing <https://builds.apache.org/job/ActiveMQ-Apollo/ws/trunk/apollo-website/src/documentation/getting-started.md>
with uri: /documentation/getting-started.md => 
[INFO]     processing <https://builds.apache.org/job/ActiveMQ-Apollo/ws/trunk/apollo-website/src/documentation/stomp-manual.md>
with uri: /documentation/stomp-manual.md => 
[INFO]     processing <https://builds.apache.org/job/ActiveMQ-Apollo/ws/trunk/apollo-website/src/documentation/module-organization.page>
with uri: /documentation/module-organization.page => 
[INFO]     processing <https://builds.apache.org/job/ActiveMQ-Apollo/ws/trunk/apollo-website/src/documentation/extending-guide.md>
with uri: /documentation/extending-guide.md => 
[INFO]     processing <https://builds.apache.org/job/ActiveMQ-Apollo/ws/trunk/apollo-website/src/documentation/verification.md>
with uri: /documentation/verification.md => 
[INFO]     processing <https://builds.apache.org/job/ActiveMQ-Apollo/ws/trunk/apollo-website/src/download.page>
with uri: /download.page => 
mojoSucceeded org.fusesource.scalate:maven-scalate-plugin:1.5.3(sitegen)
mojoStarted org.apache.maven.plugins:maven-install-plugin:2.3.1(default-install)[INFO] Installing
<https://builds.apache.org/job/ActiveMQ-Apollo/ws/trunk/apollo-website/pom.xml> to /home/jenkins/jenkins-slave/maven-repositories/0/org/apache/activemq/apollo-website/99-trunk-SNAPSHOT/apollo-website-99-trunk-SNAPSHOT.pom

[INFO] 
[INFO] --- maven-install-plugin:2.3.1:install (default-install) @ apollo-website ---
mojoSucceeded org.apache.maven.plugins:maven-install-plugin:2.3.1(default-install)
projectSucceeded org.apache.activemq:apollo-website:99-trunk-SNAPSHOT
projectStarted org.apache.activemq:apache-apollo:99-trunk-SNAPSHOT
[INFO]                                                                         
[INFO] ------------------------------------------------------------------------
[INFO] Building apache-apollo 99-trunk-SNAPSHOT
[INFO] ------------------------------------------------------------------------
mojoStarted org.apache.maven.plugins:maven-clean-plugin:2.4.1(default-clean)
[INFO] 
[INFO] --- maven-clean-plugin:2.4.1:clean (default-clean) @ apache-apollo ---
mojoSucceeded org.apache.maven.plugins:maven-clean-plugin:2.4.1(default-clean)
mojoStarted org.apache.maven.plugins:maven-enforcer-plugin:1.0(default)
[INFO] 
[INFO] --- maven-enforcer-plugin:1.0:enforce (default) @ apache-apollo ---
mojoSucceeded org.apache.maven.plugins:maven-enforcer-plugin:1.0(default)
mojoStarted org.apache.maven.plugins:maven-remote-resources-plugin:1.1(default)
[INFO] 
[INFO] --- maven-remote-resources-plugin:1.1:process (default) @ apache-apollo ---
mojoSucceeded org.apache.maven.plugins:maven-remote-resources-plugin:1.1(default)
mojoStarted org.apache.maven.plugins:maven-site-plugin:3.0(attach-descriptor)
[INFO] 
[INFO] --- maven-site-plugin:3.0:attach-descriptor (attach-descriptor) @ apache-apollo ---
mojoSucceeded org.apache.maven.plugins:maven-site-plugin:3.0(attach-descriptor)
mojoStarted org.apache.maven.plugins:maven-assembly-plugin:2.2.1(unix-bin)
[INFO] 
[INFO] --- maven-assembly-plugin:2.2.1:single (unix-bin) @ apache-apollo ---
[INFO] Reading assembly descriptor: <https://builds.apache.org/job/ActiveMQ-Apollo/ws/trunk/apollo-distro/src/main/descriptors/unix-bin.xml>
[WARNING] Cannot include project artifact: org.apache.activemq:apache-apollo:pom:99-trunk-SNAPSHOT;
it doesn't have an associated file or directory.
[WARNING] The following patterns were never triggered in this artifact inclusion filter:
o  'commons-logging:commons-logging'
o  'org.apache.activemq:activemq-jmdns_1.0'
o  'org.apache.commons:commons-math'
o  'org.fusesource.stompjms:stompjms-client'
o  'org.apache.qpid:qpid-proton'

[WARNING] Cannot include project artifact: org.apache.activemq:apache-apollo:pom:99-trunk-SNAPSHOT;
it doesn't have an associated file or directory.
[INFO] Building tar : <https://builds.apache.org/job/ActiveMQ-Apollo/ws/trunk/apollo-distro/target/apache-apollo-99-trunk-SNAPSHOT-unix-distro.tar.gz>
mojoSucceeded org.apache.maven.plugins:maven-assembly-plugin:2.2.1(unix-bin)
mojoStarted org.apache.maven.plugins:maven-assembly-plugin:2.2.1(windows-bin)[INFO] Reading
assembly descriptor: <https://builds.apache.org/job/ActiveMQ-Apollo/ws/trunk/apollo-distro/src/main/descriptors/windows-bin.xml>

[INFO] 
[INFO] --- maven-assembly-plugin:2.2.1:single (windows-bin) @ apache-apollo ---
[WARNING] Cannot include project artifact: org.apache.activemq:apache-apollo:pom:99-trunk-SNAPSHOT;
it doesn't have an associated file or directory.
[WARNING] The following patterns were never triggered in this artifact inclusion filter:
o  'commons-logging:commons-logging'
o  'org.apache.activemq:activemq-jmdns_1.0'
o  'org.apache.commons:commons-math'
o  'org.fusesource.stompjms:stompjms-client'
o  'org.apache.qpid:qpid-proton'

[WARNING] Cannot include project artifact: org.apache.activemq:apache-apollo:pom:99-trunk-SNAPSHOT;
it doesn't have an associated file or directory.
[INFO] Building zip: <https://builds.apache.org/job/ActiveMQ-Apollo/ws/trunk/apollo-distro/target/apache-apollo-99-trunk-SNAPSHOT-windows-distro.zip>
mojoSucceeded org.apache.maven.plugins:maven-assembly-plugin:2.2.1(windows-bin)
mojoStarted org.apache.maven.plugins:maven-install-plugin:2.3.1(default-install)[INFO] Installing
<https://builds.apache.org/job/ActiveMQ-Apollo/ws/trunk/apollo-distro/pom.xml> to /home/jenkins/jenkins-slave/maven-repositories/0/org/apache/activemq/apache-apollo/99-trunk-SNAPSHOT/apache-apollo-99-trunk-SNAPSHOT.pom
[INFO] Installing <https://builds.apache.org/job/ActiveMQ-Apollo/ws/trunk/apollo-distro/target/apache-apollo-99-trunk-SNAPSHOT-unix-distro.tar.gz>
to /home/jenkins/jenkins-slave/maven-repositories/0/org/apache/activemq/apache-apollo/99-trunk-SNAPSHOT/apache-apollo-99-trunk-SNAPSHOT-unix-distro.tar.gz

[INFO] 
[INFO] --- maven-install-plugin:2.3.1:install (default-install) @ apache-apollo ---
[INFO] Installing <https://builds.apache.org/job/ActiveMQ-Apollo/ws/trunk/apollo-distro/target/apache-apollo-99-trunk-SNAPSHOT-windows-distro.zip>
to /home/jenkins/jenkins-slave/maven-repositories/0/org/apache/activemq/apache-apollo/99-trunk-SNAPSHOT/apache-apollo-99-trunk-SNAPSHOT-windows-distro.zip
mojoSucceeded org.apache.maven.plugins:maven-install-plugin:2.3.1(default-install)
projectSucceeded org.apache.activemq:apache-apollo:99-trunk-SNAPSHOT
projectStarted org.apache.activemq:apollo-itests:99-trunk-SNAPSHOT
[INFO]                                                                         
[INFO] ------------------------------------------------------------------------
[INFO] Building apollo-itests 99-trunk-SNAPSHOT
[INFO] ------------------------------------------------------------------------
Downloading: http://download.oracle.com/maven/org/codehaus/jackson/jackson-core-asl/2.1.0/jackson-core-asl-2.1.0.pom
Downloading: http://repo.fusesource.com/nexus/content/groups/public/org/codehaus/jackson/jackson-core-asl/2.1.0/jackson-core-asl-2.1.0.pom
Downloading: http://repo1.maven.org/maven2/org/codehaus/jackson/jackson-core-asl/2.1.0/jackson-core-asl-2.1.0.pom
[WARNING] The POM for org.codehaus.jackson:jackson-core-asl:jar:2.1.0 is missing, no dependency
information available
Downloading: http://download.oracle.com/maven/org/codehaus/jackson/jackson-mapper-asl/2.1.0/jackson-mapper-asl-2.1.0.pom
Downloading: http://repo.fusesource.com/nexus/content/groups/public/org/codehaus/jackson/jackson-mapper-asl/2.1.0/jackson-mapper-asl-2.1.0.pom
Downloading: http://repo1.maven.org/maven2/org/codehaus/jackson/jackson-mapper-asl/2.1.0/jackson-mapper-asl-2.1.0.pom
[WARNING] The POM for org.codehaus.jackson:jackson-mapper-asl:jar:2.1.0 is missing, no dependency
information available
Downloading: http://download.oracle.com/maven/org/codehaus/jackson/jackson-core-asl/2.1.0/jackson-core-asl-2.1.0.jar
Downloading: http://download.oracle.com/maven/org/codehaus/jackson/jackson-mapper-asl/2.1.0/jackson-mapper-asl-2.1.0.jar
Downloading: http://repo.fusesource.com/nexus/content/groups/public/org/codehaus/jackson/jackson-core-asl/2.1.0/jackson-core-asl-2.1.0.jar
Downloading: http://repo.fusesource.com/nexus/content/groups/public/org/codehaus/jackson/jackson-mapper-asl/2.1.0/jackson-mapper-asl-2.1.0.jar
Downloading: http://repo1.maven.org/maven2/org/codehaus/jackson/jackson-core-asl/2.1.0/jackson-core-asl-2.1.0.jar
Downloading: http://repo1.maven.org/maven2/org/codehaus/jackson/jackson-mapper-asl/2.1.0/jackson-mapper-asl-2.1.0.jar
projectFailed org.apache.activemq:apollo-itests:99-trunk-SNAPSHOT
sessionEnded
[INFO] ------------------------------------------------------------------------
[INFO] Reactor Summary:
[INFO] 
[INFO] Apache ActiveMQ Apollo Project .................... SUCCESS [27.495s]
[INFO] apollo-boot ....................................... SUCCESS [16.466s]
[INFO] apollo-scala ...................................... SUCCESS [2.625s]
[INFO] apollo-util ....................................... SUCCESS [40.019s]
[INFO] apollo-dto ........................................ SUCCESS [15.483s]
[INFO] apollo-selector ................................... SUCCESS [5.836s]
[INFO] apollo-broker ..................................... SUCCESS [56.158s]
[INFO] apollo-web ........................................ SUCCESS [52.727s]
[INFO] apollo-leveldb .................................... SUCCESS [46.268s]
[INFO] apollo-bdb ........................................ SUCCESS [29.092s]
[INFO] apollo-stomp ...................................... SUCCESS [1:43.210s]
[INFO] apollo-mqtt ....................................... SUCCESS [42.423s]
[INFO] apollo-openwire-generator ......................... SUCCESS [11.035s]
[INFO] apollo-openwire ................................... SUCCESS [59.523s]
[INFO] apollo-cli ........................................ SUCCESS [21.012s]
[INFO] apollo-website .................................... SUCCESS [26.189s]
[INFO] apache-apollo ..................................... SUCCESS [12.649s]
[INFO] apollo-itests ..................................... FAILURE [4.728s]
[INFO] ------------------------------------------------------------------------
[INFO] BUILD FAILURE
[INFO] ------------------------------------------------------------------------
[INFO] Total time: 9:40.760s
[INFO] Finished at: Fri Nov 16 00:05:32 UTC 2012
[INFO] Final Memory: 385M/1134M
[INFO] ------------------------------------------------------------------------
Projects to build: [MavenProject: org.apache.activemq:apollo-project:99-trunk-SNAPSHOT @ <https://builds.apache.org/job/ActiveMQ-Apollo/ws/trunk/pom.xml,>
MavenProject: org.apache.activemq:apollo-boot:99-trunk-SNAPSHOT @ <https://builds.apache.org/job/ActiveMQ-Apollo/ws/trunk/apollo-boot/pom.xml,>
MavenProject: org.apache.activemq:apollo-scala:99-trunk-SNAPSHOT @ <https://builds.apache.org/job/ActiveMQ-Apollo/ws/trunk/apollo-scala/pom.xml,>
MavenProject: org.apache.activemq:apollo-util:99-trunk-SNAPSHOT @ <https://builds.apache.org/job/ActiveMQ-Apollo/ws/trunk/apollo-util/pom.xml,>
MavenProject: org.apache.activemq:apollo-dto:99-trunk-SNAPSHOT @ <https://builds.apache.org/job/ActiveMQ-Apollo/ws/trunk/apollo-dto/pom.xml,>
MavenProject: org.apache.activemq:apollo-selector:99-trunk-SNAPSHOT @ <https://builds.apache.org/job/ActiveMQ-Apollo/ws/trunk/apollo-selector/pom.xml,>
MavenProject: org.apache.activemq:apollo-broker:99-trunk-SNAPSHOT @ <https://builds.apache.org/job/ActiveMQ-Apollo/ws/trunk/apollo-broker/pom.xml,>
MavenProject: org.apache.activemq:apollo-web:99-trunk-SNAPSHOT @ <https://builds.apache.org/job/ActiveMQ-Apollo/ws/trunk/apollo-web/pom.xml,>
MavenProject: org.apache.activemq:apollo-leveldb:99-trunk-SNAPSHOT @ <https://builds.apache.org/job/ActiveMQ-Apollo/ws/trunk/apollo-leveldb/pom.xml,>
MavenProject: org.apache.activemq:apollo-bdb:99-trunk-SNAPSHOT @ <https://builds.apache.org/job/ActiveMQ-Apollo/ws/trunk/apollo-bdb/pom.xml,>
MavenProject: org.apache.activemq:apollo-stomp:99-trunk-SNAPSHOT @ <https://builds.apache.org/job/ActiveMQ-Apollo/ws/trunk/apollo-stomp/pom.xml,>
MavenProject: org.apache.activemq:apollo-mqtt:99-trunk-SNAPSHOT @ <https://builds.apache.org/job/ActiveMQ-Apollo/ws/trunk/apollo-mqtt/pom.xml,>
MavenProject: org.apache.activemq:apollo-openwire-generator:99-trunk-SNAPSHOT @ <https://builds.apache.org/job/ActiveMQ-Apollo/ws/trunk/apollo-openwire-generator/pom.xml,>
MavenProject: org.apache.activemq:apollo-openwire:99-trunk-SNAPSHOT @ <https://builds.apache.org/job/ActiveMQ-Apollo/ws/trunk/apollo-openwire/pom.xml,>
MavenProject: org.apache.activemq:apollo-cli:99-trunk-SNAPSHOT @ <https://builds.apache.org/job/ActiveMQ-Apollo/ws/trunk/apollo-cli/pom.xml,>
MavenProject: org.apache.activemq:apollo-website:99-trunk-SNAPSHOT @ <https://builds.apache.org/job/ActiveMQ-Apollo/ws/trunk/apollo-website/pom.xml,>
MavenProject: org.apache.activemq:apache-apollo:99-trunk-SNAPSHOT @ <https://builds.apache.org/job/ActiveMQ-Apollo/ws/trunk/apollo-distro/pom.xml,>
MavenProject: org.apache.activemq:apollo-itests:99-trunk-SNAPSHOT @ <https://builds.apache.org/job/ActiveMQ-Apollo/ws/trunk/apollo-itests/pom.xml]>
[JENKINS] Archiving disabled - not archiving <https://builds.apache.org/job/ActiveMQ-Apollo/ws/trunk/apollo-util/pom.xml>
[JENKINS] Archiving disabled - not archiving <https://builds.apache.org/job/ActiveMQ-Apollo/ws/trunk/apollo-util/target/apollo-util-99-trunk-SNAPSHOT.jar>
[JENKINS] Archiving disabled - not archiving <https://builds.apache.org/job/ActiveMQ-Apollo/ws/trunk/apollo-util/target/apollo-util-99-trunk-SNAPSHOT-tests.jar>
[JENKINS] Archiving disabled - not archiving <https://builds.apache.org/job/ActiveMQ-Apollo/ws/trunk/apollo-openwire-generator/pom.xml>
[JENKINS] Archiving disabled - not archiving <https://builds.apache.org/job/ActiveMQ-Apollo/ws/trunk/apollo-openwire-generator/target/apollo-openwire-generator-99-trunk-SNAPSHOT.jar>
[JENKINS] Archiving disabled - not archiving <https://builds.apache.org/job/ActiveMQ-Apollo/ws/trunk/apollo-stomp/pom.xml>
[JENKINS] Archiving disabled - not archiving <https://builds.apache.org/job/ActiveMQ-Apollo/ws/trunk/apollo-stomp/target/apollo-stomp-99-trunk-SNAPSHOT.jar>
[JENKINS] Archiving disabled - not archiving <https://builds.apache.org/job/ActiveMQ-Apollo/ws/trunk/apollo-stomp/target/apollo-stomp-99-trunk-SNAPSHOT-tests.jar>
[JENKINS] Archiving disabled - not archiving <https://builds.apache.org/job/ActiveMQ-Apollo/ws/trunk/apollo-distro/pom.xml>
[JENKINS] Archiving disabled - not archiving <https://builds.apache.org/job/ActiveMQ-Apollo/ws/trunk/apollo-distro/target/apache-apollo-99-trunk-SNAPSHOT-unix-distro.tar.gz>
[JENKINS] Archiving disabled - not archiving <https://builds.apache.org/job/ActiveMQ-Apollo/ws/trunk/apollo-distro/target/apache-apollo-99-trunk-SNAPSHOT-windows-distro.zip>
[JENKINS] Archiving disabled - not archiving <https://builds.apache.org/job/ActiveMQ-Apollo/ws/trunk/apollo-boot/pom.xml>
[JENKINS] Archiving disabled - not archiving <https://builds.apache.org/job/ActiveMQ-Apollo/ws/trunk/apollo-boot/target/apollo-boot-99-trunk-SNAPSHOT.jar>
[JENKINS] Archiving disabled - not archiving <https://builds.apache.org/job/ActiveMQ-Apollo/ws/trunk/apollo-website/pom.xml>
[JENKINS] Archiving disabled - not archiving <https://builds.apache.org/job/ActiveMQ-Apollo/ws/trunk/apollo-bdb/pom.xml>
[JENKINS] Archiving disabled - not archiving <https://builds.apache.org/job/ActiveMQ-Apollo/ws/trunk/apollo-bdb/target/apollo-bdb-99-trunk-SNAPSHOT.jar>
[JENKINS] Archiving disabled - not archiving <https://builds.apache.org/job/ActiveMQ-Apollo/ws/trunk/apollo-selector/pom.xml>
[JENKINS] Archiving disabled - not archiving <https://builds.apache.org/job/ActiveMQ-Apollo/ws/trunk/apollo-selector/target/apollo-selector-99-trunk-SNAPSHOT.jar>
[JENKINS] Archiving disabled - not archiving <https://builds.apache.org/job/ActiveMQ-Apollo/ws/trunk/pom.xml>
[JENKINS] Archiving disabled - not archiving <https://builds.apache.org/job/ActiveMQ-Apollo/ws/trunk/apollo-openwire/pom.xml>
[JENKINS] Archiving disabled - not archiving <https://builds.apache.org/job/ActiveMQ-Apollo/ws/trunk/apollo-openwire/target/apollo-openwire-99-trunk-SNAPSHOT.jar>
[JENKINS] Archiving disabled - not archiving <https://builds.apache.org/job/ActiveMQ-Apollo/ws/trunk/apollo-web/pom.xml>
[JENKINS] Archiving disabled - not archiving <https://builds.apache.org/job/ActiveMQ-Apollo/ws/trunk/apollo-web/target/apollo-web-99-trunk-SNAPSHOT.jar>
[JENKINS] Archiving disabled - not archiving <https://builds.apache.org/job/ActiveMQ-Apollo/ws/trunk/apollo-leveldb/pom.xml>
[JENKINS] Archiving disabled - not archiving <https://builds.apache.org/job/ActiveMQ-Apollo/ws/trunk/apollo-leveldb/target/apollo-leveldb-99-trunk-SNAPSHOT.jar>
[JENKINS] Archiving disabled - not archiving <https://builds.apache.org/job/ActiveMQ-Apollo/ws/trunk/apollo-scala/pom.xml>
[JENKINS] Archiving disabled - not archiving <https://builds.apache.org/job/ActiveMQ-Apollo/ws/trunk/apollo-mqtt/pom.xml>
[JENKINS] Archiving disabled - not archiving <https://builds.apache.org/job/ActiveMQ-Apollo/ws/trunk/apollo-mqtt/target/apollo-mqtt-99-trunk-SNAPSHOT.jar>
[JENKINS] Archiving disabled - not archiving <https://builds.apache.org/job/ActiveMQ-Apollo/ws/trunk/apollo-mqtt/target/apollo-mqtt-99-trunk-SNAPSHOT-tests.jar>
[JENKINS] Archiving disabled - not archiving <https://builds.apache.org/job/ActiveMQ-Apollo/ws/trunk/apollo-dto/pom.xml>
[JENKINS] Archiving disabled - not archiving <https://builds.apache.org/job/ActiveMQ-Apollo/ws/trunk/apollo-dto/target/apollo-dto-99-trunk-SNAPSHOT.jar>
[JENKINS] Archiving disabled - not archiving <https://builds.apache.org/job/ActiveMQ-Apollo/ws/trunk/apollo-broker/pom.xml>
[JENKINS] Archiving disabled - not archiving <https://builds.apache.org/job/ActiveMQ-Apollo/ws/trunk/apollo-broker/target/apollo-broker-99-trunk-SNAPSHOT.jar>
[JENKINS] Archiving disabled - not archiving <https://builds.apache.org/job/ActiveMQ-Apollo/ws/trunk/apollo-broker/target/apollo-broker-99-trunk-SNAPSHOT-tests.jar>
[JENKINS] Archiving disabled - not archiving <https://builds.apache.org/job/ActiveMQ-Apollo/ws/trunk/apollo-cli/pom.xml>
[JENKINS] Archiving disabled - not archiving <https://builds.apache.org/job/ActiveMQ-Apollo/ws/trunk/apollo-cli/target/apollo-cli-99-trunk-SNAPSHOT.jar>
[JENKINS] Archiving disabled - not archiving <https://builds.apache.org/job/ActiveMQ-Apollo/ws/trunk/apollo-itests/pom.xml>
Waiting for Jenkins to finish collecting data
mavenExecutionResult exceptions not empty
message : Failed to execute goal on project apollo-itests: Could not resolve dependencies
for project org.apache.activemq:apollo-itests:jar:99-trunk-SNAPSHOT: The following artifacts
could not be resolved: org.codehaus.jackson:jackson-core-asl:jar:2.1.0, org.codehaus.jackson:jackson-mapper-asl:jar:2.1.0:
Could not find artifact org.codehaus.jackson:jackson-core-asl:jar:2.1.0 in oracleReleases
(http://download.oracle.com/maven)
cause : Could not resolve dependencies for project org.apache.activemq:apollo-itests:jar:99-trunk-SNAPSHOT:
The following artifacts could not be resolved: org.codehaus.jackson:jackson-core-asl:jar:2.1.0,
org.codehaus.jackson:jackson-mapper-asl:jar:2.1.0: Could not find artifact org.codehaus.jackson:jackson-core-asl:jar:2.1.0
in oracleReleases (http://download.oracle.com/maven)
Stack trace : 
org.apache.maven.lifecycle.LifecycleExecutionException: Failed to execute goal on project
apollo-itests: Could not resolve dependencies for project org.apache.activemq:apollo-itests:jar:99-trunk-SNAPSHOT:
The following artifacts could not be resolved: org.codehaus.jackson:jackson-core-asl:jar:2.1.0,
org.codehaus.jackson:jackson-mapper-asl:jar:2.1.0: Could not find artifact org.codehaus.jackson:jackson-core-asl:jar:2.1.0
in oracleReleases (http://download.oracle.com/maven)
	at org.apache.maven.lifecycle.internal.LifecycleDependencyResolver.getDependencies(LifecycleDependencyResolver.java:190)
	at org.apache.maven.lifecycle.internal.LifecycleDependencyResolver.resolveProjectDependencies(LifecycleDependencyResolver.java:104)
	at org.apache.maven.lifecycle.internal.MojoExecutor.ensureDependenciesAreResolved(MojoExecutor.java:258)
	at org.apache.maven.lifecycle.internal.MojoExecutor.execute(MojoExecutor.java:201)
	at org.apache.maven.lifecycle.internal.MojoExecutor.execute(MojoExecutor.java:153)
	at org.apache.maven.lifecycle.internal.MojoExecutor.execute(MojoExecutor.java:145)
	at org.apache.maven.lifecycle.internal.LifecycleModuleBuilder.buildProject(LifecycleModuleBuilder.java:84)
	at org.apache.maven.lifecycle.internal.LifecycleModuleBuilder.buildProject(LifecycleModuleBuilder.java:59)
	at org.apache.maven.lifecycle.internal.LifecycleStarter.singleThreadedBuild(LifecycleStarter.java:183)
	at org.apache.maven.lifecycle.internal.LifecycleStarter.execute(LifecycleStarter.java:161)
	at org.apache.maven.DefaultMaven.doExecute(DefaultMaven.java:319)
	at org.apache.maven.DefaultMaven.execute(DefaultMaven.java:156)
	at org.jvnet.hudson.maven3.launcher.Maven3Launcher.main(Maven3Launcher.java:79)
	at sun.reflect.NativeMethodAccessorImpl.invoke0(Native Method)
	at sun.reflect.NativeMethodAccessorImpl.invoke(NativeMethodAccessorImpl.java:39)
	at sun.reflect.DelegatingMethodAccessorImpl.invoke(DelegatingMethodAccessorImpl.java:25)
	at java.lang.reflect.Method.invoke(Method.java:597)
	at org.codehaus.plexus.classworlds.launcher.Launcher.launchStandard(Launcher.java:329)
	at org.codehaus.plexus.classworlds.launcher.Launcher.launch(Launcher.java:239)
	at org.jvnet.hudson.maven3.agent.Maven3Main.launch(Maven3Main.java:158)
	at hudson.maven.Maven3Builder.call(Maven3Builder.java:98)
	at hudson.maven.Maven3Builder.call(Maven3Builder.java:64)
	at hudson.remoting.UserRequest.perform(UserRequest.java:118)
	at hudson.remoting.UserRequest.perform(UserRequest.java:48)
	at hudson.remoting.Request$2.run(Request.java:326)
	at hudson.remoting.InterceptingExecutorService$1.call(InterceptingExecutorService.java:72)
	at java.util.concurrent.FutureTask$Sync.innerRun(FutureTask.java:303)
	at java.util.concurrent.FutureTask.run(FutureTask.java:138)
	at java.util.concurrent.ThreadPoolExecutor$Worker.runTask(ThreadPoolExecutor.java:886)
	at java.util.concurrent.ThreadPoolExecutor$Worker.run(ThreadPoolExecutor.java:908)
	at java.lang.Thread.run(Thread.java:662)
Caused by: org.apache.maven.project.DependencyResolutionException: Could not resolve dependencies
for project org.apache.activemq:apollo-itests:jar:99-trunk-SNAPSHOT: The following artifacts
could not be resolved: org.codehaus.jackson:jackson-core-asl:jar:2.1.0, org.codehaus.jackson:jackson-mapper-asl:jar:2.1.0:
Could not find artifact org.codehaus.jackson:jackson-core-asl:jar:2.1.0 in oracleReleases
(http://download.oracle.com/maven)
	at org.apache.maven.project.DefaultProjectDependenciesResolver.resolve(DefaultProjectDependenciesResolver.java:156)
	at org.apache.maven.lifecycle.internal.LifecycleDependencyResolver.getDependencies(LifecycleDependencyResolver.java:165)
	... 30 more
Caused by: org.sonatype.aether.resolution.ArtifactResolutionException: The following artifacts
could not be resolved: org.codehaus.jackson:jackson-core-asl:jar:2.1.0, org.codehaus.jackson:jackson-mapper-asl:jar:2.1.0:
Could not find artifact org.codehaus.jackson:jackson-core-asl:jar:2.1.0 in oracleReleases
(http://download.oracle.com/maven)
	at org.sonatype.aether.impl.internal.DefaultArtifactResolver.resolveArtifacts(DefaultArtifactResolver.java:526)
	at org.sonatype.aether.impl.internal.DefaultRepositorySystem.resolveArtifacts(DefaultRepositorySystem.java:304)
	at org.sonatype.aether.impl.internal.DefaultRepositorySystem.resolveDependencies(DefaultRepositorySystem.java:334)
	at org.apache.maven.project.DefaultProjectDependenciesResolver.resolve(DefaultProjectDependenciesResolver.java:150)
	... 31 more
Caused by: org.sonatype.aether.transfer.ArtifactNotFoundException: Could not find artifact
org.codehaus.jackson:jackson-core-asl:jar:2.1.0 in oracleReleases (http://download.oracle.com/maven)
	at org.sonatype.aether.connector.wagon.WagonRepositoryConnector$4.wrap(WagonRepositoryConnector.java:945)
	at org.sonatype.aether.connector.wagon.WagonRepositoryConnector$4.wrap(WagonRepositoryConnector.java:940)
	at org.sonatype.aether.connector.wagon.WagonRepositoryConnector$GetTask.flush(WagonRepositoryConnector.java:696)
	at org.sonatype.aether.connector.wagon.WagonRepositoryConnector$GetTask.flush(WagonRepositoryConnector.java:690)
	at org.sonatype.aether.connector.wagon.WagonRepositoryConnector.get(WagonRepositoryConnector.java:435)
	at org.sonatype.aether.impl.internal.DefaultArtifactResolver.resolveArtifacts(DefaultArtifactResolver.java:438)
	... 34 more
Maven failed with error.
Sending e-mails to: commits@activemq.apache.org
Sending e-mails to: commits@activemq.apache.org
channel stopped

Mime
View raw message