activemq-commits mailing list archives

Site index · List index
Message view « Date » · « Thread »
Top « Date » · « Thread »
From Apache Jenkins Server <jenk...@builds.apache.org>
Subject Build failed in Jenkins: ActiveMQ-Apollo-Deploy #322
Date Tue, 27 Nov 2012 03:19:02 GMT
See <https://builds.apache.org/job/ActiveMQ-Apollo-Deploy/322/changes>

Changes:

[chirino] remove invalide jackson dependency from the itests module.

[chirino] Support configuring the client_auth setting on wss transports.

[chirino] Upgrade to the latest stable release of Jetty.

[chirino] Also test the wss protocol.

------------------------------------------
[...truncated 4757 lines...]

[INFO] 
[INFO] --- maven-antrun-plugin:1.7:run (default) @ apollo-website ---
[INFO] Executing tasks
mojoSucceeded org.apache.maven.plugins:maven-antrun-plugin:1.7(default)
main:
[INFO] Executed tasks

mojoStarted org.apache.maven.plugins:maven-remote-resources-plugin:1.1(default)
[INFO] 
[INFO] --- maven-remote-resources-plugin:1.1:process (default) @ apollo-website ---
mojoSucceeded org.apache.maven.plugins:maven-remote-resources-plugin:1.1(default)
mojoStarted org.scala-tools:maven-scala-plugin:2.15.2(default)[INFO] Checking for multiple
versions of scala
[WARNING]  Expected all dependencies to require Scala version: 2.9.2
[WARNING]  org.fusesource.scalate:scalate-util:1.5.3 requires scala version: 2.9.1
[WARNING] Multiple versions of scala libraries detected!
[INFO] includes = [**/*.scala,**/*.java,]
[INFO] excludes = []
[INFO] Nothing to compile - all classes are up to date

[INFO] 
[INFO] --- maven-scala-plugin:2.15.2:compile (default) @ apollo-website ---
mojoSucceeded org.scala-tools:maven-scala-plugin:2.15.2(default)
mojoStarted org.scala-tools:maven-scala-plugin:2.15.2(default)[INFO] Checking for multiple
versions of scala
[WARNING]  Expected all dependencies to require Scala version: 2.9.2
[WARNING]  org.fusesource.scalate:scalate-util:1.5.3 requires scala version: 2.9.1
[WARNING] Multiple versions of scala libraries detected!
[INFO] includes = [**/*.scala,**/*.java,]
[INFO] excludes = []
[WARNING] No source files found.

[INFO] 
[INFO] --- maven-scala-plugin:2.15.2:testCompile (default) @ apollo-website ---
mojoSucceeded org.scala-tools:maven-scala-plugin:2.15.2(default)
mojoStarted org.apache.maven.plugins:maven-site-plugin:3.0(attach-descriptor)
[INFO] 
[INFO] --- maven-site-plugin:3.0:attach-descriptor (attach-descriptor) @ apollo-website ---
mojoSucceeded org.apache.maven.plugins:maven-site-plugin:3.0(attach-descriptor)
forkedProjectStarted org.apache.activemq:apollo-website:99-trunk-SNAPSHOT
mojoStarted org.apache.maven.plugins:maven-enforcer-plugin:1.0(default)
[INFO] 
[INFO] --- maven-enforcer-plugin:1.0:enforce (default) @ apollo-website ---
mojoSucceeded org.apache.maven.plugins:maven-enforcer-plugin:1.0(default)
Nov 27, 2012 3:18:29 AM hudson.maven.ExecutedMojo <init>
WARNING: Failed to getClass for org.apache.maven.plugin.source.SourceJarMojo
forkedProjectSucceeded org.apache.activemq:apollo-website:99-trunk-SNAPSHOT
mojoStarted org.apache.maven.plugins:maven-source-plugin:2.1.2(attach-sources)
[INFO] 
[INFO] --- maven-source-plugin:2.1.2:jar (attach-sources) @ apollo-website ---
mojoSucceeded org.apache.maven.plugins:maven-source-plugin:2.1.2(attach-sources)
Nov 27, 2012 3:18:29 AM hudson.maven.ExecutedMojo <init>
forkedProjectSucceeded org.apache.activemq:apollo-website:99-trunk-SNAPSHOTWARNING: Failed
to getClass for org.fusesource.scalate.maven.SiteGenMojo

mojoStarted org.fusesource.scalate:maven-scalate-plugin:1.5.3(sitegen)Processing Configuration
for child elements
Processing child [project]
Processing child [workingDirectory]
Processing child [webappDirectory]
Processing child [targetDirectory]
Processing child [testClassPathElements]
[INFO] Generating static website from Scalate Templates and wiki files...
[INFO] template properties: null

[INFO] 
[INFO] --- maven-scalate-plugin:1.5.3:sitegen (sitegen) @ apollo-website ---
[INFO]     processing <https://builds.apache.org/job/ActiveMQ-Apollo-Deploy/ws/trunk/apollo-website/src/documentation/architecture.md>
with uri: /documentation/architecture.md => 
[INFO]     processing <https://builds.apache.org/job/ActiveMQ-Apollo-Deploy/ws/trunk/apollo-website/src/documentation/index.page>
with uri: /documentation/index.page => 
[INFO]     processing <https://builds.apache.org/job/ActiveMQ-Apollo-Deploy/ws/trunk/apollo-website/src/documentation/stomp-manual.md>
with uri: /documentation/stomp-manual.md => 
[INFO]     processing <https://builds.apache.org/job/ActiveMQ-Apollo-Deploy/ws/trunk/apollo-website/src/documentation/module-organization.page>
with uri: /documentation/module-organization.page => 
[INFO]     processing <https://builds.apache.org/job/ActiveMQ-Apollo-Deploy/ws/trunk/apollo-website/src/documentation/management-api.md>
with uri: /documentation/management-api.md => 
[INFO]     processing <https://builds.apache.org/job/ActiveMQ-Apollo-Deploy/ws/trunk/apollo-website/src/documentation/extending-guide.md>
with uri: /documentation/extending-guide.md => 
[INFO]     processing <https://builds.apache.org/job/ActiveMQ-Apollo-Deploy/ws/trunk/apollo-website/src/documentation/migration-guide.md>
with uri: /documentation/migration-guide.md => 
[INFO]     processing <https://builds.apache.org/job/ActiveMQ-Apollo-Deploy/ws/trunk/apollo-website/src/documentation/performance-scaling.md>
with uri: /documentation/performance-scaling.md => 
[INFO]     processing <https://builds.apache.org/job/ActiveMQ-Apollo-Deploy/ws/trunk/apollo-website/src/documentation/openwire-manual.md>
with uri: /documentation/openwire-manual.md => 
[INFO]     processing <https://builds.apache.org/job/ActiveMQ-Apollo-Deploy/ws/trunk/apollo-website/src/documentation/verification.md>
with uri: /documentation/verification.md => 
[INFO]     processing <https://builds.apache.org/job/ActiveMQ-Apollo-Deploy/ws/trunk/apollo-website/src/documentation/user-manual.md>
with uri: /documentation/user-manual.md => 
[INFO]     processing <https://builds.apache.org/job/ActiveMQ-Apollo-Deploy/ws/trunk/apollo-website/src/documentation/getting-started.md>
with uri: /documentation/getting-started.md => 
[INFO]     processing <https://builds.apache.org/job/ActiveMQ-Apollo-Deploy/ws/trunk/apollo-website/src/index.page>
with uri: /index.page => 
[INFO]     processing <https://builds.apache.org/job/ActiveMQ-Apollo-Deploy/ws/trunk/apollo-website/src/versions/index.page>
with uri: /versions/index.page => 
Using dir: <https://builds.apache.org/job/ActiveMQ-Apollo-Deploy/ws/trunk/apollo-website/src/blog>
at request path: /blog
[INFO]     processing <https://builds.apache.org/job/ActiveMQ-Apollo-Deploy/ws/trunk/apollo-website/src/blog/index.page>
with uri: /blog/index.page => 
[INFO]     processing <https://builds.apache.org/job/ActiveMQ-Apollo-Deploy/ws/trunk/apollo-website/src/blog/releases/release-1.0.page>
with uri: /blog/releases/release-1.0.page => 
[INFO]     processing <https://builds.apache.org/job/ActiveMQ-Apollo-Deploy/ws/trunk/apollo-website/src/blog/releases/release-1-0-beta5.page>
with uri: /blog/releases/release-1-0-beta5.page => 
[INFO]     processing <https://builds.apache.org/job/ActiveMQ-Apollo-Deploy/ws/trunk/apollo-website/src/blog/releases/release-1.3.page>
with uri: /blog/releases/release-1.3.page => 
[INFO]     processing <https://builds.apache.org/job/ActiveMQ-Apollo-Deploy/ws/trunk/apollo-website/src/blog/releases/release-1-0-beta4.page>
with uri: /blog/releases/release-1-0-beta4.page => 
[INFO]     processing <https://builds.apache.org/job/ActiveMQ-Apollo-Deploy/ws/trunk/apollo-website/src/blog/releases/release-1-0-beta1.page>
with uri: /blog/releases/release-1-0-beta1.page => 
[INFO]     processing <https://builds.apache.org/job/ActiveMQ-Apollo-Deploy/ws/trunk/apollo-website/src/blog/releases/release-1.2.page>
with uri: /blog/releases/release-1.2.page => 
[INFO]     processing <https://builds.apache.org/job/ActiveMQ-Apollo-Deploy/ws/trunk/apollo-website/src/blog/releases/release-1.1.page>
with uri: /blog/releases/release-1.1.page => 
[INFO]     processing <https://builds.apache.org/job/ActiveMQ-Apollo-Deploy/ws/trunk/apollo-website/src/blog/releases/release-1.4.page>
with uri: /blog/releases/release-1.4.page => 
[INFO]     processing <https://builds.apache.org/job/ActiveMQ-Apollo-Deploy/ws/trunk/apollo-website/src/blog/releases/release-1.5.page>
with uri: /blog/releases/release-1.5.page => 
[INFO]     processing <https://builds.apache.org/job/ActiveMQ-Apollo-Deploy/ws/trunk/apollo-website/src/blog/releases/release-1-0-beta3.page>
with uri: /blog/releases/release-1-0-beta3.page => 
[INFO]     processing <https://builds.apache.org/job/ActiveMQ-Apollo-Deploy/ws/trunk/apollo-website/src/blog/releases/release-1-0-beta2.page>
with uri: /blog/releases/release-1-0-beta2.page => 
[INFO]     processing <https://builds.apache.org/job/ActiveMQ-Apollo-Deploy/ws/trunk/apollo-website/src/blog/releases/release-1-0-beta6.page>
with uri: /blog/releases/release-1-0-beta6.page => 
Using dir: <https://builds.apache.org/job/ActiveMQ-Apollo-Deploy/ws/trunk/apollo-website/src/blog>
at request path: /blog
[INFO]     processing <https://builds.apache.org/job/ActiveMQ-Apollo-Deploy/ws/trunk/apollo-website/src/blog/index.rss.feed>
with uri: /blog/index.rss.feed => 
[INFO]     processing <https://builds.apache.org/job/ActiveMQ-Apollo-Deploy/ws/trunk/apollo-website/src/download.page>
with uri: /download.page => 
[INFO]     processing <https://builds.apache.org/job/ActiveMQ-Apollo-Deploy/ws/trunk/apollo-website/src/community/index.page>
with uri: /community/index.page => 
[INFO]     processing <https://builds.apache.org/job/ActiveMQ-Apollo-Deploy/ws/trunk/apollo-website/src/community/release-guide.page>
with uri: /community/release-guide.page => 
[INFO]     processing <https://builds.apache.org/job/ActiveMQ-Apollo-Deploy/ws/trunk/apollo-website/src/community/developers.page>
with uri: /community/developers.page => 
[INFO]     processing <https://builds.apache.org/job/ActiveMQ-Apollo-Deploy/ws/trunk/apollo-website/src/community/contributing.page>
with uri: /community/contributing.page => 
[INFO]     processing <https://builds.apache.org/job/ActiveMQ-Apollo-Deploy/ws/trunk/apollo-website/src/community/faq.page>
with uri: /community/faq.page => 
[INFO]     processing <https://builds.apache.org/job/ActiveMQ-Apollo-Deploy/ws/trunk/apollo-website/src/community/source.page>
with uri: /community/source.page => 
[INFO]     processing <https://builds.apache.org/job/ActiveMQ-Apollo-Deploy/ws/trunk/apollo-website/src/community/site.page>
with uri: /community/site.page => 
[INFO]     processing <https://builds.apache.org/job/ActiveMQ-Apollo-Deploy/ws/trunk/apollo-website/src/community/support.page>
with uri: /community/support.page => 
[INFO]     processing <https://builds.apache.org/job/ActiveMQ-Apollo-Deploy/ws/trunk/apollo-website/src/community/building.page>
with uri: /community/building.page => 
[INFO]     processing <https://builds.apache.org/job/ActiveMQ-Apollo-Deploy/ws/trunk/apollo-website/src/privacy-policy.page>
with uri: /privacy-policy.page => 
mojoSucceeded org.fusesource.scalate:maven-scalate-plugin:1.5.3(sitegen)
mojoStarted org.apache.maven.plugins:maven-install-plugin:2.3.1(default-install)[INFO] Installing
<https://builds.apache.org/job/ActiveMQ-Apollo-Deploy/ws/trunk/apollo-website/pom.xml>
to <https://builds.apache.org/job/ActiveMQ-Apollo-Deploy/ws/.repository/org/apache/activemq/apollo-website/99-trunk-SNAPSHOT/apollo-website-99-trunk-SNAPSHOT.pom>

[INFO] 
[INFO] --- maven-install-plugin:2.3.1:install (default-install) @ apollo-website ---
mojoSucceeded org.apache.maven.plugins:maven-install-plugin:2.3.1(default-install)
mojoStarted org.apache.maven.plugins:maven-deploy-plugin:2.5(default-deploy)Downloading: https://repository.apache.org/content/repositories/snapshots/org/apache/activemq/apollo-website/99-trunk-SNAPSHOT/maven-metadata.xml

[INFO] 
[INFO] --- maven-deploy-plugin:2.5:deploy (default-deploy) @ apollo-website ---
Downloaded: https://repository.apache.org/content/repositories/snapshots/org/apache/activemq/apollo-website/99-trunk-SNAPSHOT/maven-metadata.xml
(620 B at 2.1 KB/sec)
Uploading: https://repository.apache.org/content/repositories/snapshots/org/apache/activemq/apollo-website/99-trunk-SNAPSHOT/apollo-website-99-trunk-20121127.031844-145.pom
Uploaded: https://repository.apache.org/content/repositories/snapshots/org/apache/activemq/apollo-website/99-trunk-SNAPSHOT/apollo-website-99-trunk-20121127.031844-145.pom
(12 KB at 50.4 KB/sec)
Downloading: https://repository.apache.org/content/repositories/snapshots/org/apache/activemq/apollo-website/maven-metadata.xml
Downloaded: https://repository.apache.org/content/repositories/snapshots/org/apache/activemq/apollo-website/maven-metadata.xml
(359 B at 1.3 KB/sec)
Uploading: https://repository.apache.org/content/repositories/snapshots/org/apache/activemq/apollo-website/99-trunk-SNAPSHOT/maven-metadata.xml
Uploaded: https://repository.apache.org/content/repositories/snapshots/org/apache/activemq/apollo-website/99-trunk-SNAPSHOT/maven-metadata.xml
(620 B at 2.4 KB/sec)
Uploading: https://repository.apache.org/content/repositories/snapshots/org/apache/activemq/apollo-website/maven-metadata.xml
Uploaded: https://repository.apache.org/content/repositories/snapshots/org/apache/activemq/apollo-website/maven-metadata.xml
(359 B at 2.3 KB/sec)
mojoSucceeded org.apache.maven.plugins:maven-deploy-plugin:2.5(default-deploy)
projectSucceeded org.apache.activemq:apollo-website:99-trunk-SNAPSHOT
projectSkipped org.apache.activemq:apache-apollo:99-trunk-SNAPSHOT
[INFO]                                                                         
[INFO] ------------------------------------------------------------------------
[INFO] Skipping apache-apollo
[INFO] This project has been banned from the build due to previous failures.
[INFO] ------------------------------------------------------------------------
sessionEnded
[INFO] ------------------------------------------------------------------------
[INFO] Reactor Summary:
[INFO] 
[INFO] Apache ActiveMQ Apollo Project .................... SUCCESS [28.334s]
[INFO] apollo-boot ....................................... SUCCESS [7.094s]
[INFO] apollo-scala ...................................... SUCCESS [3.072s]
[INFO] apollo-util ....................................... SUCCESS [35.974s]
[INFO] apollo-dto ........................................ SUCCESS [12.651s]
[INFO] apollo-selector ................................... SUCCESS [6.213s]
[INFO] apollo-broker ..................................... SUCCESS [1:19.834s]
[INFO] apollo-web ........................................ SUCCESS [39.031s]
[INFO] apollo-leveldb .................................... SUCCESS [31.186s]
[INFO] apollo-bdb ........................................ SUCCESS [22.543s]
[INFO] apollo-stomp ...................................... SUCCESS [47.182s]
[INFO] apollo-mqtt ....................................... SUCCESS [31.467s]
[INFO] apollo-openwire-generator ......................... SUCCESS [11.826s]
[INFO] apollo-openwire ................................... SUCCESS [43.575s]
[INFO] apollo-amqp ....................................... FAILURE [35.250s]
[INFO] apollo-network .................................... SUCCESS [38.654s]
[INFO] apollo-cli ........................................ SKIPPED
[INFO] apollo-website .................................... SUCCESS [25.800s]
[INFO] apache-apollo ..................................... SKIPPED
[INFO] ------------------------------------------------------------------------
[INFO] BUILD FAILURE
[INFO] ------------------------------------------------------------------------
[INFO] Total time: 8:25.530s
[INFO] Finished at: Tue Nov 27 03:18:45 UTC 2012
[INFO] Final Memory: 404M/1282M
[INFO] ------------------------------------------------------------------------
Projects to build: [MavenProject: org.apache.activemq:apollo-project:99-trunk-SNAPSHOT @ <https://builds.apache.org/job/ActiveMQ-Apollo-Deploy/ws/trunk/pom.xml,>
MavenProject: org.apache.activemq:apollo-boot:99-trunk-SNAPSHOT @ <https://builds.apache.org/job/ActiveMQ-Apollo-Deploy/ws/trunk/apollo-boot/pom.xml,>
MavenProject: org.apache.activemq:apollo-scala:99-trunk-SNAPSHOT @ <https://builds.apache.org/job/ActiveMQ-Apollo-Deploy/ws/trunk/apollo-scala/pom.xml,>
MavenProject: org.apache.activemq:apollo-util:99-trunk-SNAPSHOT @ <https://builds.apache.org/job/ActiveMQ-Apollo-Deploy/ws/trunk/apollo-util/pom.xml,>
MavenProject: org.apache.activemq:apollo-dto:99-trunk-SNAPSHOT @ <https://builds.apache.org/job/ActiveMQ-Apollo-Deploy/ws/trunk/apollo-dto/pom.xml,>
MavenProject: org.apache.activemq:apollo-selector:99-trunk-SNAPSHOT @ <https://builds.apache.org/job/ActiveMQ-Apollo-Deploy/ws/trunk/apollo-selector/pom.xml,>
MavenProject: org.apache.activemq:apollo-broker:99-trunk-SNAPSHOT @ <https://builds.apache.org/job/ActiveMQ-Apollo-Deploy/ws/trunk/apollo-broker/pom.xml,>
MavenProject: org.apache.activemq:apollo-web:99-trunk-SNAPSHOT @ <https://builds.apache.org/job/ActiveMQ-Apollo-Deploy/ws/trunk/apollo-web/pom.xml,>
MavenProject: org.apache.activemq:apollo-leveldb:99-trunk-SNAPSHOT @ <https://builds.apache.org/job/ActiveMQ-Apollo-Deploy/ws/trunk/apollo-leveldb/pom.xml,>
MavenProject: org.apache.activemq:apollo-bdb:99-trunk-SNAPSHOT @ <https://builds.apache.org/job/ActiveMQ-Apollo-Deploy/ws/trunk/apollo-bdb/pom.xml,>
MavenProject: org.apache.activemq:apollo-stomp:99-trunk-SNAPSHOT @ <https://builds.apache.org/job/ActiveMQ-Apollo-Deploy/ws/trunk/apollo-stomp/pom.xml,>
MavenProject: org.apache.activemq:apollo-mqtt:99-trunk-SNAPSHOT @ <https://builds.apache.org/job/ActiveMQ-Apollo-Deploy/ws/trunk/apollo-mqtt/pom.xml,>
MavenProject: org.apache.activemq:apollo-openwire-generator:99-trunk-SNAPSHOT @ <https://builds.apache.org/job/ActiveMQ-Apollo-Deploy/ws/trunk/apollo-openwire-generator/pom.xml,>
MavenProject: org.apache.activemq:apollo-openwire:99-trunk-SNAPSHOT @ <https://builds.apache.org/job/ActiveMQ-Apollo-Deploy/ws/trunk/apollo-openwire/pom.xml,>
MavenProject: org.apache.activemq:apollo-amqp:99-trunk-SNAPSHOT @ <https://builds.apache.org/job/ActiveMQ-Apollo-Deploy/ws/trunk/apollo-amqp/pom.xml,>
MavenProject: org.apache.activemq:apollo-network:99-trunk-SNAPSHOT @ <https://builds.apache.org/job/ActiveMQ-Apollo-Deploy/ws/trunk/apollo-network/pom.xml,>
MavenProject: org.apache.activemq:apollo-cli:99-trunk-SNAPSHOT @ <https://builds.apache.org/job/ActiveMQ-Apollo-Deploy/ws/trunk/apollo-cli/pom.xml,>
MavenProject: org.apache.activemq:apollo-website:99-trunk-SNAPSHOT @ <https://builds.apache.org/job/ActiveMQ-Apollo-Deploy/ws/trunk/apollo-website/pom.xml,>
MavenProject: org.apache.activemq:apache-apollo:99-trunk-SNAPSHOT @ <https://builds.apache.org/job/ActiveMQ-Apollo-Deploy/ws/trunk/apollo-distro/pom.xml]>
[JENKINS] Archiving disabled - not archiving <https://builds.apache.org/job/ActiveMQ-Apollo-Deploy/ws/trunk/apollo-util/pom.xml>
[JENKINS] Archiving disabled - not archiving <https://builds.apache.org/job/ActiveMQ-Apollo-Deploy/ws/trunk/apollo-util/target/apollo-util-99-trunk-SNAPSHOT.jar>
[JENKINS] Archiving disabled - not archiving <https://builds.apache.org/job/ActiveMQ-Apollo-Deploy/ws/trunk/apollo-util/target/apollo-util-99-trunk-SNAPSHOT-tests.jar>
[JENKINS] Archiving disabled - not archiving <https://builds.apache.org/job/ActiveMQ-Apollo-Deploy/ws/trunk/apollo-openwire-generator/pom.xml>
[JENKINS] Archiving disabled - not archiving <https://builds.apache.org/job/ActiveMQ-Apollo-Deploy/ws/trunk/apollo-openwire-generator/target/apollo-openwire-generator-99-trunk-SNAPSHOT.jar>
[JENKINS] Archiving disabled - not archiving <https://builds.apache.org/job/ActiveMQ-Apollo-Deploy/ws/trunk/apollo-stomp/pom.xml>
[JENKINS] Archiving disabled - not archiving <https://builds.apache.org/job/ActiveMQ-Apollo-Deploy/ws/trunk/apollo-stomp/target/apollo-stomp-99-trunk-SNAPSHOT.jar>
[JENKINS] Archiving disabled - not archiving <https://builds.apache.org/job/ActiveMQ-Apollo-Deploy/ws/trunk/apollo-stomp/target/apollo-stomp-99-trunk-SNAPSHOT-tests.jar>
[JENKINS] Archiving disabled - not archiving <https://builds.apache.org/job/ActiveMQ-Apollo-Deploy/ws/trunk/apollo-distro/pom.xml>
[JENKINS] Archiving disabled - not archiving <https://builds.apache.org/job/ActiveMQ-Apollo-Deploy/ws/trunk/apollo-boot/pom.xml>
[JENKINS] Archiving disabled - not archiving <https://builds.apache.org/job/ActiveMQ-Apollo-Deploy/ws/trunk/apollo-boot/target/apollo-boot-99-trunk-SNAPSHOT.jar>
[JENKINS] Archiving disabled - not archiving <https://builds.apache.org/job/ActiveMQ-Apollo-Deploy/ws/trunk/apollo-website/pom.xml>
[JENKINS] Archiving disabled - not archiving <https://builds.apache.org/job/ActiveMQ-Apollo-Deploy/ws/trunk/apollo-bdb/pom.xml>
[JENKINS] Archiving disabled - not archiving <https://builds.apache.org/job/ActiveMQ-Apollo-Deploy/ws/trunk/apollo-bdb/target/apollo-bdb-99-trunk-SNAPSHOT.jar>
[JENKINS] Archiving disabled - not archiving <https://builds.apache.org/job/ActiveMQ-Apollo-Deploy/ws/trunk/apollo-selector/pom.xml>
[JENKINS] Archiving disabled - not archiving <https://builds.apache.org/job/ActiveMQ-Apollo-Deploy/ws/trunk/apollo-selector/target/apollo-selector-99-trunk-SNAPSHOT.jar>
[JENKINS] Archiving disabled - not archiving <https://builds.apache.org/job/ActiveMQ-Apollo-Deploy/ws/trunk/apollo-network/pom.xml>
[JENKINS] Archiving disabled - not archiving <https://builds.apache.org/job/ActiveMQ-Apollo-Deploy/ws/trunk/apollo-network/target/apollo-network-99-trunk-SNAPSHOT.jar>
[JENKINS] Archiving disabled - not archiving <https://builds.apache.org/job/ActiveMQ-Apollo-Deploy/ws/trunk/pom.xml>
[JENKINS] Archiving disabled - not archiving <https://builds.apache.org/job/ActiveMQ-Apollo-Deploy/ws/trunk/apollo-openwire/pom.xml>
[JENKINS] Archiving disabled - not archiving <https://builds.apache.org/job/ActiveMQ-Apollo-Deploy/ws/trunk/apollo-openwire/target/apollo-openwire-99-trunk-SNAPSHOT.jar>
[JENKINS] Archiving disabled - not archiving <https://builds.apache.org/job/ActiveMQ-Apollo-Deploy/ws/trunk/apollo-web/pom.xml>
[JENKINS] Archiving disabled - not archiving <https://builds.apache.org/job/ActiveMQ-Apollo-Deploy/ws/trunk/apollo-web/target/apollo-web-99-trunk-SNAPSHOT.jar>
[JENKINS] Archiving disabled - not archiving <https://builds.apache.org/job/ActiveMQ-Apollo-Deploy/ws/trunk/apollo-leveldb/pom.xml>
[JENKINS] Archiving disabled - not archiving <https://builds.apache.org/job/ActiveMQ-Apollo-Deploy/ws/trunk/apollo-leveldb/target/apollo-leveldb-99-trunk-SNAPSHOT.jar>
[JENKINS] Archiving disabled - not archiving <https://builds.apache.org/job/ActiveMQ-Apollo-Deploy/ws/trunk/apollo-scala/pom.xml>
[JENKINS] Archiving disabled - not archiving <https://builds.apache.org/job/ActiveMQ-Apollo-Deploy/ws/trunk/apollo-mqtt/pom.xml>
[JENKINS] Archiving disabled - not archiving <https://builds.apache.org/job/ActiveMQ-Apollo-Deploy/ws/trunk/apollo-mqtt/target/apollo-mqtt-99-trunk-SNAPSHOT.jar>
[JENKINS] Archiving disabled - not archiving <https://builds.apache.org/job/ActiveMQ-Apollo-Deploy/ws/trunk/apollo-mqtt/target/apollo-mqtt-99-trunk-SNAPSHOT-tests.jar>
[JENKINS] Archiving disabled - not archiving <https://builds.apache.org/job/ActiveMQ-Apollo-Deploy/ws/trunk/apollo-dto/pom.xml>
[JENKINS] Archiving disabled - not archiving <https://builds.apache.org/job/ActiveMQ-Apollo-Deploy/ws/trunk/apollo-dto/target/apollo-dto-99-trunk-SNAPSHOT.jar>
[JENKINS] Archiving disabled - not archiving <https://builds.apache.org/job/ActiveMQ-Apollo-Deploy/ws/trunk/apollo-broker/pom.xml>
[JENKINS] Archiving disabled - not archiving <https://builds.apache.org/job/ActiveMQ-Apollo-Deploy/ws/trunk/apollo-broker/target/apollo-broker-99-trunk-SNAPSHOT.jar>
[JENKINS] Archiving disabled - not archiving <https://builds.apache.org/job/ActiveMQ-Apollo-Deploy/ws/trunk/apollo-broker/target/apollo-broker-99-trunk-SNAPSHOT-tests.jar>
[JENKINS] Archiving disabled - not archiving <https://builds.apache.org/job/ActiveMQ-Apollo-Deploy/ws/trunk/apollo-cli/pom.xml>
[JENKINS] Archiving disabled - not archiving <https://builds.apache.org/job/ActiveMQ-Apollo-Deploy/ws/trunk/apollo-amqp/pom.xml>
Waiting for Jenkins to finish collecting data
mavenExecutionResult exceptions not empty
message : Failed to execute goal org.apache.maven.plugins:maven-compiler-plugin:2.3.2:compile
(default-compile) on project apollo-amqp: Compilation failure
<https://builds.apache.org/job/ActiveMQ-Apollo-Deploy/ws/trunk/apollo-amqp/src/main/scala/org/apache/activemq/apollo/amqp/hawtdispatch/impl/DroppingWritableBuffer.java>:[24,7]
org.apache.activemq.apollo.amqp.hawtdispatch.impl.DroppingWritableBuffer is not abstract and
does not override abstract method limit() in org.apache.qpid.proton.codec.WritableBuffer

cause : Compilation failure
<https://builds.apache.org/job/ActiveMQ-Apollo-Deploy/ws/trunk/apollo-amqp/src/main/scala/org/apache/activemq/apollo/amqp/hawtdispatch/impl/DroppingWritableBuffer.java>:[24,7]
org.apache.activemq.apollo.amqp.hawtdispatch.impl.DroppingWritableBuffer is not abstract and
does not override abstract method limit() in org.apache.qpid.proton.codec.WritableBuffer

Stack trace : 
org.apache.maven.lifecycle.LifecycleExecutionException: Failed to execute goal org.apache.maven.plugins:maven-compiler-plugin:2.3.2:compile
(default-compile) on project apollo-amqp: Compilation failure
<https://builds.apache.org/job/ActiveMQ-Apollo-Deploy/ws/trunk/apollo-amqp/src/main/scala/org/apache/activemq/apollo/amqp/hawtdispatch/impl/DroppingWritableBuffer.java>:[24,7]
org.apache.activemq.apollo.amqp.hawtdispatch.impl.DroppingWritableBuffer is not abstract and
does not override abstract method limit() in org.apache.qpid.proton.codec.WritableBuffer

	at org.apache.maven.lifecycle.internal.MojoExecutor.execute(MojoExecutor.java:213)
	at org.apache.maven.lifecycle.internal.MojoExecutor.execute(MojoExecutor.java:153)
	at org.apache.maven.lifecycle.internal.MojoExecutor.execute(MojoExecutor.java:145)
	at org.apache.maven.lifecycle.internal.LifecycleModuleBuilder.buildProject(LifecycleModuleBuilder.java:84)
	at org.apache.maven.lifecycle.internal.LifecycleModuleBuilder.buildProject(LifecycleModuleBuilder.java:59)
	at org.apache.maven.lifecycle.internal.LifecycleStarter.singleThreadedBuild(LifecycleStarter.java:183)
	at org.apache.maven.lifecycle.internal.LifecycleStarter.execute(LifecycleStarter.java:161)
	at org.apache.maven.DefaultMaven.doExecute(DefaultMaven.java:319)
	at org.apache.maven.DefaultMaven.execute(DefaultMaven.java:156)
	at org.jvnet.hudson.maven3.launcher.Maven3Launcher.main(Maven3Launcher.java:79)
	at sun.reflect.NativeMethodAccessorImpl.invoke0(Native Method)
	at sun.reflect.NativeMethodAccessorImpl.invoke(NativeMethodAccessorImpl.java:39)
	at sun.reflect.DelegatingMethodAccessorImpl.invoke(DelegatingMethodAccessorImpl.java:25)
	at java.lang.reflect.Method.invoke(Method.java:597)
	at org.codehaus.plexus.classworlds.launcher.Launcher.launchStandard(Launcher.java:329)
	at org.codehaus.plexus.classworlds.launcher.Launcher.launch(Launcher.java:239)
	at org.jvnet.hudson.maven3.agent.Maven3Main.launch(Maven3Main.java:158)
	at hudson.maven.Maven3Builder.call(Maven3Builder.java:98)
	at hudson.maven.Maven3Builder.call(Maven3Builder.java:64)
	at hudson.remoting.UserRequest.perform(UserRequest.java:118)
	at hudson.remoting.UserRequest.perform(UserRequest.java:48)
	at hudson.remoting.Request$2.run(Request.java:326)
	at hudson.remoting.InterceptingExecutorService$1.call(InterceptingExecutorService.java:72)
	at java.util.concurrent.FutureTask$Sync.innerRun(FutureTask.java:303)
	at java.util.concurrent.FutureTask.run(FutureTask.java:138)
	at java.util.concurrent.ThreadPoolExecutor$Worker.runTask(ThreadPoolExecutor.java:886)
	at java.util.concurrent.ThreadPoolExecutor$Worker.run(ThreadPoolExecutor.java:908)
	at java.lang.Thread.run(Thread.java:662)
Caused by: org.apache.maven.plugin.CompilationFailureException: Compilation failure
<https://builds.apache.org/job/ActiveMQ-Apollo-Deploy/ws/trunk/apollo-amqp/src/main/scala/org/apache/activemq/apollo/amqp/hawtdispatch/impl/DroppingWritableBuffer.java>:[24,7]
org.apache.activemq.apollo.amqp.hawtdispatch.impl.DroppingWritableBuffer is not abstract and
does not override abstract method limit() in org.apache.qpid.proton.codec.WritableBuffer

	at org.apache.maven.plugin.AbstractCompilerMojo.execute(AbstractCompilerMojo.java:656)
	at org.apache.maven.plugin.CompilerMojo.execute(CompilerMojo.java:128)
	at org.apache.maven.plugin.DefaultBuildPluginManager.executeMojo(DefaultBuildPluginManager.java:107)
	at org.apache.maven.lifecycle.internal.MojoExecutor.execute(MojoExecutor.java:209)
	... 27 more
Sending e-mails to: commits@activemq.apache.org
channel stopped

Mime
View raw message