activemq-commits mailing list archives

Site index · List index
Message view « Date » · « Thread »
Top « Date » · « Thread »
From Apache Jenkins Server <jenk...@builds.apache.org>
Subject Build failed in Jenkins: ActiveMQ-Apollo #722
Date Fri, 27 Jul 2012 16:55:17 GMT
See <https://builds.apache.org/job/ActiveMQ-Apollo/722/changes>

Changes:

[chirino] Use the scala fast compiler (fsc) to make the build run a little faster.

------------------------------------------
[...truncated 2225 lines...]
[INFO] 
[INFO] --- maven-scala-plugin:2.15.2:testCompile (default) @ apollo-website ---
mojoSucceeded org.scala-tools:maven-scala-plugin:2.15.2(default)
mojoStarted org.apache.maven.plugins:maven-site-plugin:3.0(attach-descriptor)
[INFO] 
[INFO] --- maven-site-plugin:3.0:attach-descriptor (attach-descriptor) @ apollo-website ---
mojoSucceeded org.apache.maven.plugins:maven-site-plugin:3.0(attach-descriptor)
forkedProjectStarted org.apache.activemq:apollo-website:99-trunk-SNAPSHOT
mojoStarted org.apache.maven.plugins:maven-enforcer-plugin:1.0(default)
[INFO] 
[INFO] --- maven-enforcer-plugin:1.0:enforce (default) @ apollo-website ---
mojoSucceeded org.apache.maven.plugins:maven-enforcer-plugin:1.0(default)
forkedProjectSucceeded org.apache.activemq:apollo-website:99-trunk-SNAPSHOTJul 27, 2012 4:54:49
PM hudson.maven.ExecutedMojo <init>
WARNING: Failed to getClass for org.apache.maven.plugin.source.SourceJarMojo

mojoStarted org.apache.maven.plugins:maven-source-plugin:2.1.2(attach-sources)
[INFO] 
[INFO] --- maven-source-plugin:2.1.2:jar (attach-sources) @ apollo-website ---
mojoSucceeded org.apache.maven.plugins:maven-source-plugin:2.1.2(attach-sources)
forkedProjectStarted org.apache.activemq:apollo-website:99-trunk-SNAPSHOT
mojoStarted org.apache.maven.plugins:maven-enforcer-plugin:1.0(default)
[INFO] 
[INFO] --- maven-enforcer-plugin:1.0:enforce (default) @ apollo-website ---
mojoSucceeded org.apache.maven.plugins:maven-enforcer-plugin:1.0(default)
mojoStarted org.apache.maven.plugins:maven-antrun-plugin:1.7(default)[WARNING] Parameter tasks
is deprecated, use target instead

[INFO] 
[INFO] --- maven-antrun-plugin:1.7:run (default) @ apollo-website ---
[INFO] Executing tasks

main:
[schemagen] Generating schema from 87 source files
Note: Writing <https://builds.apache.org/job/ActiveMQ-Apollo/ws/trunk/apollo-website/target/sitegen/documentation/schema/apollo.xsd>
[INFO] Executed tasks
mojoSucceeded org.apache.maven.plugins:maven-antrun-plugin:1.7(default)
mojoStarted org.apache.maven.plugins:maven-remote-resources-plugin:1.1(default)
[INFO] 
[INFO] --- maven-remote-resources-plugin:1.1:process (default) @ apollo-website ---
mojoSucceeded org.apache.maven.plugins:maven-remote-resources-plugin:1.1(default)
mojoStarted org.scala-tools:maven-scala-plugin:2.15.2(default)[INFO] Checking for multiple
versions of scala
[INFO] includes = [**/*.scala,**/*.java,]
[INFO] excludes = []
[INFO] Nothing to compile - all classes are up to date

[INFO] 
[INFO] --- maven-scala-plugin:2.15.2:compile (default) @ apollo-website ---
mojoSucceeded org.scala-tools:maven-scala-plugin:2.15.2(default)
mojoStarted org.scala-tools:maven-scala-plugin:2.15.2(default)[INFO] Checking for multiple
versions of scala
[INFO] includes = [**/*.scala,**/*.java,]
[INFO] excludes = []
[WARNING] No source files found.

[INFO] 
[INFO] --- maven-scala-plugin:2.15.2:testCompile (default) @ apollo-website ---
mojoSucceeded org.scala-tools:maven-scala-plugin:2.15.2(default)
mojoStarted org.apache.maven.plugins:maven-site-plugin:3.0(attach-descriptor)
[INFO] 
[INFO] --- maven-site-plugin:3.0:attach-descriptor (attach-descriptor) @ apollo-website ---
mojoSucceeded org.apache.maven.plugins:maven-site-plugin:3.0(attach-descriptor)
forkedProjectStarted org.apache.activemq:apollo-website:99-trunk-SNAPSHOT
mojoStarted org.apache.maven.plugins:maven-enforcer-plugin:1.0(default)
[INFO] 
[INFO] --- maven-enforcer-plugin:1.0:enforce (default) @ apollo-website ---
mojoSucceeded org.apache.maven.plugins:maven-enforcer-plugin:1.0(default)
Jul 27, 2012 4:54:51 PM hudson.maven.ExecutedMojo <init>
WARNING: Failed to getClass for org.apache.maven.plugin.source.SourceJarMojo
forkedProjectSucceeded org.apache.activemq:apollo-website:99-trunk-SNAPSHOT
mojoStarted org.apache.maven.plugins:maven-source-plugin:2.1.2(attach-sources)
[INFO] 
[INFO] --- maven-source-plugin:2.1.2:jar (attach-sources) @ apollo-website ---
mojoSucceeded org.apache.maven.plugins:maven-source-plugin:2.1.2(attach-sources)
Jul 27, 2012 4:54:51 PM hudson.maven.ExecutedMojo <init>
WARNING: Failed to getClass for org.fusesource.scalate.maven.SiteGenMojo
forkedProjectSucceeded org.apache.activemq:apollo-website:99-trunk-SNAPSHOT
mojoStarted org.fusesource.scalate:maven-scalate-plugin:1.5.3(sitegen)
[INFO] 
[INFO] --- maven-scalate-plugin:1.5.3:sitegen (sitegen) @ apollo-website ---
Processing Configuration for child elements
Processing child [project]
Processing child [workingDirectory]
Processing child [webappDirectory]
Processing child [targetDirectory]
Processing child [testClassPathElements]
[INFO] Generating static website from Scalate Templates and wiki files...
[INFO] template properties: null
[INFO]     processing <https://builds.apache.org/job/ActiveMQ-Apollo/ws/trunk/apollo-website/src/documentation/architecture.md>
with uri: /documentation/architecture.md => 
[INFO]     processing <https://builds.apache.org/job/ActiveMQ-Apollo/ws/trunk/apollo-website/src/documentation/index.page>
with uri: /documentation/index.page => 
[INFO]     processing <https://builds.apache.org/job/ActiveMQ-Apollo/ws/trunk/apollo-website/src/documentation/module-organization.page>
with uri: /documentation/module-organization.page => 
[INFO]     processing <https://builds.apache.org/job/ActiveMQ-Apollo/ws/trunk/apollo-website/src/documentation/management-api.md>
with uri: /documentation/management-api.md => 
[INFO]     processing <https://builds.apache.org/job/ActiveMQ-Apollo/ws/trunk/apollo-website/src/documentation/extending-guide.md>
with uri: /documentation/extending-guide.md => 
[INFO]     processing <https://builds.apache.org/job/ActiveMQ-Apollo/ws/trunk/apollo-website/src/documentation/migration-guide.md>
with uri: /documentation/migration-guide.md => 
[INFO]     processing <https://builds.apache.org/job/ActiveMQ-Apollo/ws/trunk/apollo-website/src/documentation/performance-scaling.md>
with uri: /documentation/performance-scaling.md => 
[INFO]     processing <https://builds.apache.org/job/ActiveMQ-Apollo/ws/trunk/apollo-website/src/documentation/verification.md>
with uri: /documentation/verification.md => 
[INFO]     processing <https://builds.apache.org/job/ActiveMQ-Apollo/ws/trunk/apollo-website/src/documentation/user-manual.md>
with uri: /documentation/user-manual.md => 
[INFO]     processing <https://builds.apache.org/job/ActiveMQ-Apollo/ws/trunk/apollo-website/src/documentation/getting-started.md>
with uri: /documentation/getting-started.md => 
[INFO]     processing <https://builds.apache.org/job/ActiveMQ-Apollo/ws/trunk/apollo-website/src/index.page>
with uri: /index.page => 
[INFO]     processing <https://builds.apache.org/job/ActiveMQ-Apollo/ws/trunk/apollo-website/src/versions/index.page>
with uri: /versions/index.page => 
Using dir: <https://builds.apache.org/job/ActiveMQ-Apollo/ws/trunk/apollo-website/src/blog>
at request path: /blog
[INFO]     processing <https://builds.apache.org/job/ActiveMQ-Apollo/ws/trunk/apollo-website/src/blog/index.page>
with uri: /blog/index.page => 
[INFO]     processing <https://builds.apache.org/job/ActiveMQ-Apollo/ws/trunk/apollo-website/src/blog/releases/release-1.0.page>
with uri: /blog/releases/release-1.0.page => 
[INFO]     processing <https://builds.apache.org/job/ActiveMQ-Apollo/ws/trunk/apollo-website/src/blog/releases/release-1-0-beta5.page>
with uri: /blog/releases/release-1-0-beta5.page => 
[INFO]     processing <https://builds.apache.org/job/ActiveMQ-Apollo/ws/trunk/apollo-website/src/blog/releases/release-1.3.page>
with uri: /blog/releases/release-1.3.page => 
[INFO]     processing <https://builds.apache.org/job/ActiveMQ-Apollo/ws/trunk/apollo-website/src/blog/releases/release-1-0-beta4.page>
with uri: /blog/releases/release-1-0-beta4.page => 
[INFO]     processing <https://builds.apache.org/job/ActiveMQ-Apollo/ws/trunk/apollo-website/src/blog/releases/release-1-0-beta1.page>
with uri: /blog/releases/release-1-0-beta1.page => 
[INFO]     processing <https://builds.apache.org/job/ActiveMQ-Apollo/ws/trunk/apollo-website/src/blog/releases/release-1.2.page>
with uri: /blog/releases/release-1.2.page => 
[INFO]     processing <https://builds.apache.org/job/ActiveMQ-Apollo/ws/trunk/apollo-website/src/blog/releases/release-1.1.page>
with uri: /blog/releases/release-1.1.page => 
[INFO]     processing <https://builds.apache.org/job/ActiveMQ-Apollo/ws/trunk/apollo-website/src/blog/releases/release-1-0-beta3.page>
with uri: /blog/releases/release-1-0-beta3.page => 
[INFO]     processing <https://builds.apache.org/job/ActiveMQ-Apollo/ws/trunk/apollo-website/src/blog/releases/release-1-0-beta2.page>
with uri: /blog/releases/release-1-0-beta2.page => 
[INFO]     processing <https://builds.apache.org/job/ActiveMQ-Apollo/ws/trunk/apollo-website/src/blog/releases/release-1-0-beta6.page>
with uri: /blog/releases/release-1-0-beta6.page => 
Using dir: <https://builds.apache.org/job/ActiveMQ-Apollo/ws/trunk/apollo-website/src/blog>
at request path: /blog
[INFO]     processing <https://builds.apache.org/job/ActiveMQ-Apollo/ws/trunk/apollo-website/src/blog/index.rss.feed>
with uri: /blog/index.rss.feed => 
[INFO]     processing <https://builds.apache.org/job/ActiveMQ-Apollo/ws/trunk/apollo-website/src/download.page>
with uri: /download.page => 
[INFO]     processing <https://builds.apache.org/job/ActiveMQ-Apollo/ws/trunk/apollo-website/src/community/index.page>
with uri: /community/index.page => 
[INFO]     processing <https://builds.apache.org/job/ActiveMQ-Apollo/ws/trunk/apollo-website/src/community/release-guide.page>
with uri: /community/release-guide.page => 
[INFO]     processing <https://builds.apache.org/job/ActiveMQ-Apollo/ws/trunk/apollo-website/src/community/developers.page>
with uri: /community/developers.page => 
[INFO]     processing <https://builds.apache.org/job/ActiveMQ-Apollo/ws/trunk/apollo-website/src/community/contributing.page>
with uri: /community/contributing.page => 
[INFO]     processing <https://builds.apache.org/job/ActiveMQ-Apollo/ws/trunk/apollo-website/src/community/faq.page>
with uri: /community/faq.page => 
[INFO]     processing <https://builds.apache.org/job/ActiveMQ-Apollo/ws/trunk/apollo-website/src/community/source.page>
with uri: /community/source.page => 
[INFO]     processing <https://builds.apache.org/job/ActiveMQ-Apollo/ws/trunk/apollo-website/src/community/site.page>
with uri: /community/site.page => 
[INFO]     processing <https://builds.apache.org/job/ActiveMQ-Apollo/ws/trunk/apollo-website/src/community/support.page>
with uri: /community/support.page => 
[INFO]     processing <https://builds.apache.org/job/ActiveMQ-Apollo/ws/trunk/apollo-website/src/community/building.page>
with uri: /community/building.page => 
[INFO]     processing <https://builds.apache.org/job/ActiveMQ-Apollo/ws/trunk/apollo-website/src/privacy-policy.page>
with uri: /privacy-policy.page => 
mojoSucceeded org.fusesource.scalate:maven-scalate-plugin:1.5.3(sitegen)
mojoStarted org.apache.maven.plugins:maven-install-plugin:2.3.1(default-install)[INFO] Installing
<https://builds.apache.org/job/ActiveMQ-Apollo/ws/trunk/apollo-website/pom.xml> to /home/jenkins/jenkins-slave/maven-repositories/0/org/apache/activemq/apollo-website/99-trunk-SNAPSHOT/apollo-website-99-trunk-SNAPSHOT.pom

[INFO] 
[INFO] --- maven-install-plugin:2.3.1:install (default-install) @ apollo-website ---
mojoSucceeded org.apache.maven.plugins:maven-install-plugin:2.3.1(default-install)
projectSucceeded org.apache.activemq:apollo-website:99-trunk-SNAPSHOT
projectSkipped org.apache.activemq:apollo-network:99-trunk-SNAPSHOT
[INFO]                                                                         
[INFO] ------------------------------------------------------------------------
[INFO] Skipping apollo-network
[INFO] This project has been banned from the build due to previous failures.
[INFO] ------------------------------------------------------------------------
projectSkipped org.apache.activemq:apollo-amqp:99-trunk-SNAPSHOT
[INFO]                                                                         
[INFO] ------------------------------------------------------------------------
[INFO] Skipping apollo-amqp
[INFO] This project has been banned from the build due to previous failures.
[INFO] ------------------------------------------------------------------------
projectSkipped org.apache.activemq:apache-apollo:99-trunk-SNAPSHOT
[INFO]                                                                         
[INFO] ------------------------------------------------------------------------
[INFO] Skipping apache-apollo
[INFO] This project has been banned from the build due to previous failures.
[INFO] ------------------------------------------------------------------------
sessionEnded
[INFO] ------------------------------------------------------------------------
[INFO] Reactor Summary:
[INFO] 
[INFO] Apache ActiveMQ Apollo Project .................... SUCCESS [23.127s]
[INFO] apollo-boot ....................................... SUCCESS [6.794s]
[INFO] apollo-scala ...................................... SUCCESS [2.717s]
[INFO] apollo-util ....................................... FAILURE [9.701s]
[INFO] apollo-dto ........................................ SKIPPED
[INFO] apollo-selector ................................... SUCCESS [11.193s]
[INFO] apollo-broker ..................................... SKIPPED
[INFO] apollo-web ........................................ SKIPPED
[INFO] apollo-leveldb .................................... SKIPPED
[INFO] apollo-bdb ........................................ SKIPPED
[INFO] apollo-stomp ...................................... SKIPPED
[INFO] apollo-openwire-generator ......................... SUCCESS [4.429s]
[INFO] apollo-openwire ................................... SKIPPED
[INFO] apollo-cli ........................................ SKIPPED
[INFO] apollo-website .................................... SUCCESS [34.015s]
[INFO] apollo-network .................................... SKIPPED
[INFO] apollo-amqp ....................................... SKIPPED
[INFO] apache-apollo ..................................... SKIPPED
[INFO] ------------------------------------------------------------------------
[INFO] BUILD FAILURE
[INFO] ------------------------------------------------------------------------
[INFO] Total time: 1:35.357s
[INFO] Finished at: Fri Jul 27 16:55:11 UTC 2012
[INFO] Final Memory: 89M/1292M
[INFO] ------------------------------------------------------------------------
Projects to build: [MavenProject: org.apache.activemq:apollo-project:99-trunk-SNAPSHOT @ <https://builds.apache.org/job/ActiveMQ-Apollo/ws/trunk/pom.xml,>
MavenProject: org.apache.activemq:apollo-boot:99-trunk-SNAPSHOT @ <https://builds.apache.org/job/ActiveMQ-Apollo/ws/trunk/apollo-boot/pom.xml,>
MavenProject: org.apache.activemq:apollo-scala:99-trunk-SNAPSHOT @ <https://builds.apache.org/job/ActiveMQ-Apollo/ws/trunk/apollo-scala/pom.xml,>
MavenProject: org.apache.activemq:apollo-util:99-trunk-SNAPSHOT @ <https://builds.apache.org/job/ActiveMQ-Apollo/ws/trunk/apollo-util/pom.xml,>
MavenProject: org.apache.activemq:apollo-dto:99-trunk-SNAPSHOT @ <https://builds.apache.org/job/ActiveMQ-Apollo/ws/trunk/apollo-dto/pom.xml,>
MavenProject: org.apache.activemq:apollo-selector:99-trunk-SNAPSHOT @ <https://builds.apache.org/job/ActiveMQ-Apollo/ws/trunk/apollo-selector/pom.xml,>
MavenProject: org.apache.activemq:apollo-broker:99-trunk-SNAPSHOT @ <https://builds.apache.org/job/ActiveMQ-Apollo/ws/trunk/apollo-broker/pom.xml,>
MavenProject: org.apache.activemq:apollo-web:99-trunk-SNAPSHOT @ <https://builds.apache.org/job/ActiveMQ-Apollo/ws/trunk/apollo-web/pom.xml,>
MavenProject: org.apache.activemq:apollo-leveldb:99-trunk-SNAPSHOT @ <https://builds.apache.org/job/ActiveMQ-Apollo/ws/trunk/apollo-leveldb/pom.xml,>
MavenProject: org.apache.activemq:apollo-bdb:99-trunk-SNAPSHOT @ <https://builds.apache.org/job/ActiveMQ-Apollo/ws/trunk/apollo-bdb/pom.xml,>
MavenProject: org.apache.activemq:apollo-stomp:99-trunk-SNAPSHOT @ <https://builds.apache.org/job/ActiveMQ-Apollo/ws/trunk/apollo-stomp/pom.xml,>
MavenProject: org.apache.activemq:apollo-openwire-generator:99-trunk-SNAPSHOT @ <https://builds.apache.org/job/ActiveMQ-Apollo/ws/trunk/apollo-openwire-generator/pom.xml,>
MavenProject: org.apache.activemq:apollo-openwire:99-trunk-SNAPSHOT @ <https://builds.apache.org/job/ActiveMQ-Apollo/ws/trunk/apollo-openwire/pom.xml,>
MavenProject: org.apache.activemq:apollo-cli:99-trunk-SNAPSHOT @ <https://builds.apache.org/job/ActiveMQ-Apollo/ws/trunk/apollo-cli/pom.xml,>
MavenProject: org.apache.activemq:apollo-website:99-trunk-SNAPSHOT @ <https://builds.apache.org/job/ActiveMQ-Apollo/ws/trunk/apollo-website/pom.xml,>
MavenProject: org.apache.activemq:apollo-network:99-trunk-SNAPSHOT @ <https://builds.apache.org/job/ActiveMQ-Apollo/ws/trunk/apollo-network/pom.xml,>
MavenProject: org.apache.activemq:apollo-amqp:99-trunk-SNAPSHOT @ <https://builds.apache.org/job/ActiveMQ-Apollo/ws/trunk/apollo-amqp/pom.xml,>
MavenProject: org.apache.activemq:apache-apollo:99-trunk-SNAPSHOT @ <https://builds.apache.org/job/ActiveMQ-Apollo/ws/trunk/apollo-distro/pom.xml]>
[JENKINS] Archiving disabled - not archiving <https://builds.apache.org/job/ActiveMQ-Apollo/ws/trunk/apollo-util/pom.xml>
[JENKINS] Archiving disabled - not archiving <https://builds.apache.org/job/ActiveMQ-Apollo/ws/trunk/apollo-openwire-generator/pom.xml>
[JENKINS] Archiving disabled - not archiving <https://builds.apache.org/job/ActiveMQ-Apollo/ws/trunk/apollo-openwire-generator/target/apollo-openwire-generator-99-trunk-SNAPSHOT.jar>
[JENKINS] Archiving disabled - not archiving <https://builds.apache.org/job/ActiveMQ-Apollo/ws/trunk/apollo-stomp/pom.xml>
[JENKINS] Archiving disabled - not archiving <https://builds.apache.org/job/ActiveMQ-Apollo/ws/trunk/apollo-distro/pom.xml>
[JENKINS] Archiving disabled - not archiving <https://builds.apache.org/job/ActiveMQ-Apollo/ws/trunk/apollo-boot/pom.xml>
[JENKINS] Archiving disabled - not archiving <https://builds.apache.org/job/ActiveMQ-Apollo/ws/trunk/apollo-boot/target/apollo-boot-99-trunk-SNAPSHOT.jar>
[JENKINS] Archiving disabled - not archiving <https://builds.apache.org/job/ActiveMQ-Apollo/ws/trunk/apollo-website/pom.xml>
[JENKINS] Archiving disabled - not archiving <https://builds.apache.org/job/ActiveMQ-Apollo/ws/trunk/apollo-bdb/pom.xml>
[JENKINS] Archiving disabled - not archiving <https://builds.apache.org/job/ActiveMQ-Apollo/ws/trunk/apollo-selector/pom.xml>
[JENKINS] Archiving disabled - not archiving <https://builds.apache.org/job/ActiveMQ-Apollo/ws/trunk/apollo-selector/target/apollo-selector-99-trunk-SNAPSHOT.jar>
[JENKINS] Archiving disabled - not archiving <https://builds.apache.org/job/ActiveMQ-Apollo/ws/trunk/apollo-network/pom.xml>
[JENKINS] Archiving disabled - not archiving <https://builds.apache.org/job/ActiveMQ-Apollo/ws/trunk/pom.xml>
[JENKINS] Archiving disabled - not archiving <https://builds.apache.org/job/ActiveMQ-Apollo/ws/trunk/apollo-openwire/pom.xml>
[JENKINS] Archiving disabled - not archiving <https://builds.apache.org/job/ActiveMQ-Apollo/ws/trunk/apollo-web/pom.xml>
[JENKINS] Archiving disabled - not archiving <https://builds.apache.org/job/ActiveMQ-Apollo/ws/trunk/apollo-leveldb/pom.xml>
[JENKINS] Archiving disabled - not archiving <https://builds.apache.org/job/ActiveMQ-Apollo/ws/trunk/apollo-scala/pom.xml>
[JENKINS] Archiving disabled - not archiving <https://builds.apache.org/job/ActiveMQ-Apollo/ws/trunk/apollo-dto/pom.xml>
[JENKINS] Archiving disabled - not archiving <https://builds.apache.org/job/ActiveMQ-Apollo/ws/trunk/apollo-broker/pom.xml>
[JENKINS] Archiving disabled - not archiving <https://builds.apache.org/job/ActiveMQ-Apollo/ws/trunk/apollo-cli/pom.xml>
[JENKINS] Archiving disabled - not archiving <https://builds.apache.org/job/ActiveMQ-Apollo/ws/trunk/apollo-amqp/pom.xml>
Waiting for Jenkins to finish collecting data
mavenExecutionResult exceptions not empty
message : Failed to execute goal org.scala-tools:maven-scala-plugin:2.15.2:testCompile (test)
on project apollo-util: wrap: org.apache.commons.exec.ExecuteException: Process exited with
an error: 1(Exit value: 1)
cause : wrap: org.apache.commons.exec.ExecuteException: Process exited with an error: 1(Exit
value: 1)
Stack trace : 
org.apache.maven.lifecycle.LifecycleExecutionException: Failed to execute goal org.scala-tools:maven-scala-plugin:2.15.2:testCompile
(test) on project apollo-util: wrap: org.apache.commons.exec.ExecuteException: Process exited
with an error: 1(Exit value: 1)
	at org.apache.maven.lifecycle.internal.MojoExecutor.execute(MojoExecutor.java:217)
	at org.apache.maven.lifecycle.internal.MojoExecutor.execute(MojoExecutor.java:153)
	at org.apache.maven.lifecycle.internal.MojoExecutor.execute(MojoExecutor.java:145)
	at org.apache.maven.lifecycle.internal.LifecycleModuleBuilder.buildProject(LifecycleModuleBuilder.java:84)
	at org.apache.maven.lifecycle.internal.LifecycleModuleBuilder.buildProject(LifecycleModuleBuilder.java:59)
	at org.apache.maven.lifecycle.internal.LifecycleStarter.singleThreadedBuild(LifecycleStarter.java:183)
	at org.apache.maven.lifecycle.internal.LifecycleStarter.execute(LifecycleStarter.java:161)
	at org.apache.maven.DefaultMaven.doExecute(DefaultMaven.java:319)
	at org.apache.maven.DefaultMaven.execute(DefaultMaven.java:156)
	at org.jvnet.hudson.maven3.launcher.Maven3Launcher.main(Maven3Launcher.java:79)
	at sun.reflect.NativeMethodAccessorImpl.invoke0(Native Method)
	at sun.reflect.NativeMethodAccessorImpl.invoke(NativeMethodAccessorImpl.java:39)
	at sun.reflect.DelegatingMethodAccessorImpl.invoke(DelegatingMethodAccessorImpl.java:25)
	at java.lang.reflect.Method.invoke(Method.java:597)
	at org.codehaus.plexus.classworlds.launcher.Launcher.launchStandard(Launcher.java:329)
	at org.codehaus.plexus.classworlds.launcher.Launcher.launch(Launcher.java:239)
	at org.jvnet.hudson.maven3.agent.Maven3Main.launch(Maven3Main.java:158)
	at hudson.maven.Maven3Builder.call(Maven3Builder.java:98)
	at hudson.maven.Maven3Builder.call(Maven3Builder.java:64)
	at hudson.remoting.UserRequest.perform(UserRequest.java:118)
	at hudson.remoting.UserRequest.perform(UserRequest.java:48)
	at hudson.remoting.Request$2.run(Request.java:326)
	at hudson.remoting.InterceptingExecutorService$1.call(InterceptingExecutorService.java:72)
	at java.util.concurrent.FutureTask$Sync.innerRun(FutureTask.java:303)
	at java.util.concurrent.FutureTask.run(FutureTask.java:138)
	at java.util.concurrent.ThreadPoolExecutor$Worker.runTask(ThreadPoolExecutor.java:886)
	at java.util.concurrent.ThreadPoolExecutor$Worker.run(ThreadPoolExecutor.java:908)
	at java.lang.Thread.run(Thread.java:662)
Caused by: org.apache.maven.plugin.MojoExecutionException: wrap: org.apache.commons.exec.ExecuteException:
Process exited with an error: 1(Exit value: 1)
	at org_scala_tools_maven.ScalaMojoSupport.execute(ScalaMojoSupport.java:350)
	at org_scala_tools_maven.ScalaTestCompileMojo.execute(ScalaTestCompileMojo.java:62)
	at org.apache.maven.plugin.DefaultBuildPluginManager.executeMojo(DefaultBuildPluginManager.java:107)
	at org.apache.maven.lifecycle.internal.MojoExecutor.execute(MojoExecutor.java:209)
	... 27 more
Caused by: org.apache.commons.exec.ExecuteException: Process exited with an error: 1(Exit
value: 1)
	at org.apache.commons.exec.DefaultExecutor.executeInternal(DefaultExecutor.java:346)
	at org.apache.commons.exec.DefaultExecutor.execute(DefaultExecutor.java:149)
	at org.apache.commons.exec.DefaultExecutor.execute(DefaultExecutor.java:136)
	at org_scala_tools_maven_executions.JavaMainCallerByFork.run(JavaMainCallerByFork.java:80)
	at org_scala_tools_maven.ScalaCompilerSupport.compile(ScalaCompilerSupport.java:124)
	at org_scala_tools_maven.ScalaCompilerSupport.doExecute(ScalaCompilerSupport.java:80)
	at org_scala_tools_maven.ScalaMojoSupport.execute(ScalaMojoSupport.java:342)
	... 30 more
Sending e-mails to: commits@activemq.apache.org
channel stopped

Mime
View raw message