activemq-commits mailing list archives

Site index · List index
Message view « Date » · « Thread »
Top « Date » · « Thread »
From Apache Jenkins Server <jenk...@builds.apache.org>
Subject Build failed in Jenkins: ActiveMQ-Apollo-Deploy #252
Date Wed, 20 Jun 2012 20:12:16 GMT
See <https://builds.apache.org/job/ActiveMQ-Apollo-Deploy/252/changes>

Changes:

[chirino] Initial spike of an AMQP 1.0 protocol implementation still a work in progress.

------------------------------------------
[...truncated 7068 lines...]
[INFO] includes = [**/*.scala,**/*.java,]
[INFO] excludes = []
[INFO] <https://builds.apache.org/job/ActiveMQ-Apollo-Deploy/ws/trunk/apollo-amqp/src/test/scala>:-1:
info: compiling
[INFO] Compiling 2 source files to <https://builds.apache.org/job/ActiveMQ-Apollo-Deploy/ws/trunk/apollo-amqp/target/test-classes>
at 1340223089604
[INFO] compiler plugin: BasicArtifact(org.fusesource.jvmassert,jvmassert,1.2)

[INFO] 
[INFO] --- maven-scala-plugin:2.15.2:testCompile (default) @ apollo-amqp ---
[ERROR] <https://builds.apache.org/job/ActiveMQ-Apollo-Deploy/ws/trunk/apollo-amqp/src/test/scala/org/apache/activemq/apollo/amqp/AmqpTest.scala>:25:
error: object swiftmq is not a member of package com
[INFO] import com.swiftmq.amqp.v100.client.ExceptionListener
[INFO]            ^
[ERROR] <https://builds.apache.org/job/ActiveMQ-Apollo-Deploy/ws/trunk/apollo-amqp/src/test/scala/org/apache/activemq/apollo/amqp/AmqpTest.scala>:162:
error: object swiftmq is not a member of package com
[INFO] import com.swiftmq.amqp.AMQPContext
[INFO]            ^
[ERROR] <https://builds.apache.org/job/ActiveMQ-Apollo-Deploy/ws/trunk/apollo-amqp/src/test/scala/org/apache/activemq/apollo/amqp/AmqpTest.scala>:163:
error: object swiftmq is not a member of package com
[INFO] import com.swiftmq.amqp.v100.client.Connection
[INFO]            ^
[ERROR] <https://builds.apache.org/job/ActiveMQ-Apollo-Deploy/ws/trunk/apollo-amqp/src/test/scala/org/apache/activemq/apollo/amqp/AmqpTest.scala>:164:
error: object swiftmq is not a member of package com
[INFO] import com.swiftmq.amqp.v100.client.QoS
[INFO]            ^
[ERROR] <https://builds.apache.org/job/ActiveMQ-Apollo-Deploy/ws/trunk/apollo-amqp/src/test/scala/org/apache/activemq/apollo/amqp/AmqpTest.scala>:165:
error: object swiftmq is not a member of package com
[INFO] import com.swiftmq.amqp.v100.generated.messaging.message_format.AmqpValue
[INFO]            ^
[ERROR] <https://builds.apache.org/job/ActiveMQ-Apollo-Deploy/ws/trunk/apollo-amqp/src/test/scala/org/apache/activemq/apollo/amqp/AmqpTest.scala>:166:
error: object swiftmq is not a member of package com
[INFO] import com.swiftmq.amqp.v100.types.AMQPString
[INFO]            ^
[ERROR] <https://builds.apache.org/job/ActiveMQ-Apollo-Deploy/ws/trunk/apollo-amqp/src/test/scala/org/apache/activemq/apollo/amqp/AmqpTest.scala>:231:
error: object swiftmq is not a member of package com
[INFO]           var msg = new com.swiftmq.amqp.v100.messaging.AMQPMessage
[INFO]                             ^
[ERROR] 7 errors found
mojoFailed org.scala-tools:maven-scala-plugin:2.15.2(default)
projectFailed org.apache.activemq:apollo-amqp:99-trunk-SNAPSHOT
projectStarted org.apache.activemq:apache-apollo:99-trunk-SNAPSHOT
[INFO] Downloading: http://repo1.maven.org/maven2/org/apache/maven/plugins/maven-assembly-plugin/2.2.1/maven-assembly-plugin-2.2.1.pom
                                                                        
[INFO] ------------------------------------------------------------------------
[INFO] Building apache-apollo 99-trunk-SNAPSHOT
[INFO] ------------------------------------------------------------------------
Downloaded: http://repo1.maven.org/maven2/org/apache/maven/plugins/maven-assembly-plugin/2.2.1/maven-assembly-plugin-2.2.1.pom
(17 KB at 17.2 KB/sec)
Downloading: http://repo1.maven.org/maven2/org/apache/maven/plugins/maven-assembly-plugin/2.2.1/maven-assembly-plugin-2.2.1.jar
Downloaded: http://repo1.maven.org/maven2/org/apache/maven/plugins/maven-assembly-plugin/2.2.1/maven-assembly-plugin-2.2.1.jar
(216 KB at 230.7 KB/sec)
mojoStarted org.apache.maven.plugins:maven-clean-plugin:2.4.1(default-clean)
[INFO] 
[INFO] --- maven-clean-plugin:2.4.1:clean (default-clean) @ apache-apollo ---
mojoSucceeded org.apache.maven.plugins:maven-clean-plugin:2.4.1(default-clean)
mojoStarted org.apache.maven.plugins:maven-enforcer-plugin:1.0(default)
[INFO] 
[INFO] --- maven-enforcer-plugin:1.0:enforce (default) @ apache-apollo ---
mojoSucceeded org.apache.maven.plugins:maven-enforcer-plugin:1.0(default)
mojoStarted org.apache.maven.plugins:maven-remote-resources-plugin:1.1(default)
[INFO] 
[INFO] --- maven-remote-resources-plugin:1.1:process (default) @ apache-apollo ---
mojoSucceeded org.apache.maven.plugins:maven-remote-resources-plugin:1.1(default)
mojoStarted org.apache.maven.plugins:maven-site-plugin:3.0(attach-descriptor)
[INFO] Downloading: http://repo1.maven.org/maven2/org/apache/maven/shared/maven-common-artifact-filters/1.3/maven-common-artifact-filters-1.3.pom

[INFO] --- maven-site-plugin:3.0:attach-descriptor (attach-descriptor) @ apache-apollo ---
mojoSucceeded org.apache.maven.plugins:maven-site-plugin:3.0(attach-descriptor)
mojoStarted org.apache.maven.plugins:maven-assembly-plugin:2.2.1(unix-bin)
[INFO] 
[INFO] --- maven-assembly-plugin:2.2.1:single (unix-bin) @ apache-apollo ---
Downloaded: http://repo1.maven.org/maven2/org/apache/maven/shared/maven-common-artifact-filters/1.3/maven-common-artifact-filters-1.3.pom
(4 KB at 9.0 KB/sec)
Downloading: http://repo1.maven.org/maven2/org/codehaus/plexus/plexus-archiver/1.1/plexus-archiver-1.1.pom
Downloaded: http://repo1.maven.org/maven2/org/codehaus/plexus/plexus-archiver/1.1/plexus-archiver-1.1.pom
(2 KB at 4.0 KB/sec)
Downloading: http://repo1.maven.org/maven2/org/codehaus/plexus/plexus-io/1.0.1/plexus-io-1.0.1.pom
Downloaded: http://repo1.maven.org/maven2/org/codehaus/plexus/plexus-io/1.0.1/plexus-io-1.0.1.pom
(2 KB at 2.4 KB/sec)
Downloading: http://repo1.maven.org/maven2/org/apache/maven/shared/maven-shared-io/1.1/maven-shared-io-1.1.pom
Downloaded: http://repo1.maven.org/maven2/org/apache/maven/shared/maven-shared-io/1.1/maven-shared-io-1.1.pom
(4 KB at 8.0 KB/sec)
Downloading: http://repo1.maven.org/maven2/org/apache/maven/shared/maven-filtering/1.0/maven-filtering-1.0.pom
Downloaded: http://repo1.maven.org/maven2/org/apache/maven/shared/maven-filtering/1.0/maven-filtering-1.0.pom
(6 KB at 11.3 KB/sec)
Downloading: http://repo1.maven.org/maven2/org/apache/maven/shared/maven-repository-builder/1.0-alpha-2/maven-repository-builder-1.0-alpha-2.pom
Downloaded: http://repo1.maven.org/maven2/org/apache/maven/shared/maven-repository-builder/1.0-alpha-2/maven-repository-builder-1.0-alpha-2.pom
(4 KB at 6.4 KB/sec)
Downloading: http://repo1.maven.org/maven2/org/apache/maven/shared/maven-common-artifact-filters/1.0-alpha-1/maven-common-artifact-filters-1.0-alpha-1.pom
Downloaded: http://repo1.maven.org/maven2/org/apache/maven/shared/maven-common-artifact-filters/1.0-alpha-1/maven-common-artifact-filters-1.0-alpha-1.pom
(2 KB at 3.6 KB/sec)
Downloading: http://repo1.maven.org/maven2/org/apache/maven/shared/maven-shared-components/6/maven-shared-components-6.pom
Downloaded: http://repo1.maven.org/maven2/org/apache/maven/shared/maven-shared-components/6/maven-shared-components-6.pom
(4 KB at 6.0 KB/sec)
Downloading: http://repo1.maven.org/maven2/org/apache/maven/doxia/doxia-sink-api/1.1/doxia-sink-api-1.1.jar
Downloading: http://repo1.maven.org/maven2/org/apache/maven/shared/maven-common-artifact-filters/1.3/maven-common-artifact-filters-1.3.jar
Downloading: http://repo1.maven.org/maven2/org/codehaus/plexus/plexus-archiver/1.1/plexus-archiver-1.1.jar
Downloading: http://repo1.maven.org/maven2/org/apache/maven/shared/maven-shared-io/1.1/maven-shared-io-1.1.jar
Downloading: http://repo1.maven.org/maven2/org/apache/maven/shared/maven-filtering/1.0/maven-filtering-1.0.jar
Downloaded: http://repo1.maven.org/maven2/org/apache/maven/doxia/doxia-sink-api/1.1/doxia-sink-api-1.1.jar
(13 KB at 8.4 KB/sec)
Downloading: http://repo1.maven.org/maven2/org/codehaus/plexus/plexus-io/1.0.1/plexus-io-1.0.1.jar
Downloaded: http://repo1.maven.org/maven2/org/apache/maven/shared/maven-shared-io/1.1/maven-shared-io-1.1.jar
(39 KB at 22.2 KB/sec)
Downloading: http://repo1.maven.org/maven2/org/apache/maven/shared/maven-repository-builder/1.0-alpha-2/maven-repository-builder-1.0-alpha-2.jar
Downloaded: http://repo1.maven.org/maven2/org/apache/maven/shared/maven-common-artifact-filters/1.3/maven-common-artifact-filters-1.3.jar
(31 KB at 15.3 KB/sec)
Downloaded: http://repo1.maven.org/maven2/org/codehaus/plexus/plexus-archiver/1.1/plexus-archiver-1.1.jar
(178 KB at 77.0 KB/sec)
Downloaded: http://repo1.maven.org/maven2/org/apache/maven/shared/maven-filtering/1.0/maven-filtering-1.0.jar
(42 KB at 16.7 KB/sec)
Downloaded: http://repo1.maven.org/maven2/org/codehaus/plexus/plexus-io/1.0.1/plexus-io-1.0.1.jar
(50 KB at 28.4 KB/sec)
Downloaded: http://repo1.maven.org/maven2/org/apache/maven/shared/maven-repository-builder/1.0-alpha-2/maven-repository-builder-1.0-alpha-2.jar
(23 KB at 12.9 KB/sec)
[INFO] Reading assembly descriptor: <https://builds.apache.org/job/ActiveMQ-Apollo-Deploy/ws/trunk/apollo-distro/src/main/descriptors/unix-bin.xml>
[WARNING] Cannot include project artifact: org.apache.activemq:apache-apollo:pom:99-trunk-SNAPSHOT;
it doesn't have an associated file or directory.
[WARNING] Cannot include project artifact: org.apache.activemq:apache-apollo:pom:99-trunk-SNAPSHOT;
it doesn't have an associated file or directory.
[INFO] Building tar : <https://builds.apache.org/job/ActiveMQ-Apollo-Deploy/ws/trunk/apollo-distro/target/apache-apollo-99-trunk-SNAPSHOT-unix-distro.tar.gz>
mojoSucceeded org.apache.maven.plugins:maven-assembly-plugin:2.2.1(unix-bin)
mojoStarted org.apache.maven.plugins:maven-assembly-plugin:2.2.1(windows-bin)[INFO] Reading
assembly descriptor: <https://builds.apache.org/job/ActiveMQ-Apollo-Deploy/ws/trunk/apollo-distro/src/main/descriptors/windows-bin.xml>
[WARNING] Cannot include project artifact: org.apache.activemq:apache-apollo:pom:99-trunk-SNAPSHOT;
it doesn't have an associated file or directory.

[INFO] 
[INFO] --- maven-assembly-plugin:2.2.1:single (windows-bin) @ apache-apollo ---
[WARNING] Cannot include project artifact: org.apache.activemq:apache-apollo:pom:99-trunk-SNAPSHOT;
it doesn't have an associated file or directory.
[INFO] Building zip: <https://builds.apache.org/job/ActiveMQ-Apollo-Deploy/ws/trunk/apollo-distro/target/apache-apollo-99-trunk-SNAPSHOT-windows-distro.zip>
mojoSucceeded org.apache.maven.plugins:maven-assembly-plugin:2.2.1(windows-bin)
mojoStarted org.apache.maven.plugins:maven-install-plugin:2.3.1(default-install)[INFO] Installing
<https://builds.apache.org/job/ActiveMQ-Apollo-Deploy/ws/trunk/apollo-distro/pom.xml>
to <https://builds.apache.org/job/ActiveMQ-Apollo-Deploy/ws/.repository/org/apache/activemq/apache-apollo/99-trunk-SNAPSHOT/apache-apollo-99-trunk-SNAPSHOT.pom>
[INFO] Installing <https://builds.apache.org/job/ActiveMQ-Apollo-Deploy/ws/trunk/apollo-distro/target/apache-apollo-99-trunk-SNAPSHOT-unix-distro.tar.gz>
to <https://builds.apache.org/job/ActiveMQ-Apollo-Deploy/ws/.repository/org/apache/activemq/apache-apollo/99-trunk-SNAPSHOT/apache-apollo-99-trunk-SNAPSHOT-unix-distro.tar.gz>

[INFO] 
[INFO] --- maven-install-plugin:2.3.1:install (default-install) @ apache-apollo ---
[INFO] Installing <https://builds.apache.org/job/ActiveMQ-Apollo-Deploy/ws/trunk/apollo-distro/target/apache-apollo-99-trunk-SNAPSHOT-windows-distro.zip>
to <https://builds.apache.org/job/ActiveMQ-Apollo-Deploy/ws/.repository/org/apache/activemq/apache-apollo/99-trunk-SNAPSHOT/apache-apollo-99-trunk-SNAPSHOT-windows-distro.zip>
mojoSucceeded org.apache.maven.plugins:maven-install-plugin:2.3.1(default-install)
mojoStarted org.apache.maven.plugins:maven-deploy-plugin:2.5(default-deploy)Downloading: https://repository.apache.org/content/repositories/snapshots/org/apache/activemq/apache-apollo/99-trunk-SNAPSHOT/maven-metadata.xml

[INFO] 
[INFO] --- maven-deploy-plugin:2.5:deploy (default-deploy) @ apache-apollo ---
Downloaded: https://repository.apache.org/content/repositories/snapshots/org/apache/activemq/apache-apollo/99-trunk-SNAPSHOT/maven-metadata.xml
(2 KB at 2.1 KB/sec)
Uploading: https://repository.apache.org/content/repositories/snapshots/org/apache/activemq/apache-apollo/99-trunk-SNAPSHOT/apache-apollo-99-trunk-20120620.201159-50.pom
Uploaded: https://repository.apache.org/content/repositories/snapshots/org/apache/activemq/apache-apollo/99-trunk-SNAPSHOT/apache-apollo-99-trunk-20120620.201159-50.pom
(7 KB at 24.2 KB/sec)
Downloading: https://repository.apache.org/content/repositories/snapshots/org/apache/activemq/apache-apollo/maven-metadata.xml
Downloaded: https://repository.apache.org/content/repositories/snapshots/org/apache/activemq/apache-apollo/maven-metadata.xml
(358 B at 1.8 KB/sec)
Uploading: https://repository.apache.org/content/repositories/snapshots/org/apache/activemq/apache-apollo/99-trunk-SNAPSHOT/maven-metadata.xml
Uploaded: https://repository.apache.org/content/repositories/snapshots/org/apache/activemq/apache-apollo/99-trunk-SNAPSHOT/maven-metadata.xml
(2 KB at 3.8 KB/sec)
Uploading: https://repository.apache.org/content/repositories/snapshots/org/apache/activemq/apache-apollo/maven-metadata.xml
Uploaded: https://repository.apache.org/content/repositories/snapshots/org/apache/activemq/apache-apollo/maven-metadata.xml
(358 B at 2.1 KB/sec)
Uploading: https://repository.apache.org/content/repositories/snapshots/org/apache/activemq/apache-apollo/99-trunk-SNAPSHOT/apache-apollo-99-trunk-20120620.201159-50-unix-distro.tar.gz
Uploaded: https://repository.apache.org/content/repositories/snapshots/org/apache/activemq/apache-apollo/99-trunk-SNAPSHOT/apache-apollo-99-trunk-20120620.201159-50-unix-distro.tar.gz
(22715 KB at 8412.6 KB/sec)
Uploading: https://repository.apache.org/content/repositories/snapshots/org/apache/activemq/apache-apollo/99-trunk-SNAPSHOT/maven-metadata.xml
Uploaded: https://repository.apache.org/content/repositories/snapshots/org/apache/activemq/apache-apollo/99-trunk-SNAPSHOT/maven-metadata.xml
(2 KB at 7.7 KB/sec)
Uploading: https://repository.apache.org/content/repositories/snapshots/org/apache/activemq/apache-apollo/99-trunk-SNAPSHOT/apache-apollo-99-trunk-20120620.201159-50-windows-distro.zip
Uploaded: https://repository.apache.org/content/repositories/snapshots/org/apache/activemq/apache-apollo/99-trunk-SNAPSHOT/apache-apollo-99-trunk-20120620.201159-50-windows-distro.zip
(22805 KB at 9407.8 KB/sec)
Uploading: https://repository.apache.org/content/repositories/snapshots/org/apache/activemq/apache-apollo/99-trunk-SNAPSHOT/maven-metadata.xml
Uploaded: https://repository.apache.org/content/repositories/snapshots/org/apache/activemq/apache-apollo/99-trunk-SNAPSHOT/maven-metadata.xml
(2 KB at 7.3 KB/sec)
mojoSucceeded org.apache.maven.plugins:maven-deploy-plugin:2.5(default-deploy)
projectSucceeded org.apache.activemq:apache-apollo:99-trunk-SNAPSHOT
sessionEnded
[INFO] ------------------------------------------------------------------------
[INFO] Reactor Summary:
[INFO] 
[INFO] Apache ActiveMQ Apollo Project .................... SUCCESS [3:20.091s]
[INFO] apollo-boot ....................................... SUCCESS [23.900s]
[INFO] apollo-scala ...................................... SUCCESS [35.927s]
[INFO] apollo-util ....................................... SUCCESS [1:29.466s]
[INFO] apollo-dto ........................................ SUCCESS [31.953s]
[INFO] apollo-selector ................................... SUCCESS [45.657s]
[INFO] apollo-broker ..................................... SUCCESS [1:28.561s]
[INFO] apollo-web ........................................ SUCCESS [2:44.242s]
[INFO] apollo-leveldb .................................... SUCCESS [1:29.979s]
[INFO] apollo-bdb ........................................ SUCCESS [24.907s]
[INFO] apollo-stomp ...................................... SUCCESS [2:18.856s]
[INFO] apollo-openwire-generator ......................... SUCCESS [28.738s]
[INFO] apollo-openwire ................................... SUCCESS [1:36.262s]
[INFO] apollo-cli ........................................ SUCCESS [1:54.115s]
[INFO] apollo-website .................................... SUCCESS [1:23.336s]
[INFO] apollo-network .................................... SUCCESS [45.599s]
[INFO] apollo-amqp ....................................... FAILURE [29.577s]
[INFO] apache-apollo ..................................... SUCCESS [32.840s]
[INFO] ------------------------------------------------------------------------
[INFO] BUILD FAILURE
[INFO] ------------------------------------------------------------------------
[INFO] Total time: 22:49.773s
[INFO] Finished at: Wed Jun 20 20:12:06 UTC 2012
[INFO] Final Memory: 364M/979M
[INFO] ------------------------------------------------------------------------
Projects to build: [MavenProject: org.apache.activemq:apollo-project:99-trunk-SNAPSHOT @ <https://builds.apache.org/job/ActiveMQ-Apollo-Deploy/ws/trunk/pom.xml,>
MavenProject: org.apache.activemq:apollo-boot:99-trunk-SNAPSHOT @ <https://builds.apache.org/job/ActiveMQ-Apollo-Deploy/ws/trunk/apollo-boot/pom.xml,>
MavenProject: org.apache.activemq:apollo-scala:99-trunk-SNAPSHOT @ <https://builds.apache.org/job/ActiveMQ-Apollo-Deploy/ws/trunk/apollo-scala/pom.xml,>
MavenProject: org.apache.activemq:apollo-util:99-trunk-SNAPSHOT @ <https://builds.apache.org/job/ActiveMQ-Apollo-Deploy/ws/trunk/apollo-util/pom.xml,>
MavenProject: org.apache.activemq:apollo-dto:99-trunk-SNAPSHOT @ <https://builds.apache.org/job/ActiveMQ-Apollo-Deploy/ws/trunk/apollo-dto/pom.xml,>
MavenProject: org.apache.activemq:apollo-selector:99-trunk-SNAPSHOT @ <https://builds.apache.org/job/ActiveMQ-Apollo-Deploy/ws/trunk/apollo-selector/pom.xml,>
MavenProject: org.apache.activemq:apollo-broker:99-trunk-SNAPSHOT @ <https://builds.apache.org/job/ActiveMQ-Apollo-Deploy/ws/trunk/apollo-broker/pom.xml,>
MavenProject: org.apache.activemq:apollo-web:99-trunk-SNAPSHOT @ <https://builds.apache.org/job/ActiveMQ-Apollo-Deploy/ws/trunk/apollo-web/pom.xml,>
MavenProject: org.apache.activemq:apollo-leveldb:99-trunk-SNAPSHOT @ <https://builds.apache.org/job/ActiveMQ-Apollo-Deploy/ws/trunk/apollo-leveldb/pom.xml,>
MavenProject: org.apache.activemq:apollo-bdb:99-trunk-SNAPSHOT @ <https://builds.apache.org/job/ActiveMQ-Apollo-Deploy/ws/trunk/apollo-bdb/pom.xml,>
MavenProject: org.apache.activemq:apollo-stomp:99-trunk-SNAPSHOT @ <https://builds.apache.org/job/ActiveMQ-Apollo-Deploy/ws/trunk/apollo-stomp/pom.xml,>
MavenProject: org.apache.activemq:apollo-openwire-generator:99-trunk-SNAPSHOT @ <https://builds.apache.org/job/ActiveMQ-Apollo-Deploy/ws/trunk/apollo-openwire-generator/pom.xml,>
MavenProject: org.apache.activemq:apollo-openwire:99-trunk-SNAPSHOT @ <https://builds.apache.org/job/ActiveMQ-Apollo-Deploy/ws/trunk/apollo-openwire/pom.xml,>
MavenProject: org.apache.activemq:apollo-cli:99-trunk-SNAPSHOT @ <https://builds.apache.org/job/ActiveMQ-Apollo-Deploy/ws/trunk/apollo-cli/pom.xml,>
MavenProject: org.apache.activemq:apollo-website:99-trunk-SNAPSHOT @ <https://builds.apache.org/job/ActiveMQ-Apollo-Deploy/ws/trunk/apollo-website/pom.xml,>
MavenProject: org.apache.activemq:apollo-network:99-trunk-SNAPSHOT @ <https://builds.apache.org/job/ActiveMQ-Apollo-Deploy/ws/trunk/apollo-network/pom.xml,>
MavenProject: org.apache.activemq:apollo-amqp:99-trunk-SNAPSHOT @ <https://builds.apache.org/job/ActiveMQ-Apollo-Deploy/ws/trunk/apollo-amqp/pom.xml,>
MavenProject: org.apache.activemq:apache-apollo:99-trunk-SNAPSHOT @ <https://builds.apache.org/job/ActiveMQ-Apollo-Deploy/ws/trunk/apollo-distro/pom.xml]>
[JENKINS] Archiving disabled - not archiving <https://builds.apache.org/job/ActiveMQ-Apollo-Deploy/ws/trunk/apollo-util/pom.xml>
[JENKINS] Archiving disabled - not archiving <https://builds.apache.org/job/ActiveMQ-Apollo-Deploy/ws/trunk/apollo-util/target/apollo-util-99-trunk-SNAPSHOT.jar>
[JENKINS] Archiving disabled - not archiving <https://builds.apache.org/job/ActiveMQ-Apollo-Deploy/ws/trunk/apollo-util/target/apollo-util-99-trunk-SNAPSHOT-tests.jar>
[JENKINS] Archiving disabled - not archiving <https://builds.apache.org/job/ActiveMQ-Apollo-Deploy/ws/trunk/apollo-openwire-generator/pom.xml>
[JENKINS] Archiving disabled - not archiving <https://builds.apache.org/job/ActiveMQ-Apollo-Deploy/ws/trunk/apollo-openwire-generator/target/apollo-openwire-generator-99-trunk-SNAPSHOT.jar>
[JENKINS] Archiving disabled - not archiving <https://builds.apache.org/job/ActiveMQ-Apollo-Deploy/ws/trunk/apollo-stomp/pom.xml>
[JENKINS] Archiving disabled - not archiving <https://builds.apache.org/job/ActiveMQ-Apollo-Deploy/ws/trunk/apollo-stomp/target/apollo-stomp-99-trunk-SNAPSHOT.jar>
[JENKINS] Archiving disabled - not archiving <https://builds.apache.org/job/ActiveMQ-Apollo-Deploy/ws/trunk/apollo-stomp/target/apollo-stomp-99-trunk-SNAPSHOT-tests.jar>
[JENKINS] Archiving disabled - not archiving <https://builds.apache.org/job/ActiveMQ-Apollo-Deploy/ws/trunk/apollo-distro/pom.xml>
[JENKINS] Archiving disabled - not archiving <https://builds.apache.org/job/ActiveMQ-Apollo-Deploy/ws/trunk/apollo-distro/target/apache-apollo-99-trunk-SNAPSHOT-unix-distro.tar.gz>
[JENKINS] Archiving disabled - not archiving <https://builds.apache.org/job/ActiveMQ-Apollo-Deploy/ws/trunk/apollo-distro/target/apache-apollo-99-trunk-SNAPSHOT-windows-distro.zip>
[JENKINS] Archiving disabled - not archiving <https://builds.apache.org/job/ActiveMQ-Apollo-Deploy/ws/trunk/apollo-boot/pom.xml>
[JENKINS] Archiving disabled - not archiving <https://builds.apache.org/job/ActiveMQ-Apollo-Deploy/ws/trunk/apollo-boot/target/apollo-boot-99-trunk-SNAPSHOT.jar>
[JENKINS] Archiving disabled - not archiving <https://builds.apache.org/job/ActiveMQ-Apollo-Deploy/ws/trunk/apollo-website/pom.xml>
[JENKINS] Archiving disabled - not archiving <https://builds.apache.org/job/ActiveMQ-Apollo-Deploy/ws/trunk/apollo-bdb/pom.xml>
[JENKINS] Archiving disabled - not archiving <https://builds.apache.org/job/ActiveMQ-Apollo-Deploy/ws/trunk/apollo-bdb/target/apollo-bdb-99-trunk-SNAPSHOT.jar>
[JENKINS] Archiving disabled - not archiving <https://builds.apache.org/job/ActiveMQ-Apollo-Deploy/ws/trunk/apollo-selector/pom.xml>
[JENKINS] Archiving disabled - not archiving <https://builds.apache.org/job/ActiveMQ-Apollo-Deploy/ws/trunk/apollo-selector/target/apollo-selector-99-trunk-SNAPSHOT.jar>
[JENKINS] Archiving disabled - not archiving <https://builds.apache.org/job/ActiveMQ-Apollo-Deploy/ws/trunk/apollo-network/pom.xml>
[JENKINS] Archiving disabled - not archiving <https://builds.apache.org/job/ActiveMQ-Apollo-Deploy/ws/trunk/apollo-network/target/apollo-network-99-trunk-SNAPSHOT.jar>
[JENKINS] Archiving disabled - not archiving <https://builds.apache.org/job/ActiveMQ-Apollo-Deploy/ws/trunk/pom.xml>
[JENKINS] Archiving disabled - not archiving <https://builds.apache.org/job/ActiveMQ-Apollo-Deploy/ws/trunk/apollo-openwire/pom.xml>
[JENKINS] Archiving disabled - not archiving <https://builds.apache.org/job/ActiveMQ-Apollo-Deploy/ws/trunk/apollo-openwire/target/apollo-openwire-99-trunk-SNAPSHOT.jar>
[JENKINS] Archiving disabled - not archiving <https://builds.apache.org/job/ActiveMQ-Apollo-Deploy/ws/trunk/apollo-web/pom.xml>
[JENKINS] Archiving disabled - not archiving <https://builds.apache.org/job/ActiveMQ-Apollo-Deploy/ws/trunk/apollo-web/target/apollo-web-99-trunk-SNAPSHOT.jar>
[JENKINS] Archiving disabled - not archiving <https://builds.apache.org/job/ActiveMQ-Apollo-Deploy/ws/trunk/apollo-leveldb/pom.xml>
[JENKINS] Archiving disabled - not archiving <https://builds.apache.org/job/ActiveMQ-Apollo-Deploy/ws/trunk/apollo-leveldb/target/apollo-leveldb-99-trunk-SNAPSHOT.jar>
[JENKINS] Archiving disabled - not archiving <https://builds.apache.org/job/ActiveMQ-Apollo-Deploy/ws/trunk/apollo-scala/pom.xml>
[JENKINS] Archiving disabled - not archiving <https://builds.apache.org/job/ActiveMQ-Apollo-Deploy/ws/trunk/apollo-dto/pom.xml>
[JENKINS] Archiving disabled - not archiving <https://builds.apache.org/job/ActiveMQ-Apollo-Deploy/ws/trunk/apollo-dto/target/apollo-dto-99-trunk-SNAPSHOT.jar>
[JENKINS] Archiving disabled - not archiving <https://builds.apache.org/job/ActiveMQ-Apollo-Deploy/ws/trunk/apollo-broker/pom.xml>
[JENKINS] Archiving disabled - not archiving <https://builds.apache.org/job/ActiveMQ-Apollo-Deploy/ws/trunk/apollo-broker/target/apollo-broker-99-trunk-SNAPSHOT.jar>
[JENKINS] Archiving disabled - not archiving <https://builds.apache.org/job/ActiveMQ-Apollo-Deploy/ws/trunk/apollo-broker/target/apollo-broker-99-trunk-SNAPSHOT-tests.jar>
[JENKINS] Archiving disabled - not archiving <https://builds.apache.org/job/ActiveMQ-Apollo-Deploy/ws/trunk/apollo-cli/pom.xml>
[JENKINS] Archiving disabled - not archiving <https://builds.apache.org/job/ActiveMQ-Apollo-Deploy/ws/trunk/apollo-cli/target/apollo-cli-99-trunk-SNAPSHOT.jar>
[JENKINS] Archiving disabled - not archiving <https://builds.apache.org/job/ActiveMQ-Apollo-Deploy/ws/trunk/apollo-amqp/pom.xml>
Waiting for Jenkins to finish collecting data
mavenExecutionResult exceptions not empty
message : Failed to execute goal org.scala-tools:maven-scala-plugin:2.15.2:testCompile (default)
on project apollo-amqp: wrap: org.apache.commons.exec.ExecuteException: Process exited with
an error: 1(Exit value: 1)
cause : wrap: org.apache.commons.exec.ExecuteException: Process exited with an error: 1(Exit
value: 1)
Stack trace : 
org.apache.maven.lifecycle.LifecycleExecutionException: Failed to execute goal org.scala-tools:maven-scala-plugin:2.15.2:testCompile
(default) on project apollo-amqp: wrap: org.apache.commons.exec.ExecuteException: Process
exited with an error: 1(Exit value: 1)
	at org.apache.maven.lifecycle.internal.MojoExecutor.execute(MojoExecutor.java:217)
	at org.apache.maven.lifecycle.internal.MojoExecutor.execute(MojoExecutor.java:153)
	at org.apache.maven.lifecycle.internal.MojoExecutor.execute(MojoExecutor.java:145)
	at org.apache.maven.lifecycle.internal.LifecycleModuleBuilder.buildProject(LifecycleModuleBuilder.java:84)
	at org.apache.maven.lifecycle.internal.LifecycleModuleBuilder.buildProject(LifecycleModuleBuilder.java:59)
	at org.apache.maven.lifecycle.internal.LifecycleStarter.singleThreadedBuild(LifecycleStarter.java:183)
	at org.apache.maven.lifecycle.internal.LifecycleStarter.execute(LifecycleStarter.java:161)
	at org.apache.maven.DefaultMaven.doExecute(DefaultMaven.java:319)
	at org.apache.maven.DefaultMaven.execute(DefaultMaven.java:156)
	at org.jvnet.hudson.maven3.launcher.Maven3Launcher.main(Maven3Launcher.java:79)
	at sun.reflect.NativeMethodAccessorImpl.invoke0(Native Method)
	at sun.reflect.NativeMethodAccessorImpl.invoke(NativeMethodAccessorImpl.java:39)
	at sun.reflect.DelegatingMethodAccessorImpl.invoke(DelegatingMethodAccessorImpl.java:25)
	at java.lang.reflect.Method.invoke(Method.java:597)
	at org.codehaus.plexus.classworlds.launcher.Launcher.launchStandard(Launcher.java:329)
	at org.codehaus.plexus.classworlds.launcher.Launcher.launch(Launcher.java:239)
	at org.jvnet.hudson.maven3.agent.Maven3Main.launch(Maven3Main.java:158)
	at hudson.maven.Maven3Builder.call(Maven3Builder.java:98)
	at hudson.maven.Maven3Builder.call(Maven3Builder.java:64)
	at hudson.remoting.UserRequest.perform(UserRequest.java:118)
	at hudson.remoting.UserRequest.perform(UserRequest.java:48)
	at hudson.remoting.Request$2.run(Request.java:287)
	at hudson.remoting.InterceptingExecutorService$1.call(InterceptingExecutorService.java:72)
	at java.util.concurrent.FutureTask$Sync.innerRun(FutureTask.java:303)
	at java.util.concurrent.FutureTask.run(FutureTask.java:138)
	at java.util.concurrent.ThreadPoolExecutor$Worker.runTask(ThreadPoolExecutor.java:886)
	at java.util.concurrent.ThreadPoolExecutor$Worker.run(ThreadPoolExecutor.java:908)
	at java.lang.Thread.run(Thread.java:662)
Caused by: org.apache.maven.plugin.MojoExecutionException: wrap: org.apache.commons.exec.ExecuteException:
Process exited with an error: 1(Exit value: 1)
	at org_scala_tools_maven.ScalaMojoSupport.execute(ScalaMojoSupport.java:350)
	at org_scala_tools_maven.ScalaTestCompileMojo.execute(ScalaTestCompileMojo.java:62)
	at org.apache.maven.plugin.DefaultBuildPluginManager.executeMojo(DefaultBuildPluginManager.java:101)
	at org.apache.maven.lifecycle.internal.MojoExecutor.execute(MojoExecutor.java:209)
	... 27 more
Caused by: org.apache.commons.exec.ExecuteException: Process exited with an error: 1(Exit
value: 1)
	at org.apache.commons.exec.DefaultExecutor.executeInternal(DefaultExecutor.java:346)
	at org.apache.commons.exec.DefaultExecutor.execute(DefaultExecutor.java:149)
	at org.apache.commons.exec.DefaultExecutor.execute(DefaultExecutor.java:136)
	at org_scala_tools_maven_executions.JavaMainCallerByFork.run(JavaMainCallerByFork.java:80)
	at org_scala_tools_maven.ScalaCompilerSupport.compile(ScalaCompilerSupport.java:124)
	at org_scala_tools_maven.ScalaCompilerSupport.doExecute(ScalaCompilerSupport.java:80)
	at org_scala_tools_maven.ScalaMojoSupport.execute(ScalaMojoSupport.java:342)
	... 30 more
channel stopped

Mime
View raw message