activemq-commits mailing list archives

Site index · List index
Message view « Date » · « Thread »
Top « Date » · « Thread »
From Apache Jenkins Server <jenk...@builds.apache.org>
Subject Build failed in Jenkins: ActiveMQ-Apollo-Deploy #231
Date Mon, 02 Apr 2012 03:19:10 GMT
See <https://builds.apache.org/job/ActiveMQ-Apollo-Deploy/231/changes>

Changes:

[chirino] Fixes APLO-76: It would be nice to be able to configure Apollo's behavior when a
queue is full.  You can now block, or drop from the tail or head of the queue.

[chirino] Fixes APLO-16 : Add support for Dead Letter Queues

[chirino] Move the persistent and expiration properties from the Message trait to the Delivery
class.

[chirino] Rename the OptionSupport methods to apply so that it's easier to use without having
to import it's methods.

[chirino] Fixes build on JDK 1.7 OS X machines.

[chirino] The test xml files were incorrectly using the name attribute instead of the id attribute.

------------------------------------------
[...truncated 3887 lines...]
Downloaded: http://repo1.maven.org/maven2/org/slf4j/slf4j-nop/1.6.1/slf4j-nop-1.6.1.pom (2
KB at 4.0 KB/sec)
Downloading: http://repo1.maven.org/maven2/org/fusesource/mvnplugins/scala-mojo-support/1.16/scala-mojo-support-1.16.pom
Downloaded: http://repo1.maven.org/maven2/org/fusesource/mvnplugins/scala-mojo-support/1.16/scala-mojo-support-1.16.pom
(5 KB at 9.1 KB/sec)
Downloading: http://repo1.maven.org/maven2/org/fusesource/mvnplugins/mvnplugins/1.16/mvnplugins-1.16.pom
Downloaded: http://repo1.maven.org/maven2/org/fusesource/mvnplugins/mvnplugins/1.16/mvnplugins-1.16.pom
(9 KB at 17.7 KB/sec)
Downloading: http://repo1.maven.org/maven2/org/apache/maven/maven-plugin-tools-api/2.1/maven-plugin-tools-api-2.1.pom
Downloaded: http://repo1.maven.org/maven2/org/apache/maven/maven-plugin-tools-api/2.1/maven-plugin-tools-api-2.1.pom
(2 KB at 3.7 KB/sec)
Downloading: http://repo1.maven.org/maven2/org/apache/maven/maven-plugin-tools/2.1/maven-plugin-tools-2.1.pom
Downloaded: http://repo1.maven.org/maven2/org/apache/maven/maven-plugin-tools/2.1/maven-plugin-tools-2.1.pom
(4 KB at 6.5 KB/sec)
Downloading: http://repo1.maven.org/maven2/jline/jline/0.9.94/jline-0.9.94.pom
Downloaded: http://repo1.maven.org/maven2/jline/jline/0.9.94/jline-0.9.94.pom (7 KB at 13.5
KB/sec)
Downloading: http://repo1.maven.org/maven2/commons-lang/commons-lang/2.6/commons-lang-2.6.pom
Downloaded: http://repo1.maven.org/maven2/commons-lang/commons-lang/2.6/commons-lang-2.6.pom
(18 KB at 32.9 KB/sec)
Downloading: http://repo1.maven.org/maven2/org/apache/commons/commons-parent/17/commons-parent-17.pom
Downloaded: http://repo1.maven.org/maven2/org/apache/commons/commons-parent/17/commons-parent-17.pom
(31 KB at 61.8 KB/sec)
Downloading: http://repo1.maven.org/maven2/org/apache/maven/wagon/wagon-provider-api/1.0-beta-7/wagon-provider-api-1.0-beta-7.pom
Downloaded: http://repo1.maven.org/maven2/org/apache/maven/wagon/wagon-provider-api/1.0-beta-7/wagon-provider-api-1.0-beta-7.pom
(2 KB at 3.6 KB/sec)
Downloading: http://repo1.maven.org/maven2/org/apache/maven/wagon/wagon/1.0-beta-7/wagon-1.0-beta-7.pom
Downloaded: http://repo1.maven.org/maven2/org/apache/maven/wagon/wagon/1.0-beta-7/wagon-1.0-beta-7.pom
(12 KB at 22.9 KB/sec)
Downloading: http://repo1.maven.org/maven2/org/apache/maven/wagon/wagon-file/1.0-beta-7/wagon-file-1.0-beta-7.pom
Downloaded: http://repo1.maven.org/maven2/org/apache/maven/wagon/wagon-file/1.0-beta-7/wagon-file-1.0-beta-7.pom
(2 KB at 2.9 KB/sec)
Downloading: http://repo1.maven.org/maven2/org/apache/maven/wagon/wagon-providers/1.0-beta-7/wagon-providers-1.0-beta-7.pom
Downloaded: http://repo1.maven.org/maven2/org/apache/maven/wagon/wagon-providers/1.0-beta-7/wagon-providers-1.0-beta-7.pom
(3 KB at 4.4 KB/sec)
Downloading: http://repo1.maven.org/maven2/org/apache/maven/wagon/wagon-ssh/1.0-beta-7/wagon-ssh-1.0-beta-7.pom
Downloaded: http://repo1.maven.org/maven2/org/apache/maven/wagon/wagon-ssh/1.0-beta-7/wagon-ssh-1.0-beta-7.pom
(3 KB at 5.3 KB/sec)
Downloading: http://repo1.maven.org/maven2/com/jcraft/jsch/0.1.38/jsch-0.1.38.pom
Downloaded: http://repo1.maven.org/maven2/com/jcraft/jsch/0.1.38/jsch-0.1.38.pom (967 B at
2.1 KB/sec)
Downloading: http://repo1.maven.org/maven2/org/apache/maven/wagon/wagon-ssh-common/1.0-beta-7/wagon-ssh-common-1.0-beta-7.pom
Downloaded: http://repo1.maven.org/maven2/org/apache/maven/wagon/wagon-ssh-common/1.0-beta-7/wagon-ssh-common-1.0-beta-7.pom
(2 KB at 3.7 KB/sec)
Downloading: http://repo1.maven.org/maven2/org/codehaus/plexus/plexus-interactivity-api/1.0-alpha-6/plexus-interactivity-api-1.0-alpha-6.pom
Downloaded: http://repo1.maven.org/maven2/org/codehaus/plexus/plexus-interactivity-api/1.0-alpha-6/plexus-interactivity-api-1.0-alpha-6.pom
(726 B at 1.4 KB/sec)
Downloading: http://repo1.maven.org/maven2/org/codehaus/plexus/plexus-interactivity/1.0-alpha-6/plexus-interactivity-1.0-alpha-6.pom
Downloaded: http://repo1.maven.org/maven2/org/codehaus/plexus/plexus-interactivity/1.0-alpha-6/plexus-interactivity-1.0-alpha-6.pom
(2 KB at 2.1 KB/sec)
Downloading: http://repo1.maven.org/maven2/org/codehaus/plexus/plexus-components/1.1.9/plexus-components-1.1.9.pom
Downloaded: http://repo1.maven.org/maven2/org/codehaus/plexus/plexus-components/1.1.9/plexus-components-1.1.9.pom
(3 KB at 4.7 KB/sec)
Downloading: http://repo1.maven.org/maven2/org/codehaus/plexus/plexus-utils/1.4/plexus-utils-1.4.pom
Downloaded: http://repo1.maven.org/maven2/org/codehaus/plexus/plexus-utils/1.4/plexus-utils-1.4.pom
(2 KB at 1.4 KB/sec)
Downloading: http://repo1.maven.org/maven2/org/apache/maven/wagon/wagon-http-lightweight/1.0-beta-7/wagon-http-lightweight-1.0-beta-7.pom
Downloaded: http://repo1.maven.org/maven2/org/apache/maven/wagon/wagon-http-lightweight/1.0-beta-7/wagon-http-lightweight-1.0-beta-7.pom
(2 KB at 4.0 KB/sec)
Downloading: http://repo1.maven.org/maven2/org/apache/maven/wagon/wagon-http-shared/1.0-beta-7/wagon-http-shared-1.0-beta-7.pom
Downloaded: http://repo1.maven.org/maven2/org/apache/maven/wagon/wagon-http-shared/1.0-beta-7/wagon-http-shared-1.0-beta-7.pom
(3 KB at 7.9 KB/sec)
Downloading: http://repo1.maven.org/maven2/nekohtml/xercesMinimal/1.9.6.2/xercesMinimal-1.9.6.2.pom
Downloaded: http://repo1.maven.org/maven2/nekohtml/xercesMinimal/1.9.6.2/xercesMinimal-1.9.6.2.pom
(390 B at 0.8 KB/sec)
Downloading: http://repo1.maven.org/maven2/nekohtml/nekohtml/1.9.6.2/nekohtml-1.9.6.2.pom
Downloaded: http://repo1.maven.org/maven2/nekohtml/nekohtml/1.9.6.2/nekohtml-1.9.6.2.pom (704
B at 1.4 KB/sec)
Downloading: http://repo1.maven.org/maven2/org/codehaus/plexus/plexus-utils/2.0.2/plexus-utils-2.0.2.pom
Downloaded: http://repo1.maven.org/maven2/org/codehaus/plexus/plexus-utils/2.0.2/plexus-utils-2.0.2.pom
(4 KB at 6.4 KB/sec)
Downloading: http://repo1.maven.org/maven2/org/codehaus/swizzle/swizzle-confluence/1.4/swizzle-confluence-1.4.pom
Downloaded: http://repo1.maven.org/maven2/org/codehaus/swizzle/swizzle-confluence/1.4/swizzle-confluence-1.4.pom
(2 KB at 3.2 KB/sec)
Downloading: http://repo1.maven.org/maven2/org/codehaus/swizzle/swizzle/1.4/swizzle-1.4.pom
Downloaded: http://repo1.maven.org/maven2/org/codehaus/swizzle/swizzle/1.4/swizzle-1.4.pom
(4 KB at 6.9 KB/sec)
Downloading: http://repo1.maven.org/maven2/org/sonatype/oss/oss-parent/5/oss-parent-5.pom
Downloaded: http://repo1.maven.org/maven2/org/sonatype/oss/oss-parent/5/oss-parent-5.pom (4
KB at 8.4 KB/sec)
Downloading: http://repo1.maven.org/maven2/xmlrpc/xmlrpc-client/3.0/xmlrpc-client-3.0.pom
Downloaded: http://repo1.maven.org/maven2/xmlrpc/xmlrpc-client/3.0/xmlrpc-client-3.0.pom (808
B at 1.5 KB/sec)
Downloading: http://repo1.maven.org/maven2/org/apache/xmlrpc/xmlrpc/3.0/xmlrpc-3.0.pom
Downloaded: http://repo1.maven.org/maven2/org/apache/xmlrpc/xmlrpc/3.0/xmlrpc-3.0.pom (12
KB at 19.6 KB/sec)
Downloading: http://repo1.maven.org/maven2/org/apache/xmlrpc/xmlrpc-common/3.0/xmlrpc-common-3.0.pom
Downloaded: http://repo1.maven.org/maven2/org/apache/xmlrpc/xmlrpc-common/3.0/xmlrpc-common-3.0.pom
(854 B at 2.0 KB/sec)
Downloading: http://repo1.maven.org/maven2/org/apache/ws/commons/ws-commons-util/1.0.1/ws-commons-util-1.0.1.pom
Downloaded: http://repo1.maven.org/maven2/org/apache/ws/commons/ws-commons-util/1.0.1/ws-commons-util-1.0.1.pom
(6 KB at 8.6 KB/sec)
Downloading: http://repo1.maven.org/maven2/org/scala-lang/scala-library/2.9.1/scala-library-2.9.1.jar
Downloading: http://repo1.maven.org/maven2/org/slf4j/slf4j-nop/1.6.1/slf4j-nop-1.6.1.jar
Downloading: http://repo1.maven.org/maven2/org/fusesource/mvnplugins/scala-mojo-support/1.16/scala-mojo-support-1.16.jar
Downloading: http://repo1.maven.org/maven2/org/apache/maven/maven-plugin-tools-api/2.1/maven-plugin-tools-api-2.1.jar
Downloading: http://repo1.maven.org/maven2/jline/jline/0.9.94/jline-0.9.94.jar
Downloaded: http://repo1.maven.org/maven2/org/apache/maven/maven-plugin-tools-api/2.1/maven-plugin-tools-api-2.1.jar
(29 KB at 19.0 KB/sec)
Downloading: http://repo1.maven.org/maven2/commons-lang/commons-lang/2.6/commons-lang-2.6.jar
Downloaded: http://repo1.maven.org/maven2/org/slf4j/slf4j-nop/1.6.1/slf4j-nop-1.6.1.jar (5
KB at 2.7 KB/sec)
Downloading: http://repo1.maven.org/maven2/org/apache/maven/wagon/wagon-file/1.0-beta-7/wagon-file-1.0-beta-7.jar
Downloaded: http://repo1.maven.org/maven2/org/fusesource/mvnplugins/scala-mojo-support/1.16/scala-mojo-support-1.16.jar
(199 KB at 98.7 KB/sec)
Downloading: http://repo1.maven.org/maven2/org/apache/maven/wagon/wagon-ssh/1.0-beta-7/wagon-ssh-1.0-beta-7.jar
Downloaded: http://repo1.maven.org/maven2/jline/jline/0.9.94/jline-0.9.94.jar (86 KB at 35.8
KB/sec)
Downloading: http://repo1.maven.org/maven2/com/jcraft/jsch/0.1.38/jsch-0.1.38.jar
Downloaded: http://repo1.maven.org/maven2/org/scala-lang/scala-library/2.9.1/scala-library-2.9.1.jar
(8636 KB at 2929.4 KB/sec)
Downloading: http://repo1.maven.org/maven2/org/apache/maven/wagon/wagon-ssh-common/1.0-beta-7/wagon-ssh-common-1.0-beta-7.jar
Downloaded: http://repo1.maven.org/maven2/org/apache/maven/wagon/wagon-file/1.0-beta-7/wagon-file-1.0-beta-7.jar
(11 KB at 5.1 KB/sec)
Downloading: http://repo1.maven.org/maven2/org/codehaus/plexus/plexus-interactivity-api/1.0-alpha-6/plexus-interactivity-api-1.0-alpha-6.jar
Downloaded: http://repo1.maven.org/maven2/commons-lang/commons-lang/2.6/commons-lang-2.6.jar
(278 KB at 102.1 KB/sec)
Downloading: http://repo1.maven.org/maven2/org/apache/maven/wagon/wagon-http-lightweight/1.0-beta-7/wagon-http-lightweight-1.0-beta-7.jar
Downloaded: http://repo1.maven.org/maven2/org/apache/maven/wagon/wagon-ssh/1.0-beta-7/wagon-ssh-1.0-beta-7.jar
(28 KB at 11.3 KB/sec)
Downloading: http://repo1.maven.org/maven2/org/apache/maven/wagon/wagon-http-shared/1.0-beta-7/wagon-http-shared-1.0-beta-7.jar
Downloaded: http://repo1.maven.org/maven2/com/jcraft/jsch/0.1.38/jsch-0.1.38.jar (174 KB at
66.5 KB/sec)
Downloading: http://repo1.maven.org/maven2/nekohtml/xercesMinimal/1.9.6.2/xercesMinimal-1.9.6.2.jar
Downloaded: http://repo1.maven.org/maven2/org/apache/maven/wagon/wagon-ssh-common/1.0-beta-7/wagon-ssh-common-1.0-beta-7.jar
(27 KB at 11.4 KB/sec)
Downloading: http://repo1.maven.org/maven2/nekohtml/nekohtml/1.9.6.2/nekohtml-1.9.6.2.jar
Downloaded: http://repo1.maven.org/maven2/org/codehaus/plexus/plexus-interactivity-api/1.0-alpha-6/plexus-interactivity-api-1.0-alpha-6.jar
(12 KB at 5.5 KB/sec)
Downloading: http://repo1.maven.org/maven2/commons-logging/commons-logging/1.1.1/commons-logging-1.1.1.jar
Downloaded: http://repo1.maven.org/maven2/org/apache/maven/wagon/wagon-http-lightweight/1.0-beta-7/wagon-http-lightweight-1.0-beta-7.jar
(15 KB at 5.8 KB/sec)
Downloading: http://repo1.maven.org/maven2/org/codehaus/plexus/plexus-utils/2.0.2/plexus-utils-2.0.2.jar
Downloaded: http://repo1.maven.org/maven2/org/apache/maven/wagon/wagon-http-shared/1.0-beta-7/wagon-http-shared-1.0-beta-7.jar
(25 KB at 9.9 KB/sec)
Downloading: http://repo1.maven.org/maven2/org/codehaus/swizzle/swizzle-confluence/1.4/swizzle-confluence-1.4.jar
Downloaded: http://repo1.maven.org/maven2/nekohtml/xercesMinimal/1.9.6.2/xercesMinimal-1.9.6.2.jar
(39 KB at 15.8 KB/sec)
Downloading: http://repo1.maven.org/maven2/xmlrpc/xmlrpc-client/3.0/xmlrpc-client-3.0.jar
Downloaded: http://repo1.maven.org/maven2/nekohtml/nekohtml/1.9.6.2/nekohtml-1.9.6.2.jar (110
KB at 40.3 KB/sec)
Downloading: http://repo1.maven.org/maven2/org/apache/xmlrpc/xmlrpc-common/3.0/xmlrpc-common-3.0.jar
Downloaded: http://repo1.maven.org/maven2/commons-logging/commons-logging/1.1.1/commons-logging-1.1.1.jar
(60 KB at 23.7 KB/sec)
Downloading: http://repo1.maven.org/maven2/org/apache/ws/commons/ws-commons-util/1.0.1/ws-commons-util-1.0.1.jar
Downloaded: http://repo1.maven.org/maven2/org/codehaus/plexus/plexus-utils/2.0.2/plexus-utils-2.0.2.jar
(218 KB at 87.5 KB/sec)
Downloaded: http://repo1.maven.org/maven2/org/codehaus/swizzle/swizzle-confluence/1.4/swizzle-confluence-1.4.jar
(29 KB at 11.5 KB/sec)
Downloaded: http://repo1.maven.org/maven2/xmlrpc/xmlrpc-client/3.0/xmlrpc-client-3.0.jar (43
KB at 16.8 KB/sec)
Downloaded: http://repo1.maven.org/maven2/org/apache/xmlrpc/xmlrpc-common/3.0/xmlrpc-common-3.0.jar
(96 KB at 42.2 KB/sec)
Downloaded: http://repo1.maven.org/maven2/org/apache/ws/commons/ws-commons-util/1.0.1/ws-commons-util-1.0.1.jar
(35 KB at 17.0 KB/sec)
Processing Configuration for child elements
Processing child [project]
Processing child [workingDirectory]
Processing child [webappDirectory]
Processing child [targetDirectory]
Processing child [testClassPathElements]
[INFO] Generating static website from Scalate Templates and wiki files...
[INFO] template properties: null
[INFO]     processing <https://builds.apache.org/job/ActiveMQ-Apollo-Deploy/ws/trunk/apollo-website/src/download.page>
with uri: /download.page => 
[INFO]     processing <https://builds.apache.org/job/ActiveMQ-Apollo-Deploy/ws/trunk/apollo-website/src/documentation/management-api.md>
with uri: /documentation/management-api.md => 
[INFO]     processing <https://builds.apache.org/job/ActiveMQ-Apollo-Deploy/ws/trunk/apollo-website/src/documentation/user-manual.md>
with uri: /documentation/user-manual.md => 
[INFO]     processing <https://builds.apache.org/job/ActiveMQ-Apollo-Deploy/ws/trunk/apollo-website/src/documentation/extending-guide.md>
with uri: /documentation/extending-guide.md => 
[INFO]     processing <https://builds.apache.org/job/ActiveMQ-Apollo-Deploy/ws/trunk/apollo-website/src/documentation/verification.md>
with uri: /documentation/verification.md => 
[INFO]     processing <https://builds.apache.org/job/ActiveMQ-Apollo-Deploy/ws/trunk/apollo-website/src/documentation/architecture.md>
with uri: /documentation/architecture.md => 
[INFO]     processing <https://builds.apache.org/job/ActiveMQ-Apollo-Deploy/ws/trunk/apollo-website/src/documentation/migration-guide.md>
with uri: /documentation/migration-guide.md => 
[INFO]     processing <https://builds.apache.org/job/ActiveMQ-Apollo-Deploy/ws/trunk/apollo-website/src/documentation/module-organization.page>
with uri: /documentation/module-organization.page => 
[INFO]     processing <https://builds.apache.org/job/ActiveMQ-Apollo-Deploy/ws/trunk/apollo-website/src/documentation/performance-scaling.md>
with uri: /documentation/performance-scaling.md => 
[INFO]     processing <https://builds.apache.org/job/ActiveMQ-Apollo-Deploy/ws/trunk/apollo-website/src/documentation/index.page>
with uri: /documentation/index.page => 
[INFO]     processing <https://builds.apache.org/job/ActiveMQ-Apollo-Deploy/ws/trunk/apollo-website/src/documentation/getting-started.md>
with uri: /documentation/getting-started.md => 
[INFO]     processing <https://builds.apache.org/job/ActiveMQ-Apollo-Deploy/ws/trunk/apollo-website/src/community/building.page>
with uri: /community/building.page => 
[INFO]     processing <https://builds.apache.org/job/ActiveMQ-Apollo-Deploy/ws/trunk/apollo-website/src/community/site.page>
with uri: /community/site.page => 
[INFO]     processing <https://builds.apache.org/job/ActiveMQ-Apollo-Deploy/ws/trunk/apollo-website/src/community/source.page>
with uri: /community/source.page => 
[INFO]     processing <https://builds.apache.org/job/ActiveMQ-Apollo-Deploy/ws/trunk/apollo-website/src/community/developers.page>
with uri: /community/developers.page => 
[INFO]     processing <https://builds.apache.org/job/ActiveMQ-Apollo-Deploy/ws/trunk/apollo-website/src/community/faq.page>
with uri: /community/faq.page => 
[INFO]     processing <https://builds.apache.org/job/ActiveMQ-Apollo-Deploy/ws/trunk/apollo-website/src/community/support.page>
with uri: /community/support.page => 
[INFO]     processing <https://builds.apache.org/job/ActiveMQ-Apollo-Deploy/ws/trunk/apollo-website/src/community/contributing.page>
with uri: /community/contributing.page => 
[INFO]     processing <https://builds.apache.org/job/ActiveMQ-Apollo-Deploy/ws/trunk/apollo-website/src/community/release-guide.page>
with uri: /community/release-guide.page => 
[INFO]     processing <https://builds.apache.org/job/ActiveMQ-Apollo-Deploy/ws/trunk/apollo-website/src/community/index.page>
with uri: /community/index.page => 
[INFO]     processing <https://builds.apache.org/job/ActiveMQ-Apollo-Deploy/ws/trunk/apollo-website/src/privacy-policy.page>
with uri: /privacy-policy.page => 
[INFO]     processing <https://builds.apache.org/job/ActiveMQ-Apollo-Deploy/ws/trunk/apollo-website/src/blog/releases/release-1.1.page>
with uri: /blog/releases/release-1.1.page => 
[INFO]     processing <https://builds.apache.org/job/ActiveMQ-Apollo-Deploy/ws/trunk/apollo-website/src/blog/releases/release-1-0-beta5.page>
with uri: /blog/releases/release-1-0-beta5.page => 
[INFO]     processing <https://builds.apache.org/job/ActiveMQ-Apollo-Deploy/ws/trunk/apollo-website/src/blog/releases/release-1-0-beta3.page>
with uri: /blog/releases/release-1-0-beta3.page => 
[INFO]     processing <https://builds.apache.org/job/ActiveMQ-Apollo-Deploy/ws/trunk/apollo-website/src/blog/releases/release-1-0-beta2.page>
with uri: /blog/releases/release-1-0-beta2.page => 
[INFO]     processing <https://builds.apache.org/job/ActiveMQ-Apollo-Deploy/ws/trunk/apollo-website/src/blog/releases/release-1-0-beta6.page>
with uri: /blog/releases/release-1-0-beta6.page => 
[INFO]     processing <https://builds.apache.org/job/ActiveMQ-Apollo-Deploy/ws/trunk/apollo-website/src/blog/releases/release-1-0-beta4.page>
with uri: /blog/releases/release-1-0-beta4.page => 
[INFO]     processing <https://builds.apache.org/job/ActiveMQ-Apollo-Deploy/ws/trunk/apollo-website/src/blog/releases/release-1-0-beta1.page>
with uri: /blog/releases/release-1-0-beta1.page => 
[INFO]     processing <https://builds.apache.org/job/ActiveMQ-Apollo-Deploy/ws/trunk/apollo-website/src/blog/releases/release-1.0.page>
with uri: /blog/releases/release-1.0.page => 
Using dir: <https://builds.apache.org/job/ActiveMQ-Apollo-Deploy/ws/trunk/apollo-website/src/blog>
at request path: /blog
[INFO]     processing <https://builds.apache.org/job/ActiveMQ-Apollo-Deploy/ws/trunk/apollo-website/src/blog/index.rss.feed>
with uri: /blog/index.rss.feed => 
Using dir: <https://builds.apache.org/job/ActiveMQ-Apollo-Deploy/ws/trunk/apollo-website/src/blog>
at request path: /blog
[INFO]     processing <https://builds.apache.org/job/ActiveMQ-Apollo-Deploy/ws/trunk/apollo-website/src/blog/index.page>
with uri: /blog/index.page => 
[INFO]     processing <https://builds.apache.org/job/ActiveMQ-Apollo-Deploy/ws/trunk/apollo-website/src/index.page>
with uri: /index.page => 
[INFO]     processing <https://builds.apache.org/job/ActiveMQ-Apollo-Deploy/ws/trunk/apollo-website/src/versions/index.page>
with uri: /versions/index.page => 
[INFO] [INFO] Installing <https://builds.apache.org/job/ActiveMQ-Apollo-Deploy/ws/trunk/apollo-website/pom.xml>
to <https://builds.apache.org/job/ActiveMQ-Apollo-Deploy/ws/.repository/org/apache/activemq/apollo-website/99-trunk-SNAPSHOT/apollo-website-99-trunk-SNAPSHOT.pom>

[INFO] --- maven-install-plugin:2.3.1:install (default-install) @ apollo-website ---
[INFO] Downloading: https://repository.apache.org/content/repositories/snapshots/org/apache/activemq/apollo-website/99-trunk-SNAPSHOT/maven-metadata.xml

[INFO] --- maven-deploy-plugin:2.5:deploy (default-deploy) @ apollo-website ---
Downloaded: https://repository.apache.org/content/repositories/snapshots/org/apache/activemq/apollo-website/99-trunk-SNAPSHOT/maven-metadata.xml
(618 B at 1.6 KB/sec)
Uploading: https://repository.apache.org/content/repositories/snapshots/org/apache/activemq/apollo-website/99-trunk-SNAPSHOT/apollo-website-99-trunk-20120402.031905-17.pom
Uploaded: https://repository.apache.org/content/repositories/snapshots/org/apache/activemq/apollo-website/99-trunk-SNAPSHOT/apollo-website-99-trunk-20120402.031905-17.pom
(13 KB at 37.4 KB/sec)
Downloading: https://repository.apache.org/content/repositories/snapshots/org/apache/activemq/apollo-website/maven-metadata.xml
Downloaded: https://repository.apache.org/content/repositories/snapshots/org/apache/activemq/apollo-website/maven-metadata.xml
(359 B at 1.4 KB/sec)
Uploading: https://repository.apache.org/content/repositories/snapshots/org/apache/activemq/apollo-website/99-trunk-SNAPSHOT/maven-metadata.xml
Uploaded: https://repository.apache.org/content/repositories/snapshots/org/apache/activemq/apollo-website/99-trunk-SNAPSHOT/maven-metadata.xml
(618 B at 2.3 KB/sec)
Uploading: https://repository.apache.org/content/repositories/snapshots/org/apache/activemq/apollo-website/maven-metadata.xml
Uploaded: https://repository.apache.org/content/repositories/snapshots/org/apache/activemq/apollo-website/maven-metadata.xml
(359 B at 2.1 KB/sec)
[JENKINS] Archiving disabled - not archiving <https://builds.apache.org/job/ActiveMQ-Apollo-Deploy/ws/trunk/apollo-website/pom.xml>
[INFO]                                                                         
[INFO] ------------------------------------------------------------------------
[INFO] Skipping apache-apollo
[INFO] This project has been banned from the build due to previous failures.
[INFO] ------------------------------------------------------------------------
[INFO] ------------------------------------------------------------------------
[INFO] Reactor Summary:
[INFO] 
[INFO] Apache ActiveMQ Apollo Project .................... SUCCESS [3:34.026s]
[INFO] apollo-boot ....................................... SUCCESS [22.766s]
[INFO] apollo-scala ...................................... SUCCESS [37.581s]
[INFO] apollo-util ....................................... SUCCESS [1:34.366s]
[INFO] apollo-dto ........................................ SUCCESS [33.252s]
[INFO] apollo-selector ................................... SUCCESS [47.719s]
[INFO] apollo-broker ..................................... SUCCESS [1:36.610s]
[INFO] apollo-web ........................................ FAILURE [1:11.673s]
[INFO] apollo-leveldb .................................... SKIPPED
[INFO] apollo-bdb ........................................ SKIPPED
[INFO] apollo-stomp ...................................... SKIPPED
[INFO] apollo-openwire-generator ......................... SUCCESS [29.813s]
[INFO] apollo-openwire ................................... SKIPPED
[INFO] apollo-cli ........................................ SKIPPED
[INFO] apollo-website .................................... SUCCESS [1:49.422s]
[INFO] apache-apollo ..................................... SKIPPED
[INFO] ------------------------------------------------------------------------
[INFO] BUILD FAILURE
[INFO] ------------------------------------------------------------------------
[INFO] Total time: 12:45.769s
[INFO] Finished at: Mon Apr 02 03:19:07 UTC 2012
[INFO] Final Memory: 118M/989M
[INFO] ------------------------------------------------------------------------
Waiting for Jenkins to finish collecting data
mavenExecutionResult exceptions not empty
message : Failed to execute goal on project apollo-web: Could not resolve dependencies for
project org.apache.activemq:apollo-web:jar:99-trunk-SNAPSHOT: Could not find artifact com.wordnik:swagger-jaxrs_2.9.1:jar:1.02-SNAPSHOT
in Nexus (http://repository.apache.org/snapshots)
cause : Could not resolve dependencies for project org.apache.activemq:apollo-web:jar:99-trunk-SNAPSHOT:
Could not find artifact com.wordnik:swagger-jaxrs_2.9.1:jar:1.02-SNAPSHOT in Nexus (http://repository.apache.org/snapshots)
Stack trace : 
org.apache.maven.lifecycle.LifecycleExecutionException: Failed to execute goal on project
apollo-web: Could not resolve dependencies for project org.apache.activemq:apollo-web:jar:99-trunk-SNAPSHOT:
Could not find artifact com.wordnik:swagger-jaxrs_2.9.1:jar:1.02-SNAPSHOT in Nexus (http://repository.apache.org/snapshots)
	at org.apache.maven.lifecycle.internal.LifecycleDependencyResolver.getDependencies(LifecycleDependencyResolver.java:190)
	at org.apache.maven.lifecycle.internal.LifecycleDependencyResolver.resolveProjectDependencies(LifecycleDependencyResolver.java:104)
	at org.apache.maven.lifecycle.internal.MojoExecutor.ensureDependenciesAreResolved(MojoExecutor.java:258)
	at org.apache.maven.lifecycle.internal.MojoExecutor.execute(MojoExecutor.java:201)
	at org.apache.maven.lifecycle.internal.MojoExecutor.execute(MojoExecutor.java:153)
	at org.apache.maven.lifecycle.internal.MojoExecutor.execute(MojoExecutor.java:145)
	at org.apache.maven.lifecycle.internal.LifecycleModuleBuilder.buildProject(LifecycleModuleBuilder.java:84)
	at org.apache.maven.lifecycle.internal.LifecycleModuleBuilder.buildProject(LifecycleModuleBuilder.java:59)
	at org.apache.maven.lifecycle.internal.LifecycleStarter.singleThreadedBuild(LifecycleStarter.java:183)
	at org.apache.maven.lifecycle.internal.LifecycleStarter.execute(LifecycleStarter.java:161)
	at org.apache.maven.DefaultMaven.doExecute(DefaultMaven.java:319)
	at org.apache.maven.DefaultMaven.execute(DefaultMaven.java:156)
	at org.jvnet.hudson.maven3.launcher.Maven3Launcher.main(Maven3Launcher.java:79)
	at sun.reflect.NativeMethodAccessorImpl.invoke0(Native Method)
	at sun.reflect.NativeMethodAccessorImpl.invoke(NativeMethodAccessorImpl.java:39)
	at sun.reflect.DelegatingMethodAccessorImpl.invoke(DelegatingMethodAccessorImpl.java:25)
	at java.lang.reflect.Method.invoke(Method.java:597)
	at org.codehaus.plexus.classworlds.launcher.Launcher.launchStandard(Launcher.java:329)
	at org.codehaus.plexus.classworlds.launcher.Launcher.launch(Launcher.java:239)
	at org.jvnet.hudson.maven3.agent.Maven3Main.launch(Maven3Main.java:158)
	at hudson.maven.Maven3Builder.call(Maven3Builder.java:104)
	at hudson.maven.Maven3Builder.call(Maven3Builder.java:70)
	at hudson.remoting.UserRequest.perform(UserRequest.java:118)
	at hudson.remoting.UserRequest.perform(UserRequest.java:48)
	at hudson.remoting.Request$2.run(Request.java:287)
	at hudson.remoting.InterceptingExecutorService$1.call(InterceptingExecutorService.java:72)
	at java.util.concurrent.FutureTask$Sync.innerRun(FutureTask.java:303)
	at java.util.concurrent.FutureTask.run(FutureTask.java:138)
	at java.util.concurrent.ThreadPoolExecutor$Worker.runTask(ThreadPoolExecutor.java:886)
	at java.util.concurrent.ThreadPoolExecutor$Worker.run(ThreadPoolExecutor.java:908)
	at java.lang.Thread.run(Thread.java:662)
Caused by: org.apache.maven.project.DependencyResolutionException: Could not resolve dependencies
for project org.apache.activemq:apollo-web:jar:99-trunk-SNAPSHOT: Could not find artifact
com.wordnik:swagger-jaxrs_2.9.1:jar:1.02-SNAPSHOT in Nexus (http://repository.apache.org/snapshots)
	at org.apache.maven.project.DefaultProjectDependenciesResolver.resolve(DefaultProjectDependenciesResolver.java:156)
	at org.apache.maven.lifecycle.internal.LifecycleDependencyResolver.getDependencies(LifecycleDependencyResolver.java:165)
	... 30 more
Caused by: org.sonatype.aether.resolution.ArtifactResolutionException: Could not find artifact
com.wordnik:swagger-jaxrs_2.9.1:jar:1.02-SNAPSHOT in Nexus (http://repository.apache.org/snapshots)
	at org.sonatype.aether.impl.internal.DefaultArtifactResolver.resolveArtifacts(DefaultArtifactResolver.java:526)
	at org.sonatype.aether.impl.internal.DefaultRepositorySystem.resolveArtifacts(DefaultRepositorySystem.java:304)
	at org.sonatype.aether.impl.internal.DefaultRepositorySystem.resolveDependencies(DefaultRepositorySystem.java:334)
	at org.apache.maven.project.DefaultProjectDependenciesResolver.resolve(DefaultProjectDependenciesResolver.java:150)
	... 31 more
Caused by: org.sonatype.aether.transfer.ArtifactNotFoundException: Could not find artifact
com.wordnik:swagger-jaxrs_2.9.1:jar:1.02-SNAPSHOT in Nexus (http://repository.apache.org/snapshots)
	at org.sonatype.aether.connector.wagon.WagonRepositoryConnector$4.wrap(WagonRepositoryConnector.java:945)
	at org.sonatype.aether.connector.wagon.WagonRepositoryConnector$4.wrap(WagonRepositoryConnector.java:940)
	at org.sonatype.aether.connector.wagon.WagonRepositoryConnector$GetTask.flush(WagonRepositoryConnector.java:696)
	at org.sonatype.aether.connector.wagon.WagonRepositoryConnector$GetTask.flush(WagonRepositoryConnector.java:690)
	at org.sonatype.aether.connector.wagon.WagonRepositoryConnector.get(WagonRepositoryConnector.java:435)
	at org.sonatype.aether.impl.internal.DefaultArtifactResolver.resolveArtifacts(DefaultArtifactResolver.java:438)
	... 34 more
channel stopped

Mime
View raw message