activemq-commits mailing list archives

Site index · List index
Message view « Date » · « Thread »
Top « Date » · « Thread »
From Apache Jenkins Server <jenk...@builds.apache.org>
Subject Build failed in Jenkins: ActiveMQ-Apollo #648
Date Fri, 30 Mar 2012 18:20:46 GMT
See <https://builds.apache.org/job/ActiveMQ-Apollo/648/changes>

Changes:

[chirino] Remove debugging print statements.

------------------------------------------
[...truncated 1872 lines...]
-------------------------------------------------------
 T E S T S
-------------------------------------------------------
There are no tests to run.

Results :

Tests run: 0, Failures: 0, Errors: 0, Skipped: 0

[JENKINS] Recording test results
[INFO] 
[INFO] --- maven-jar-plugin:2.3.1:jar (default-jar) @ apollo-openwire-generator ---
[INFO] Building jar: F:\hudson\hudson-slave\workspace\ActiveMQ-Apollo\trunk\apollo-openwire-generator\target\apollo-openwire-generator-99-trunk-SNAPSHOT.jar
[INFO] 
[INFO] --- maven-site-plugin:3.0:attach-descriptor (attach-descriptor) @ apollo-openwire-generator
---
[INFO] 
[INFO] --- maven-install-plugin:2.3.1:install (default-install) @ apollo-openwire-generator
---
[INFO] Installing F:\hudson\hudson-slave\workspace\ActiveMQ-Apollo\trunk\apollo-openwire-generator\target\apollo-openwire-generator-99-trunk-SNAPSHOT.jar
to f:\hudson\hudson-slave\maven-repositories\1\org\apache\activemq\apollo-openwire-generator\99-trunk-SNAPSHOT\apollo-openwire-generator-99-trunk-SNAPSHOT.jar
[INFO] Installing F:\hudson\hudson-slave\workspace\ActiveMQ-Apollo\trunk\apollo-openwire-generator\pom.xml
to f:\hudson\hudson-slave\maven-repositories\1\org\apache\activemq\apollo-openwire-generator\99-trunk-SNAPSHOT\apollo-openwire-generator-99-trunk-SNAPSHOT.pom
[JENKINS] Archiving disabled - not archiving F:\hudson\hudson-slave\workspace\ActiveMQ-Apollo\trunk\apollo-openwire-generator\pom.xml
[JENKINS] Archiving disabled - not archiving F:\hudson\hudson-slave\workspace\ActiveMQ-Apollo\trunk\apollo-openwire-generator\target\apollo-openwire-generator-99-trunk-SNAPSHOT.jar
[INFO]                                                                         
[INFO] ------------------------------------------------------------------------
[INFO] Skipping apollo-openwire
[INFO] This project has been banned from the build due to previous failures.
[INFO] ------------------------------------------------------------------------
[INFO]                                                                         
[INFO] ------------------------------------------------------------------------
[INFO] Skipping apollo-cli
[INFO] This project has been banned from the build due to previous failures.
[INFO] ------------------------------------------------------------------------
[INFO]                                                                         
[INFO] ------------------------------------------------------------------------
[INFO] Building apollo-website 99-trunk-SNAPSHOT
[INFO] ------------------------------------------------------------------------
[INFO] 
[INFO] --- maven-clean-plugin:2.4.1:clean (default-clean) @ apollo-website ---
[INFO] 
[INFO] --- maven-enforcer-plugin:1.0:enforce (default) @ apollo-website ---
[INFO] [WARNING] Parameter tasks is deprecated, use target instead

[INFO] --- maven-antrun-plugin:1.7:run (default) @ apollo-website ---
[INFO] Executing tasks

main:
    [mkdir] Created dir: F:\hudson\hudson-slave\workspace\ActiveMQ-Apollo\trunk\apollo-website\target\sitegen\documentation\schema
[schemagen] Generating schema from 67 source files
Note: Writing F:\hudson\hudson-slave\workspace\ActiveMQ-Apollo\trunk\apollo-website\target\sitegen\documentation\schema\apollo.xsd
[INFO] Executed tasks
[INFO] 
[INFO] --- maven-remote-resources-plugin:1.1:process (default) @ apollo-website ---
[INFO] [INFO] Checking for multiple versions of scala

[INFO] --- maven-scala-plugin:2.15.2:compile (default) @ apollo-website ---
[INFO] includes = [**/*.scala,**/*.java,]
[INFO] excludes = []
[INFO] F:\hudson\hudson-slave\workspace\ActiveMQ-Apollo\trunk\apollo-website\ext:-1: info:
compiling
[INFO] Compiling 3 source files to F:\hudson\hudson-slave\workspace\ActiveMQ-Apollo\trunk\apollo-website\target\classes
at 1333131605307
[INFO] compiler plugin: BasicArtifact(org.fusesource.jvmassert,jvmassert,1.2)
[INFO] prepare-compile in 0 s
[INFO] compile in 7 s
[INFO] 
[INFO] --- maven-scala-plugin:2.15.2:testCompile (default) @ apollo-website ---
[INFO] Checking for multiple versions of scala
[INFO] includes = [**/*.scala,**/*.java,]
[INFO] excludes = []
[WARNING] No source files found.
[INFO] 
[INFO] --- maven-site-plugin:3.0:attach-descriptor (attach-descriptor) @ apollo-website ---
[INFO] 
[INFO] --- maven-enforcer-plugin:1.0:enforce (default) @ apollo-website ---
[JENKINS] Archiving disabled - not archiving F:\hudson\hudson-slave\workspace\ActiveMQ-Apollo\trunk\apollo-website\pom.xml
Mar 30, 2012 7:20:12 PM hudson.maven.ExecutedMojo <init>
WARNING: Failed to getClass for org.apache.maven.plugin.source.SourceJarMojo
[INFO] 
[INFO] --- maven-source-plugin:2.1.2:jar (attach-sources) @ apollo-website ---
[INFO] 
[INFO] --- maven-enforcer-plugin:1.0:enforce (default) @ apollo-website ---
[INFO] [WARNING] Parameter tasks is deprecated, use target instead

[INFO] --- maven-antrun-plugin:1.7:run (default) @ apollo-website ---
[INFO] Executing tasks

main:
[schemagen] Generating schema from 67 source files
Note: Writing F:\hudson\hudson-slave\workspace\ActiveMQ-Apollo\trunk\apollo-website\target\sitegen\documentation\schema\apollo.xsd
[INFO] Executed tasks
[INFO] 
[INFO] --- maven-remote-resources-plugin:1.1:process (default) @ apollo-website ---
[INFO] 
[INFO] --- maven-scala-plugin:2.15.2:compile (default) @ apollo-website ---
[INFO] Checking for multiple versions of scala
[INFO] includes = [**/*.scala,**/*.java,]
[INFO] excludes = []
[INFO] Nothing to compile - all classes are up to date
[INFO] 
[INFO] --- maven-scala-plugin:2.15.2:testCompile (default) @ apollo-website ---
[INFO] Checking for multiple versions of scala
[INFO] includes = [**/*.scala,**/*.java,]
[INFO] excludes = []
[WARNING] No source files found.
[INFO] 
[INFO] --- maven-site-plugin:3.0:attach-descriptor (attach-descriptor) @ apollo-website ---
[INFO] 
[INFO] --- maven-enforcer-plugin:1.0:enforce (default) @ apollo-website ---
[JENKINS] Archiving disabled - not archiving F:\hudson\hudson-slave\workspace\ActiveMQ-Apollo\trunk\apollo-website\pom.xml
Mar 30, 2012 7:20:14 PM hudson.maven.ExecutedMojo <init>
WARNING: Failed to getClass for org.apache.maven.plugin.source.SourceJarMojo
[INFO] 
[INFO] --- maven-source-plugin:2.1.2:jar (attach-sources) @ apollo-website ---
[JENKINS] Archiving disabled - not archiving F:\hudson\hudson-slave\workspace\ActiveMQ-Apollo\trunk\apollo-website\pom.xml
Mar 30, 2012 7:20:14 PM hudson.maven.ExecutedMojo <init>
WARNING: Failed to getClass for org.fusesource.scalate.maven.SiteGenMojo
[INFO] 
[INFO] --- maven-scalate-plugin:1.5.3:sitegen (sitegen) @ apollo-website ---
Processing Configuration for child elements
Processing child [project]
Processing child [workingDirectory]
Processing child [webappDirectory]
Processing child [targetDirectory]
Processing child [testClassPathElements]
[INFO] Generating static website from Scalate Templates and wiki files...
[INFO] template properties: null
Using dir: F:\hudson\hudson-slave\workspace\ActiveMQ-Apollo\trunk\apollo-website\src\blog
at request path: /blog
[INFO]     processing F:\hudson\hudson-slave\workspace\ActiveMQ-Apollo\trunk\apollo-website\src\blog\index.page
with uri: /blog/index.page => 
Using dir: F:\hudson\hudson-slave\workspace\ActiveMQ-Apollo\trunk\apollo-website\src\blog
at request path: /blog
[INFO]     processing F:\hudson\hudson-slave\workspace\ActiveMQ-Apollo\trunk\apollo-website\src\blog\index.rss.feed
with uri: /blog/index.rss.feed => 
[INFO]     processing F:\hudson\hudson-slave\workspace\ActiveMQ-Apollo\trunk\apollo-website\src\blog\releases\release-1-0-beta1.page
with uri: /blog/releases/release-1-0-beta1.page => 
[INFO]     processing F:\hudson\hudson-slave\workspace\ActiveMQ-Apollo\trunk\apollo-website\src\blog\releases\release-1-0-beta2.page
with uri: /blog/releases/release-1-0-beta2.page => 
[INFO]     processing F:\hudson\hudson-slave\workspace\ActiveMQ-Apollo\trunk\apollo-website\src\blog\releases\release-1-0-beta3.page
with uri: /blog/releases/release-1-0-beta3.page => 
[INFO]     processing F:\hudson\hudson-slave\workspace\ActiveMQ-Apollo\trunk\apollo-website\src\blog\releases\release-1-0-beta4.page
with uri: /blog/releases/release-1-0-beta4.page => 
[INFO]     processing F:\hudson\hudson-slave\workspace\ActiveMQ-Apollo\trunk\apollo-website\src\blog\releases\release-1-0-beta5.page
with uri: /blog/releases/release-1-0-beta5.page => 
[INFO]     processing F:\hudson\hudson-slave\workspace\ActiveMQ-Apollo\trunk\apollo-website\src\blog\releases\release-1-0-beta6.page
with uri: /blog/releases/release-1-0-beta6.page => 
[INFO]     processing F:\hudson\hudson-slave\workspace\ActiveMQ-Apollo\trunk\apollo-website\src\blog\releases\release-1.0.page
with uri: /blog/releases/release-1.0.page => 
[INFO]     processing F:\hudson\hudson-slave\workspace\ActiveMQ-Apollo\trunk\apollo-website\src\blog\releases\release-1.1.page
with uri: /blog/releases/release-1.1.page => 
[INFO]     processing F:\hudson\hudson-slave\workspace\ActiveMQ-Apollo\trunk\apollo-website\src\community\building.page
with uri: /community/building.page => 
[INFO]     processing F:\hudson\hudson-slave\workspace\ActiveMQ-Apollo\trunk\apollo-website\src\community\contributing.page
with uri: /community/contributing.page => 
[INFO]     processing F:\hudson\hudson-slave\workspace\ActiveMQ-Apollo\trunk\apollo-website\src\community\developers.page
with uri: /community/developers.page => 
[INFO]     processing F:\hudson\hudson-slave\workspace\ActiveMQ-Apollo\trunk\apollo-website\src\community\faq.page
with uri: /community/faq.page => 
[INFO]     processing F:\hudson\hudson-slave\workspace\ActiveMQ-Apollo\trunk\apollo-website\src\community\index.page
with uri: /community/index.page => 
[INFO]     processing F:\hudson\hudson-slave\workspace\ActiveMQ-Apollo\trunk\apollo-website\src\community\release-guide.page
with uri: /community/release-guide.page => 
[INFO]     processing F:\hudson\hudson-slave\workspace\ActiveMQ-Apollo\trunk\apollo-website\src\community\site.page
with uri: /community/site.page => 
[INFO]     processing F:\hudson\hudson-slave\workspace\ActiveMQ-Apollo\trunk\apollo-website\src\community\source.page
with uri: /community/source.page => 
[INFO]     processing F:\hudson\hudson-slave\workspace\ActiveMQ-Apollo\trunk\apollo-website\src\community\support.page
with uri: /community/support.page => 
[INFO]     processing F:\hudson\hudson-slave\workspace\ActiveMQ-Apollo\trunk\apollo-website\src\documentation\architecture.md
with uri: /documentation/architecture.md => 
[INFO]     processing F:\hudson\hudson-slave\workspace\ActiveMQ-Apollo\trunk\apollo-website\src\documentation\extending-guide.md
with uri: /documentation/extending-guide.md => 
[INFO]     processing F:\hudson\hudson-slave\workspace\ActiveMQ-Apollo\trunk\apollo-website\src\documentation\getting-started.md
with uri: /documentation/getting-started.md => 
[INFO]     processing F:\hudson\hudson-slave\workspace\ActiveMQ-Apollo\trunk\apollo-website\src\documentation\index.page
with uri: /documentation/index.page => 
[INFO]     processing F:\hudson\hudson-slave\workspace\ActiveMQ-Apollo\trunk\apollo-website\src\documentation\management-api.md
with uri: /documentation/management-api.md => 
[INFO]     processing F:\hudson\hudson-slave\workspace\ActiveMQ-Apollo\trunk\apollo-website\src\documentation\migration-guide.md
with uri: /documentation/migration-guide.md => 
[INFO]     processing F:\hudson\hudson-slave\workspace\ActiveMQ-Apollo\trunk\apollo-website\src\documentation\module-organization.page
with uri: /documentation/module-organization.page => 
[INFO]     processing F:\hudson\hudson-slave\workspace\ActiveMQ-Apollo\trunk\apollo-website\src\documentation\performance-scaling.md
with uri: /documentation/performance-scaling.md => 
[INFO]     processing F:\hudson\hudson-slave\workspace\ActiveMQ-Apollo\trunk\apollo-website\src\documentation\user-manual.md
with uri: /documentation/user-manual.md => 
[INFO]     processing F:\hudson\hudson-slave\workspace\ActiveMQ-Apollo\trunk\apollo-website\src\documentation\verification.md
with uri: /documentation/verification.md => 
[INFO]     processing F:\hudson\hudson-slave\workspace\ActiveMQ-Apollo\trunk\apollo-website\src\download.page
with uri: /download.page => 
[INFO]     processing F:\hudson\hudson-slave\workspace\ActiveMQ-Apollo\trunk\apollo-website\src\index.page
with uri: /index.page => 
[INFO]     processing F:\hudson\hudson-slave\workspace\ActiveMQ-Apollo\trunk\apollo-website\src\privacy-policy.page
with uri: /privacy-policy.page => 
[INFO]     processing F:\hudson\hudson-slave\workspace\ActiveMQ-Apollo\trunk\apollo-website\src\versions\index.page
with uri: /versions/index.page => 
[INFO] 
[INFO] Installing F:\hudson\hudson-slave\workspace\ActiveMQ-Apollo\trunk\apollo-website\pom.xml
to f:\hudson\hudson-slave\maven-repositories\1\org\apache\activemq\apollo-website\99-trunk-SNAPSHOT\apollo-website-99-trunk-SNAPSHOT.pom
[INFO] --- maven-install-plugin:2.3.1:install (default-install) @ apollo-website ---
[JENKINS] Archiving disabled - not archiving F:\hudson\hudson-slave\workspace\ActiveMQ-Apollo\trunk\apollo-website\pom.xml
[INFO]                                                                         
[INFO] ------------------------------------------------------------------------
[INFO] Skipping apache-apollo
[INFO] This project has been banned from the build due to previous failures.
[INFO] ------------------------------------------------------------------------
[INFO] ------------------------------------------------------------------------
[INFO] Reactor Summary:
[INFO] 
[INFO] Apache ActiveMQ Apollo Project .................... SUCCESS [7.908s]
[INFO] apollo-boot ....................................... SUCCESS [2.243s]
[INFO] apollo-scala ...................................... SUCCESS [1.925s]
[INFO] apollo-util ....................................... SUCCESS [38.904s]
[INFO] apollo-dto ........................................ SUCCESS [6.268s]
[INFO] apollo-selector ................................... SUCCESS [4.183s]
[INFO] apollo-broker ..................................... SUCCESS [56.368s]
[INFO] apollo-web ........................................ FAILURE [3.492s]
[INFO] apollo-leveldb .................................... SKIPPED
[INFO] apollo-bdb ........................................ SKIPPED
[INFO] apollo-stomp ...................................... SKIPPED
[INFO] apollo-openwire-generator ......................... SUCCESS [10.658s]
[INFO] apollo-openwire ................................... SKIPPED
[INFO] apollo-cli ........................................ SKIPPED
[INFO] apollo-website .................................... SUCCESS [39.186s]
[INFO] apache-apollo ..................................... SKIPPED
[INFO] ------------------------------------------------------------------------
[INFO] BUILD FAILURE
[INFO] ------------------------------------------------------------------------
[INFO] Total time: 2:52.239s
[INFO] Finished at: Fri Mar 30 19:20:40 BST 2012
[INFO] Final Memory: 121M/1274M
[INFO] ------------------------------------------------------------------------
Waiting for Jenkins to finish collecting data
mavenExecutionResult exceptions not empty
message : Failed to execute goal on project apollo-web: Could not resolve dependencies for
project org.apache.activemq:apollo-web:jar:99-trunk-SNAPSHOT: Could not find artifact com.wordnik:swagger-jaxrs_2.9.1:jar:1.02-SNAPSHOT
in Nexus (http://repository.apache.org/snapshots)
cause : Could not resolve dependencies for project org.apache.activemq:apollo-web:jar:99-trunk-SNAPSHOT:
Could not find artifact com.wordnik:swagger-jaxrs_2.9.1:jar:1.02-SNAPSHOT in Nexus (http://repository.apache.org/snapshots)
Stack trace : 
org.apache.maven.lifecycle.LifecycleExecutionException: Failed to execute goal on project
apollo-web: Could not resolve dependencies for project org.apache.activemq:apollo-web:jar:99-trunk-SNAPSHOT:
Could not find artifact com.wordnik:swagger-jaxrs_2.9.1:jar:1.02-SNAPSHOT in Nexus (http://repository.apache.org/snapshots)
	at org.apache.maven.lifecycle.internal.LifecycleDependencyResolver.getDependencies(LifecycleDependencyResolver.java:190)
	at org.apache.maven.lifecycle.internal.LifecycleDependencyResolver.resolveProjectDependencies(LifecycleDependencyResolver.java:104)
	at org.apache.maven.lifecycle.internal.MojoExecutor.ensureDependenciesAreResolved(MojoExecutor.java:258)
	at org.apache.maven.lifecycle.internal.MojoExecutor.execute(MojoExecutor.java:201)
	at org.apache.maven.lifecycle.internal.MojoExecutor.execute(MojoExecutor.java:153)
	at org.apache.maven.lifecycle.internal.MojoExecutor.execute(MojoExecutor.java:145)
	at org.apache.maven.lifecycle.internal.LifecycleModuleBuilder.buildProject(LifecycleModuleBuilder.java:84)
	at org.apache.maven.lifecycle.internal.LifecycleModuleBuilder.buildProject(LifecycleModuleBuilder.java:59)
	at org.apache.maven.lifecycle.internal.LifecycleStarter.singleThreadedBuild(LifecycleStarter.java:183)
	at org.apache.maven.lifecycle.internal.LifecycleStarter.execute(LifecycleStarter.java:161)
	at org.apache.maven.DefaultMaven.doExecute(DefaultMaven.java:319)
	at org.apache.maven.DefaultMaven.execute(DefaultMaven.java:156)
	at org.jvnet.hudson.maven3.launcher.Maven3Launcher.main(Maven3Launcher.java:79)
	at sun.reflect.NativeMethodAccessorImpl.invoke0(Native Method)
	at sun.reflect.NativeMethodAccessorImpl.invoke(NativeMethodAccessorImpl.java:39)
	at sun.reflect.DelegatingMethodAccessorImpl.invoke(DelegatingMethodAccessorImpl.java:25)
	at java.lang.reflect.Method.invoke(Method.java:597)
	at org.codehaus.plexus.classworlds.launcher.Launcher.launchStandard(Launcher.java:329)
	at org.codehaus.plexus.classworlds.launcher.Launcher.launch(Launcher.java:239)
	at org.jvnet.hudson.maven3.agent.Maven3Main.launch(Maven3Main.java:158)
	at hudson.maven.Maven3Builder.call(Maven3Builder.java:104)
	at hudson.maven.Maven3Builder.call(Maven3Builder.java:70)
	at hudson.remoting.UserRequest.perform(UserRequest.java:118)
	at hudson.remoting.UserRequest.perform(UserRequest.java:48)
	at hudson.remoting.Request$2.run(Request.java:287)
	at hudson.remoting.InterceptingExecutorService$1.call(InterceptingExecutorService.java:72)
	at java.util.concurrent.FutureTask$Sync.innerRun(FutureTask.java:303)
	at java.util.concurrent.FutureTask.run(FutureTask.java:138)
	at java.util.concurrent.ThreadPoolExecutor$Worker.runTask(ThreadPoolExecutor.java:886)
	at java.util.concurrent.ThreadPoolExecutor$Worker.run(ThreadPoolExecutor.java:908)
	at java.lang.Thread.run(Thread.java:662)
Caused by: org.apache.maven.project.DependencyResolutionException: Could not resolve dependencies
for project org.apache.activemq:apollo-web:jar:99-trunk-SNAPSHOT: Could not find artifact
com.wordnik:swagger-jaxrs_2.9.1:jar:1.02-SNAPSHOT in Nexus (http://repository.apache.org/snapshots)
	at org.apache.maven.project.DefaultProjectDependenciesResolver.resolve(DefaultProjectDependenciesResolver.java:156)
	at org.apache.maven.lifecycle.internal.LifecycleDependencyResolver.getDependencies(LifecycleDependencyResolver.java:165)
	... 30 more
Caused by: org.sonatype.aether.resolution.ArtifactResolutionException: Could not find artifact
com.wordnik:swagger-jaxrs_2.9.1:jar:1.02-SNAPSHOT in Nexus (http://repository.apache.org/snapshots)
	at org.sonatype.aether.impl.internal.DefaultArtifactResolver.resolveArtifacts(DefaultArtifactResolver.java:526)
	at org.sonatype.aether.impl.internal.DefaultRepositorySystem.resolveArtifacts(DefaultRepositorySystem.java:304)
	at org.sonatype.aether.impl.internal.DefaultRepositorySystem.resolveDependencies(DefaultRepositorySystem.java:334)
	at org.apache.maven.project.DefaultProjectDependenciesResolver.resolve(DefaultProjectDependenciesResolver.java:150)
	... 31 more
Caused by: org.sonatype.aether.transfer.ArtifactNotFoundException: Could not find artifact
com.wordnik:swagger-jaxrs_2.9.1:jar:1.02-SNAPSHOT in Nexus (http://repository.apache.org/snapshots)
	at org.sonatype.aether.connector.wagon.WagonRepositoryConnector$4.wrap(WagonRepositoryConnector.java:945)
	at org.sonatype.aether.connector.wagon.WagonRepositoryConnector$4.wrap(WagonRepositoryConnector.java:940)
	at org.sonatype.aether.connector.wagon.WagonRepositoryConnector$GetTask.flush(WagonRepositoryConnector.java:696)
	at org.sonatype.aether.connector.wagon.WagonRepositoryConnector$GetTask.flush(WagonRepositoryConnector.java:690)
	at org.sonatype.aether.connector.wagon.WagonRepositoryConnector.get(WagonRepositoryConnector.java:435)
	at org.sonatype.aether.impl.internal.DefaultArtifactResolver.resolveArtifacts(DefaultArtifactResolver.java:438)
	... 34 more
channel stopped

Mime
View raw message