activemq-commits mailing list archives

Site index · List index
Message view « Date » · « Thread »
Top « Date » · « Thread »
From Apache Jenkins Server <jenk...@builds.apache.org>
Subject Build failed in Jenkins: ActiveMQ-Apollo #631
Date Wed, 29 Feb 2012 16:27:43 GMT
See <https://builds.apache.org/job/ActiveMQ-Apollo/631/>

------------------------------------------
[...truncated 2568 lines...]

[INFO] --- maven-scalate-plugin:1.5.3:sitegen (sitegen) @ apollo-website ---
Downloading: http://scala-tools.org/repo-releases/org/slf4j/slf4j-nop/1.6.1/slf4j-nop-1.6.1.pom
Downloading: http://download.java.net/maven/2/org/slf4j/slf4j-nop/1.6.1/slf4j-nop-1.6.1.pom
Downloading: http://repo1.maven.org/maven2/org/slf4j/slf4j-nop/1.6.1/slf4j-nop-1.6.1.pom
Downloaded: http://repo1.maven.org/maven2/org/slf4j/slf4j-nop/1.6.1/slf4j-nop-1.6.1.pom (2
KB at 3.9 KB/sec)
Downloading: http://repo.fusesource.com/nexus/content/groups/public/org/fusesource/mvnplugins/scala-mojo-support/1.16/scala-mojo-support-1.16.pom
Downloaded: http://repo.fusesource.com/nexus/content/groups/public/org/fusesource/mvnplugins/scala-mojo-support/1.16/scala-mojo-support-1.16.pom
(5 KB at 2.4 KB/sec)
Downloading: http://repo.fusesource.com/nexus/content/groups/public/org/fusesource/mvnplugins/mvnplugins/1.16/mvnplugins-1.16.pom
Downloaded: http://repo.fusesource.com/nexus/content/groups/public/org/fusesource/mvnplugins/mvnplugins/1.16/mvnplugins-1.16.pom
(9 KB at 6.9 KB/sec)
Downloading: http://repo.fusesource.com/nexus/content/groups/public/org/apache/maven/maven-plugin-tools-api/2.1/maven-plugin-tools-api-2.1.pom
Downloading: http://scala-tools.org/repo-releases/org/apache/maven/maven-plugin-tools-api/2.1/maven-plugin-tools-api-2.1.pom
Downloading: http://download.java.net/maven/2/org/apache/maven/maven-plugin-tools-api/2.1/maven-plugin-tools-api-2.1.pom
Downloading: http://repo1.maven.org/maven2/org/apache/maven/maven-plugin-tools-api/2.1/maven-plugin-tools-api-2.1.pom
Downloaded: http://repo1.maven.org/maven2/org/apache/maven/maven-plugin-tools-api/2.1/maven-plugin-tools-api-2.1.pom
(2 KB at 4.6 KB/sec)
Downloading: http://repo.fusesource.com/nexus/content/groups/public/org/apache/maven/maven-plugin-tools/2.1/maven-plugin-tools-2.1.pom
Downloading: http://scala-tools.org/repo-releases/org/apache/maven/maven-plugin-tools/2.1/maven-plugin-tools-2.1.pom
Downloading: http://download.java.net/maven/2/org/apache/maven/maven-plugin-tools/2.1/maven-plugin-tools-2.1.pom
Downloading: http://repo1.maven.org/maven2/org/apache/maven/maven-plugin-tools/2.1/maven-plugin-tools-2.1.pom
Downloaded: http://repo1.maven.org/maven2/org/apache/maven/maven-plugin-tools/2.1/maven-plugin-tools-2.1.pom
(4 KB at 10.3 KB/sec)
Downloading: http://repo.fusesource.com/nexus/content/groups/public/org/codehaus/swizzle/swizzle-confluence/1.4/swizzle-confluence-1.4.pom
Downloading: http://scala-tools.org/repo-releases/org/codehaus/swizzle/swizzle-confluence/1.4/swizzle-confluence-1.4.pom
Downloaded: http://scala-tools.org/repo-releases/org/codehaus/swizzle/swizzle-confluence/1.4/swizzle-confluence-1.4.pom
(2 KB at 2.7 KB/sec)
Downloading: http://repo.fusesource.com/nexus/content/groups/public/org/codehaus/swizzle/swizzle/1.4/swizzle-1.4.pom
Downloading: http://scala-tools.org/repo-releases/org/codehaus/swizzle/swizzle/1.4/swizzle-1.4.pom
Downloaded: http://scala-tools.org/repo-releases/org/codehaus/swizzle/swizzle/1.4/swizzle-1.4.pom
(4 KB at 8.1 KB/sec)
Downloading: http://repo.fusesource.com/nexus/content/groups/public/xmlrpc/xmlrpc-client/3.0/xmlrpc-client-3.0.pom
Downloading: http://scala-tools.org/repo-releases/xmlrpc/xmlrpc-client/3.0/xmlrpc-client-3.0.pom
Downloading: http://download.java.net/maven/2/xmlrpc/xmlrpc-client/3.0/xmlrpc-client-3.0.pom
Downloading: http://repo1.maven.org/maven2/xmlrpc/xmlrpc-client/3.0/xmlrpc-client-3.0.pom
Downloaded: http://repo1.maven.org/maven2/xmlrpc/xmlrpc-client/3.0/xmlrpc-client-3.0.pom (808
B at 2.1 KB/sec)
Downloading: http://repo.fusesource.com/nexus/content/groups/public/org/apache/xmlrpc/xmlrpc/3.0/xmlrpc-3.0.pom
Downloading: http://scala-tools.org/repo-releases/org/apache/xmlrpc/xmlrpc/3.0/xmlrpc-3.0.pom
Downloading: http://download.java.net/maven/2/org/apache/xmlrpc/xmlrpc/3.0/xmlrpc-3.0.pom
Downloading: http://repo1.maven.org/maven2/org/apache/xmlrpc/xmlrpc/3.0/xmlrpc-3.0.pom
Downloaded: http://repo1.maven.org/maven2/org/apache/xmlrpc/xmlrpc/3.0/xmlrpc-3.0.pom (12
KB at 33.9 KB/sec)
Downloading: http://repo.fusesource.com/nexus/content/groups/public/org/apache/xmlrpc/xmlrpc-common/3.0/xmlrpc-common-3.0.pom
Downloading: http://scala-tools.org/repo-releases/org/apache/xmlrpc/xmlrpc-common/3.0/xmlrpc-common-3.0.pom
Downloading: http://download.java.net/maven/2/org/apache/xmlrpc/xmlrpc-common/3.0/xmlrpc-common-3.0.pom
Downloading: http://repo1.maven.org/maven2/org/apache/xmlrpc/xmlrpc-common/3.0/xmlrpc-common-3.0.pom
Downloaded: http://repo1.maven.org/maven2/org/apache/xmlrpc/xmlrpc-common/3.0/xmlrpc-common-3.0.pom
(854 B at 2.5 KB/sec)
Downloading: http://repo.fusesource.com/nexus/content/groups/public/org/apache/ws/commons/ws-commons-util/1.0.1/ws-commons-util-1.0.1.pom
Downloading: http://scala-tools.org/repo-releases/org/apache/ws/commons/ws-commons-util/1.0.1/ws-commons-util-1.0.1.pom
Downloading: http://download.java.net/maven/2/org/apache/ws/commons/ws-commons-util/1.0.1/ws-commons-util-1.0.1.pom
Downloading: http://repo1.maven.org/maven2/org/apache/ws/commons/ws-commons-util/1.0.1/ws-commons-util-1.0.1.pom
Downloaded: http://repo1.maven.org/maven2/org/apache/ws/commons/ws-commons-util/1.0.1/ws-commons-util-1.0.1.pom
(6 KB at 16.2 KB/sec)
Downloading: http://repo.fusesource.com/nexus/content/groups/public/org/slf4j/slf4j-nop/1.6.1/slf4j-nop-1.6.1.jar
Downloading: http://repo.fusesource.com/nexus/content/groups/public/org/fusesource/mvnplugins/scala-mojo-support/1.16/scala-mojo-support-1.16.jar
Downloading: http://repo.fusesource.com/nexus/content/groups/public/org/apache/maven/maven-plugin-tools-api/2.1/maven-plugin-tools-api-2.1.jar
Downloading: http://repo.fusesource.com/nexus/content/groups/public/org/codehaus/swizzle/swizzle-confluence/1.4/swizzle-confluence-1.4.jar
Downloading: http://repo.fusesource.com/nexus/content/groups/public/xmlrpc/xmlrpc-client/3.0/xmlrpc-client-3.0.jar
Downloaded: http://repo.fusesource.com/nexus/content/groups/public/org/fusesource/mvnplugins/scala-mojo-support/1.16/scala-mojo-support-1.16.jar
(199 KB at 106.4 KB/sec)
Downloading: http://repo.fusesource.com/nexus/content/groups/public/org/apache/xmlrpc/xmlrpc-common/3.0/xmlrpc-common-3.0.jar
Downloading: http://repo.fusesource.com/nexus/content/groups/public/org/apache/ws/commons/ws-commons-util/1.0.1/ws-commons-util-1.0.1.jar
Downloading: http://scala-tools.org/repo-releases/org/slf4j/slf4j-nop/1.6.1/slf4j-nop-1.6.1.jar
Downloading: http://scala-tools.org/repo-releases/org/apache/maven/maven-plugin-tools-api/2.1/maven-plugin-tools-api-2.1.jar
Downloading: http://scala-tools.org/repo-releases/org/codehaus/swizzle/swizzle-confluence/1.4/swizzle-confluence-1.4.jar
Downloading: http://scala-tools.org/repo-releases/xmlrpc/xmlrpc-client/3.0/xmlrpc-client-3.0.jar
Downloading: http://scala-tools.org/repo-releases/org/apache/xmlrpc/xmlrpc-common/3.0/xmlrpc-common-3.0.jar
Downloading: http://scala-tools.org/repo-releases/org/apache/ws/commons/ws-commons-util/1.0.1/ws-commons-util-1.0.1.jar
Downloaded: http://scala-tools.org/repo-releases/org/codehaus/swizzle/swizzle-confluence/1.4/swizzle-confluence-1.4.jar
(29 KB at 55.2 KB/sec)
Downloading: http://download.java.net/maven/2/org/slf4j/slf4j-nop/1.6.1/slf4j-nop-1.6.1.jar
Downloading: http://download.java.net/maven/2/org/apache/maven/maven-plugin-tools-api/2.1/maven-plugin-tools-api-2.1.jar
Downloading: http://download.java.net/maven/2/xmlrpc/xmlrpc-client/3.0/xmlrpc-client-3.0.jar
Downloading: http://download.java.net/maven/2/org/apache/ws/commons/ws-commons-util/1.0.1/ws-commons-util-1.0.1.jar
Downloading: http://download.java.net/maven/2/org/apache/xmlrpc/xmlrpc-common/3.0/xmlrpc-common-3.0.jar
Downloading: http://repo1.maven.org/maven2/org/slf4j/slf4j-nop/1.6.1/slf4j-nop-1.6.1.jar
Downloading: http://repo1.maven.org/maven2/org/apache/maven/maven-plugin-tools-api/2.1/maven-plugin-tools-api-2.1.jar
Downloading: http://repo1.maven.org/maven2/xmlrpc/xmlrpc-client/3.0/xmlrpc-client-3.0.jar
Downloading: http://repo1.maven.org/maven2/org/apache/xmlrpc/xmlrpc-common/3.0/xmlrpc-common-3.0.jar
Downloading: http://repo1.maven.org/maven2/org/apache/ws/commons/ws-commons-util/1.0.1/ws-commons-util-1.0.1.jar
Downloaded: http://repo1.maven.org/maven2/org/apache/maven/maven-plugin-tools-api/2.1/maven-plugin-tools-api-2.1.jar
(29 KB at 20.2 KB/sec)
Downloaded: http://repo1.maven.org/maven2/org/apache/ws/commons/ws-commons-util/1.0.1/ws-commons-util-1.0.1.jar
(35 KB at 20.8 KB/sec)
Downloaded: http://repo1.maven.org/maven2/xmlrpc/xmlrpc-client/3.0/xmlrpc-client-3.0.jar (43
KB at 22.5 KB/sec)
Downloaded: http://repo1.maven.org/maven2/org/slf4j/slf4j-nop/1.6.1/slf4j-nop-1.6.1.jar (5
KB at 2.2 KB/sec)
Downloaded: http://repo1.maven.org/maven2/org/apache/xmlrpc/xmlrpc-common/3.0/xmlrpc-common-3.0.jar
(96 KB at 40.4 KB/sec)
Processing Configuration for child elements
Processing child [project]
Processing child [workingDirectory]
Processing child [webappDirectory]
Processing child [targetDirectory]
Processing child [testClassPathElements]
[INFO] Generating static website from Scalate Templates and wiki files...
[INFO] template properties: null
[INFO]     processing <https://builds.apache.org/job/ActiveMQ-Apollo/ws/trunk/apollo-website/src/documentation/architecture.md>
with uri: /documentation/architecture.md => 
[INFO]     processing <https://builds.apache.org/job/ActiveMQ-Apollo/ws/trunk/apollo-website/src/documentation/index.page>
with uri: /documentation/index.page => 
[INFO]     processing <https://builds.apache.org/job/ActiveMQ-Apollo/ws/trunk/apollo-website/src/documentation/module-organization.page>
with uri: /documentation/module-organization.page => 
[INFO]     processing <https://builds.apache.org/job/ActiveMQ-Apollo/ws/trunk/apollo-website/src/documentation/management-api.md>
with uri: /documentation/management-api.md => 
[INFO]     processing <https://builds.apache.org/job/ActiveMQ-Apollo/ws/trunk/apollo-website/src/documentation/extending-guide.md>
with uri: /documentation/extending-guide.md => 
[INFO]     processing <https://builds.apache.org/job/ActiveMQ-Apollo/ws/trunk/apollo-website/src/documentation/migration-guide.md>
with uri: /documentation/migration-guide.md => 
[INFO]     processing <https://builds.apache.org/job/ActiveMQ-Apollo/ws/trunk/apollo-website/src/documentation/performance-scaling.md>
with uri: /documentation/performance-scaling.md => 
[INFO]     processing <https://builds.apache.org/job/ActiveMQ-Apollo/ws/trunk/apollo-website/src/documentation/verification.md>
with uri: /documentation/verification.md => 
[INFO]     processing <https://builds.apache.org/job/ActiveMQ-Apollo/ws/trunk/apollo-website/src/documentation/user-manual.md>
with uri: /documentation/user-manual.md => 
[INFO]     processing <https://builds.apache.org/job/ActiveMQ-Apollo/ws/trunk/apollo-website/src/documentation/getting-started.md>
with uri: /documentation/getting-started.md => 
[INFO]     processing <https://builds.apache.org/job/ActiveMQ-Apollo/ws/trunk/apollo-website/src/index.page>
with uri: /index.page => 
[INFO]     processing <https://builds.apache.org/job/ActiveMQ-Apollo/ws/trunk/apollo-website/src/versions/index.page>
with uri: /versions/index.page => 
Using dir: <https://builds.apache.org/job/ActiveMQ-Apollo/ws/trunk/apollo-website/src/blog>
at request path: /blog
[INFO]     processing <https://builds.apache.org/job/ActiveMQ-Apollo/ws/trunk/apollo-website/src/blog/index.page>
with uri: /blog/index.page => 
[INFO]     processing <https://builds.apache.org/job/ActiveMQ-Apollo/ws/trunk/apollo-website/src/blog/releases/release-1.0.page>
with uri: /blog/releases/release-1.0.page => 
[INFO]     processing <https://builds.apache.org/job/ActiveMQ-Apollo/ws/trunk/apollo-website/src/blog/releases/release-1-0-beta5.page>
with uri: /blog/releases/release-1-0-beta5.page => 
[INFO]     processing <https://builds.apache.org/job/ActiveMQ-Apollo/ws/trunk/apollo-website/src/blog/releases/release-1-0-beta4.page>
with uri: /blog/releases/release-1-0-beta4.page => 
[INFO]     processing <https://builds.apache.org/job/ActiveMQ-Apollo/ws/trunk/apollo-website/src/blog/releases/release-1-0-beta1.page>
with uri: /blog/releases/release-1-0-beta1.page => 
[INFO]     processing <https://builds.apache.org/job/ActiveMQ-Apollo/ws/trunk/apollo-website/src/blog/releases/release-1.1.page>
with uri: /blog/releases/release-1.1.page => 
[INFO]     processing <https://builds.apache.org/job/ActiveMQ-Apollo/ws/trunk/apollo-website/src/blog/releases/release-1-0-beta3.page>
with uri: /blog/releases/release-1-0-beta3.page => 
[INFO]     processing <https://builds.apache.org/job/ActiveMQ-Apollo/ws/trunk/apollo-website/src/blog/releases/release-1-0-beta2.page>
with uri: /blog/releases/release-1-0-beta2.page => 
[INFO]     processing <https://builds.apache.org/job/ActiveMQ-Apollo/ws/trunk/apollo-website/src/blog/releases/release-1-0-beta6.page>
with uri: /blog/releases/release-1-0-beta6.page => 
Using dir: <https://builds.apache.org/job/ActiveMQ-Apollo/ws/trunk/apollo-website/src/blog>
at request path: /blog
[INFO]     processing <https://builds.apache.org/job/ActiveMQ-Apollo/ws/trunk/apollo-website/src/blog/index.rss.feed>
with uri: /blog/index.rss.feed => 
[INFO]     processing <https://builds.apache.org/job/ActiveMQ-Apollo/ws/trunk/apollo-website/src/download.page>
with uri: /download.page => 
[INFO]     processing <https://builds.apache.org/job/ActiveMQ-Apollo/ws/trunk/apollo-website/src/community/index.page>
with uri: /community/index.page => 
[INFO]     processing <https://builds.apache.org/job/ActiveMQ-Apollo/ws/trunk/apollo-website/src/community/release-guide.page>
with uri: /community/release-guide.page => 
[INFO]     processing <https://builds.apache.org/job/ActiveMQ-Apollo/ws/trunk/apollo-website/src/community/developers.page>
with uri: /community/developers.page => 
[INFO]     processing <https://builds.apache.org/job/ActiveMQ-Apollo/ws/trunk/apollo-website/src/community/contributing.page>
with uri: /community/contributing.page => 
[INFO]     processing <https://builds.apache.org/job/ActiveMQ-Apollo/ws/trunk/apollo-website/src/community/faq.page>
with uri: /community/faq.page => 
[INFO]     processing <https://builds.apache.org/job/ActiveMQ-Apollo/ws/trunk/apollo-website/src/community/source.page>
with uri: /community/source.page => 
[INFO]     processing <https://builds.apache.org/job/ActiveMQ-Apollo/ws/trunk/apollo-website/src/community/site.page>
with uri: /community/site.page => 
[INFO]     processing <https://builds.apache.org/job/ActiveMQ-Apollo/ws/trunk/apollo-website/src/community/support.page>
with uri: /community/support.page => 
[INFO]     processing <https://builds.apache.org/job/ActiveMQ-Apollo/ws/trunk/apollo-website/src/community/building.page>
with uri: /community/building.page => 
[INFO]     processing <https://builds.apache.org/job/ActiveMQ-Apollo/ws/trunk/apollo-website/src/privacy-policy.page>
with uri: /privacy-policy.page => 
[INFO] [INFO] Installing <https://builds.apache.org/job/ActiveMQ-Apollo/ws/trunk/apollo-website/pom.xml>
to /home/jenkins/jenkins-slave/maven-repositories/1/org/apache/activemq/apollo-website/1.1-SNAPSHOT/apollo-website-1.1-SNAPSHOT.pom

[INFO] --- maven-install-plugin:2.3.1:install (default-install) @ apollo-website ---
[JENKINS] Archiving disabled - not archiving <https://builds.apache.org/job/ActiveMQ-Apollo/ws/trunk/apollo-website/pom.xml>
[INFO]                                                                         
[INFO] ------------------------------------------------------------------------
[INFO] Skipping apache-apollo
[INFO] This project has been banned from the build due to previous failures.
[INFO] ------------------------------------------------------------------------
[INFO] ------------------------------------------------------------------------
[INFO] Reactor Summary:
[INFO] 
[INFO] Apache ActiveMQ Apollo Project .................... SUCCESS [33.208s]
[INFO] apollo-boot ....................................... SUCCESS [6.531s]
[INFO] apollo-scala ...................................... SUCCESS [1:12.696s]
[INFO] apollo-util ....................................... SUCCESS [7:53.073s]
[INFO] apollo-dto ........................................ SUCCESS [1:13.906s]
[INFO] apollo-selector ................................... SUCCESS [1:37.083s]
[INFO] apollo-broker ..................................... FAILURE [5:34.025s]
[INFO] apollo-web ........................................ SKIPPED
[INFO] apollo-leveldb .................................... SKIPPED
[INFO] apollo-bdb ........................................ SKIPPED
[INFO] apollo-stomp ...................................... SKIPPED
[INFO] apollo-openwire-generator ......................... SUCCESS [2:35.028s]
[INFO] apollo-openwire ................................... SKIPPED
[INFO] apollo-cli ........................................ SKIPPED
[INFO] apollo-website .................................... SUCCESS [14:51.628s]
[INFO] apache-apollo ..................................... SKIPPED
[INFO] ------------------------------------------------------------------------
[INFO] BUILD FAILURE
[INFO] ------------------------------------------------------------------------
[INFO] Total time: 35:44.007s
[INFO] Finished at: Wed Feb 29 16:27:41 UTC 2012
[INFO] Final Memory: 105M/1300M
[INFO] ------------------------------------------------------------------------
Waiting for Jenkins to finish collecting data
mavenExecutionResult exceptions not empty
message : Failed to execute goal on project apollo-broker: Could not resolve dependencies
for project org.apache.activemq:apollo-broker:jar:1.1-SNAPSHOT: Failed to collect dependencies
for [org.apache.activemq:apollo-dto:jar:1.1-SNAPSHOT (compile), org.apache.activemq:apollo-selector:jar:1.1-SNAPSHOT
(compile), org.fusesource.hawtdispatch:hawtdispatch-transport:jar:1.9 (compile), org.fusesource.hawtdispatch:hawtdispatch-scala:jar:1.9
(compile), org.apache.activemq:activemq-jaas:jar:5.4.1 (compile), org.jasypt:jasypt:jar:1.6
(compile), org.fusesource.hawtbuf:hawtbuf-proto:jar:1.9 (compile), org.yaml:snakeyaml:jar:1.7
(compile), org.eclipse.jetty.aggregate:jetty-all-server:jar:7.5.1.v20110908 (compile?), org.scala-lang:scala-library:jar:2.9.1
(compile), org.apache.activemq:apollo-util:jar:tests:1.1-SNAPSHOT (test), junit:junit:jar:4.7
(test), org.scalatest:scalatest_2.9.1:jar:1.6.1 (test), org.slf4j:slf4j-log4j12:jar:1.6.1
(test)]
cause : Could not resolve dependencies for project org.apache.activemq:apollo-broker:jar:1.1-SNAPSHOT:
Failed to collect dependencies for [org.apache.activemq:apollo-dto:jar:1.1-SNAPSHOT (compile),
org.apache.activemq:apollo-selector:jar:1.1-SNAPSHOT (compile), org.fusesource.hawtdispatch:hawtdispatch-transport:jar:1.9
(compile), org.fusesource.hawtdispatch:hawtdispatch-scala:jar:1.9 (compile), org.apache.activemq:activemq-jaas:jar:5.4.1
(compile), org.jasypt:jasypt:jar:1.6 (compile), org.fusesource.hawtbuf:hawtbuf-proto:jar:1.9
(compile), org.yaml:snakeyaml:jar:1.7 (compile), org.eclipse.jetty.aggregate:jetty-all-server:jar:7.5.1.v20110908
(compile?), org.scala-lang:scala-library:jar:2.9.1 (compile), org.apache.activemq:apollo-util:jar:tests:1.1-SNAPSHOT
(test), junit:junit:jar:4.7 (test), org.scalatest:scalatest_2.9.1:jar:1.6.1 (test), org.slf4j:slf4j-log4j12:jar:1.6.1
(test)]
Stack trace : 
org.apache.maven.lifecycle.LifecycleExecutionException: Failed to execute goal on project
apollo-broker: Could not resolve dependencies for project org.apache.activemq:apollo-broker:jar:1.1-SNAPSHOT:
Failed to collect dependencies for [org.apache.activemq:apollo-dto:jar:1.1-SNAPSHOT (compile),
org.apache.activemq:apollo-selector:jar:1.1-SNAPSHOT (compile), org.fusesource.hawtdispatch:hawtdispatch-transport:jar:1.9
(compile), org.fusesource.hawtdispatch:hawtdispatch-scala:jar:1.9 (compile), org.apache.activemq:activemq-jaas:jar:5.4.1
(compile), org.jasypt:jasypt:jar:1.6 (compile), org.fusesource.hawtbuf:hawtbuf-proto:jar:1.9
(compile), org.yaml:snakeyaml:jar:1.7 (compile), org.eclipse.jetty.aggregate:jetty-all-server:jar:7.5.1.v20110908
(compile?), org.scala-lang:scala-library:jar:2.9.1 (compile), org.apache.activemq:apollo-util:jar:tests:1.1-SNAPSHOT
(test), junit:junit:jar:4.7 (test), org.scalatest:scalatest_2.9.1:jar:1.6.1 (test), org.slf4j:slf4j-log4j12:jar:1.6.1
(test)]
	at org.apache.maven.lifecycle.internal.LifecycleDependencyResolver.getDependencies(LifecycleDependencyResolver.java:190)
	at org.apache.maven.lifecycle.internal.LifecycleDependencyResolver.resolveProjectDependencies(LifecycleDependencyResolver.java:104)
	at org.apache.maven.lifecycle.internal.MojoExecutor.ensureDependenciesAreResolved(MojoExecutor.java:258)
	at org.apache.maven.lifecycle.internal.MojoExecutor.execute(MojoExecutor.java:201)
	at org.apache.maven.lifecycle.internal.MojoExecutor.execute(MojoExecutor.java:153)
	at org.apache.maven.lifecycle.internal.MojoExecutor.execute(MojoExecutor.java:145)
	at org.apache.maven.lifecycle.internal.LifecycleModuleBuilder.buildProject(LifecycleModuleBuilder.java:84)
	at org.apache.maven.lifecycle.internal.LifecycleModuleBuilder.buildProject(LifecycleModuleBuilder.java:59)
	at org.apache.maven.lifecycle.internal.LifecycleStarter.singleThreadedBuild(LifecycleStarter.java:183)
	at org.apache.maven.lifecycle.internal.LifecycleStarter.execute(LifecycleStarter.java:161)
	at org.apache.maven.DefaultMaven.doExecute(DefaultMaven.java:319)
	at org.apache.maven.DefaultMaven.execute(DefaultMaven.java:156)
	at org.jvnet.hudson.maven3.launcher.Maven3Launcher.main(Maven3Launcher.java:79)
	at sun.reflect.NativeMethodAccessorImpl.invoke0(Native Method)
	at sun.reflect.NativeMethodAccessorImpl.invoke(NativeMethodAccessorImpl.java:39)
	at sun.reflect.DelegatingMethodAccessorImpl.invoke(DelegatingMethodAccessorImpl.java:25)
	at java.lang.reflect.Method.invoke(Method.java:597)
	at org.codehaus.plexus.classworlds.launcher.Launcher.launchStandard(Launcher.java:329)
	at org.codehaus.plexus.classworlds.launcher.Launcher.launch(Launcher.java:239)
	at org.jvnet.hudson.maven3.agent.Maven3Main.launch(Maven3Main.java:158)
	at hudson.maven.Maven3Builder.call(Maven3Builder.java:104)
	at hudson.maven.Maven3Builder.call(Maven3Builder.java:70)
	at hudson.remoting.UserRequest.perform(UserRequest.java:118)
	at hudson.remoting.UserRequest.perform(UserRequest.java:48)
	at hudson.remoting.Request$2.run(Request.java:287)
	at hudson.remoting.InterceptingExecutorService$1.call(InterceptingExecutorService.java:72)
	at java.util.concurrent.FutureTask$Sync.innerRun(FutureTask.java:303)
	at java.util.concurrent.FutureTask.run(FutureTask.java:138)
	at java.util.concurrent.ThreadPoolExecutor$Worker.runTask(ThreadPoolExecutor.java:886)
	at java.util.concurrent.ThreadPoolExecutor$Worker.run(ThreadPoolExecutor.java:908)
	at java.lang.Thread.run(Thread.java:662)
Caused by: org.apache.maven.project.DependencyResolutionException: Could not resolve dependencies
for project org.apache.activemq:apollo-broker:jar:1.1-SNAPSHOT: Failed to collect dependencies
for [org.apache.activemq:apollo-dto:jar:1.1-SNAPSHOT (compile), org.apache.activemq:apollo-selector:jar:1.1-SNAPSHOT
(compile), org.fusesource.hawtdispatch:hawtdispatch-transport:jar:1.9 (compile), org.fusesource.hawtdispatch:hawtdispatch-scala:jar:1.9
(compile), org.apache.activemq:activemq-jaas:jar:5.4.1 (compile), org.jasypt:jasypt:jar:1.6
(compile), org.fusesource.hawtbuf:hawtbuf-proto:jar:1.9 (compile), org.yaml:snakeyaml:jar:1.7
(compile), org.eclipse.jetty.aggregate:jetty-all-server:jar:7.5.1.v20110908 (compile?), org.scala-lang:scala-library:jar:2.9.1
(compile), org.apache.activemq:apollo-util:jar:tests:1.1-SNAPSHOT (test), junit:junit:jar:4.7
(test), org.scalatest:scalatest_2.9.1:jar:1.6.1 (test), org.slf4j:slf4j-log4j12:jar:1.6.1
(test)]
	at org.apache.maven.project.DefaultProjectDependenciesResolver.resolve(DefaultProjectDependenciesResolver.java:127)
	at org.apache.maven.lifecycle.internal.LifecycleDependencyResolver.getDependencies(LifecycleDependencyResolver.java:165)
	... 30 more
Caused by: org.sonatype.aether.collection.DependencyCollectionException: Failed to collect
dependencies for [org.apache.activemq:apollo-dto:jar:1.1-SNAPSHOT (compile), org.apache.activemq:apollo-selector:jar:1.1-SNAPSHOT
(compile), org.fusesource.hawtdispatch:hawtdispatch-transport:jar:1.9 (compile), org.fusesource.hawtdispatch:hawtdispatch-scala:jar:1.9
(compile), org.apache.activemq:activemq-jaas:jar:5.4.1 (compile), org.jasypt:jasypt:jar:1.6
(compile), org.fusesource.hawtbuf:hawtbuf-proto:jar:1.9 (compile), org.yaml:snakeyaml:jar:1.7
(compile), org.eclipse.jetty.aggregate:jetty-all-server:jar:7.5.1.v20110908 (compile?), org.scala-lang:scala-library:jar:2.9.1
(compile), org.apache.activemq:apollo-util:jar:tests:1.1-SNAPSHOT (test), junit:junit:jar:4.7
(test), org.scalatest:scalatest_2.9.1:jar:1.6.1 (test), org.slf4j:slf4j-log4j12:jar:1.6.1
(test)]
	at org.sonatype.aether.impl.internal.DefaultDependencyCollector.collectDependencies(DefaultDependencyCollector.java:251)
	at org.sonatype.aether.impl.internal.DefaultRepositorySystem.collectDependencies(DefaultRepositorySystem.java:318)
	at org.apache.maven.project.DefaultProjectDependenciesResolver.resolve(DefaultProjectDependenciesResolver.java:119)
	... 31 more
Caused by: org.sonatype.aether.resolution.ArtifactDescriptorException: Failed to read artifact
descriptor for org.apache.geronimo.specs:geronimo-jaspic_1.0_spec:jar:1.0
	at org.apache.maven.repository.internal.DefaultArtifactDescriptorReader.loadPom(DefaultArtifactDescriptorReader.java:283)
	at org.apache.maven.repository.internal.DefaultArtifactDescriptorReader.readArtifactDescriptor(DefaultArtifactDescriptorReader.java:173)
	at org.sonatype.aether.impl.internal.DefaultDependencyCollector.process(DefaultDependencyCollector.java:419)
	at org.sonatype.aether.impl.internal.DefaultDependencyCollector.process(DefaultDependencyCollector.java:515)
	at org.sonatype.aether.impl.internal.DefaultDependencyCollector.collectDependencies(DefaultDependencyCollector.java:233)
	... 33 more
Caused by: org.sonatype.aether.resolution.ArtifactResolutionException: Could not transfer
artifact org.apache.geronimo.specs:geronimo-jaspic_1.0_spec:pom:1.0 from/to glassfish-repo-archive
(http://maven.glassfish.org/content/groups/glassfish): Error transferring file: Connection
timed out
	at org.sonatype.aether.impl.internal.DefaultArtifactResolver.resolveArtifacts(DefaultArtifactResolver.java:526)
	at org.sonatype.aether.impl.internal.DefaultArtifactResolver.resolveArtifact(DefaultArtifactResolver.java:214)
	at org.apache.maven.repository.internal.DefaultArtifactDescriptorReader.loadPom(DefaultArtifactDescriptorReader.java:268)
	... 37 more
Caused by: org.sonatype.aether.transfer.ArtifactTransferException: Could not transfer artifact
org.apache.geronimo.specs:geronimo-jaspic_1.0_spec:pom:1.0 from/to glassfish-repo-archive
(http://maven.glassfish.org/content/groups/glassfish): Error transferring file: Connection
timed out
	at org.sonatype.aether.connector.wagon.WagonRepositoryConnector$4.wrap(WagonRepositoryConnector.java:949)
	at org.sonatype.aether.connector.wagon.WagonRepositoryConnector$4.wrap(WagonRepositoryConnector.java:940)
	at org.sonatype.aether.connector.wagon.WagonRepositoryConnector$GetTask.flush(WagonRepositoryConnector.java:696)
	at org.sonatype.aether.connector.wagon.WagonRepositoryConnector$GetTask.flush(WagonRepositoryConnector.java:690)
	at org.sonatype.aether.connector.wagon.WagonRepositoryConnector.get(WagonRepositoryConnector.java:435)
	at org.sonatype.aether.impl.internal.DefaultArtifactResolver.resolveArtifacts(DefaultArtifactResolver.java:438)
	... 39 more
Caused by: org.apache.maven.wagon.TransferFailedException: Error transferring file: Connection
timed out
	at org.apache.maven.wagon.providers.http.LightweightHttpWagon.fillInputData(LightweightHttpWagon.java:143)
	at org.apache.maven.wagon.StreamWagon.getInputStream(StreamWagon.java:116)
	at org.apache.maven.wagon.StreamWagon.getIfNewer(StreamWagon.java:88)
	at org.apache.maven.wagon.StreamWagon.get(StreamWagon.java:61)
	at org.sonatype.aether.connector.wagon.WagonRepositoryConnector$GetTask.run(WagonRepositoryConnector.java:605)
	... 3 more
Caused by: java.net.ConnectException: Connection timed out
	at java.net.PlainSocketImpl.socketConnect(Native Method)
	at java.net.PlainSocketImpl.doConnect(PlainSocketImpl.java:351)
	at java.net.PlainSocketImpl.connectToAddress(PlainSocketImpl.java:213)
	at java.net.PlainSocketImpl.connect(PlainSocketImpl.java:200)
	at java.net.SocksSocketImpl.connect(SocksSocketImpl.java:366)
	at java.net.Socket.connect(Socket.java:529)
	at java.net.Socket.connect(Socket.java:478)
	at sun.net.NetworkClient.doConnect(NetworkClient.java:163)
	at sun.net.www.http.HttpClient.openServer(HttpClient.java:395)
	at sun.net.www.http.HttpClient.openServer(HttpClient.java:530)
	at sun.net.www.http.HttpClient.<init>(HttpClient.java:234)
	at sun.net.www.http.HttpClient.New(HttpClient.java:307)
	at sun.net.www.http.HttpClient.New(HttpClient.java:324)
	at sun.net.www.protocol.http.HttpURLConnection.getNewHttpClient(HttpURLConnection.java:970)
	at sun.net.www.protocol.http.HttpURLConnection.plainConnect(HttpURLConnection.java:911)
	at sun.net.www.protocol.http.HttpURLConnection.connect(HttpURLConnection.java:836)
	at sun.net.www.protocol.http.HttpURLConnection.getInputStream(HttpURLConnection.java:1172)
	at java.net.HttpURLConnection.getResponseCode(HttpURLConnection.java:379)
	at org.apache.maven.wagon.providers.http.LightweightHttpWagon.fillInputData(LightweightHttpWagon.java:115)
	... 7 more
channel stopped


Mime
View raw message