activemq-commits mailing list archives

Site index · List index
Message view « Date » · « Thread »
Top « Date » · « Thread »
From Apache Jenkins Server <jenk...@builds.apache.org>
Subject Build failed in Jenkins: ActiveMQ-Apollo-Deploy #204
Date Mon, 30 Jan 2012 03:15:52 GMT
See <https://builds.apache.org/job/ActiveMQ-Apollo-Deploy/204/changes>

Changes:

[chirino] Use nicer variable names.

[chirino] Avoid doing reflection every time the openwire format version is changed. (Occurs
every time a message encoded to the message store.).

[chirino] Allow openwire messages to get persisted.

[chirino] Adding missing lic. headers.

[chirino] Fixes APLO-139 : Simplify the JSON encoding of the @class field.

Since the JSON schema changes a bit, the store store schema also needed to be incremented.
 Renamed the JaxbModule and related classes/resource files to DtoModule stuff since the DTO
objects are not necessarily tied down to Jaxb.

[chirino] Fixes APLO-144 : Display a warning about the Openwire protocol still being experimental
when it's first used.

[chirino] Fixes APLO-141 : The connection screen displays 'transport: tcp' even though the
connection came in over the tls port.

renamed the 'transport' field to 'connector' and now it's set to the id of the connector which
created the connection.
Alos added a connection status HTML page for openwire and also provide the protocol session
id in the connection status screens.

[chirino] Fixes APLO-142 : Java doc clean up for org.apache.activemq.apollo.dto

Contributed by Jason Sherman.  Thanks!

[chirino] Fixes APLO-143 : Startup banner displays incorrectly if using a terminal with a
white background color scheme.

------------------------------------------
[...truncated 5447 lines...]
Downloading: http://scala-tools.org/repo-releases/nekohtml/nekohtml/1.9.6.2/nekohtml-1.9.6.2.jar
Downloading: http://scala-tools.org/repo-releases/commons-logging/commons-logging/1.1.1/commons-logging-1.1.1.jar
Downloading: http://scala-tools.org/repo-releases/org/codehaus/plexus/plexus-utils/2.0.2/plexus-utils-2.0.2.jar
Downloading: http://scala-tools.org/repo-releases/org/codehaus/swizzle/swizzle-confluence/1.4/swizzle-confluence-1.4.jar
Downloading: http://scala-tools.org/repo-releases/xmlrpc/xmlrpc-client/3.0/xmlrpc-client-3.0.jar
Downloading: http://scala-tools.org/repo-releases/org/apache/xmlrpc/xmlrpc-common/3.0/xmlrpc-common-3.0.jar
Downloading: http://scala-tools.org/repo-releases/org/apache/ws/commons/ws-commons-util/1.0.1/ws-commons-util-1.0.1.jar
Downloading: http://download.java.net/maven/2/org/slf4j/slf4j-nop/1.6.1/slf4j-nop-1.6.1.jar
Downloading: http://download.java.net/maven/2/org/slf4j/slf4j-api/1.6.1/slf4j-api-1.6.1.jar
Downloading: http://download.java.net/maven/2/org/fusesource/mvnplugins/scala-mojo-support/1.16/scala-mojo-support-1.16.jar
Downloading: http://download.java.net/maven/2/org/apache/maven/maven-plugin-tools-api/2.1/maven-plugin-tools-api-2.1.jar
Downloading: http://download.java.net/maven/2/junit/junit/4.8.2/junit-4.8.2.jar
Downloading: http://download.java.net/maven/2/jline/jline/0.9.94/jline-0.9.94.jar
Downloading: http://download.java.net/maven/2/commons-lang/commons-lang/2.6/commons-lang-2.6.jar
Downloading: http://download.java.net/maven/2/org/apache/maven/wagon/wagon-file/1.0-beta-7/wagon-file-1.0-beta-7.jar
Downloading: http://download.java.net/maven/2/org/apache/maven/wagon/wagon-ssh/1.0-beta-7/wagon-ssh-1.0-beta-7.jar
Downloading: http://download.java.net/maven/2/com/jcraft/jsch/0.1.38/jsch-0.1.38.jar
Downloading: http://download.java.net/maven/2/org/apache/maven/wagon/wagon-ssh-common/1.0-beta-7/wagon-ssh-common-1.0-beta-7.jar
Downloading: http://download.java.net/maven/2/org/codehaus/plexus/plexus-interactivity-api/1.0-alpha-6/plexus-interactivity-api-1.0-alpha-6.jar
Downloading: http://download.java.net/maven/2/org/apache/maven/wagon/wagon-http-lightweight/1.0-beta-7/wagon-http-lightweight-1.0-beta-7.jar
Downloading: http://download.java.net/maven/2/org/apache/maven/wagon/wagon-http-shared/1.0-beta-7/wagon-http-shared-1.0-beta-7.jar
Downloading: http://download.java.net/maven/2/nekohtml/xercesMinimal/1.9.6.2/xercesMinimal-1.9.6.2.jar
Downloading: http://download.java.net/maven/2/nekohtml/nekohtml/1.9.6.2/nekohtml-1.9.6.2.jar
Downloading: http://download.java.net/maven/2/commons-logging/commons-logging/1.1.1/commons-logging-1.1.1.jar
Downloading: http://download.java.net/maven/2/org/codehaus/plexus/plexus-utils/2.0.2/plexus-utils-2.0.2.jar
Downloading: http://download.java.net/maven/2/org/codehaus/swizzle/swizzle-confluence/1.4/swizzle-confluence-1.4.jar
Downloading: http://download.java.net/maven/2/xmlrpc/xmlrpc-client/3.0/xmlrpc-client-3.0.jar
Downloading: http://download.java.net/maven/2/org/apache/xmlrpc/xmlrpc-common/3.0/xmlrpc-common-3.0.jar
Downloading: http://download.java.net/maven/2/org/apache/ws/commons/ws-commons-util/1.0.1/ws-commons-util-1.0.1.jar
Downloading: http://repo1.maven.org/maven2/org/slf4j/slf4j-nop/1.6.1/slf4j-nop-1.6.1.jar
Downloading: http://repo1.maven.org/maven2/org/slf4j/slf4j-api/1.6.1/slf4j-api-1.6.1.jar
Downloading: http://repo1.maven.org/maven2/org/fusesource/mvnplugins/scala-mojo-support/1.16/scala-mojo-support-1.16.jar
Downloading: http://repo1.maven.org/maven2/org/apache/maven/maven-plugin-tools-api/2.1/maven-plugin-tools-api-2.1.jar
Downloading: http://repo1.maven.org/maven2/junit/junit/4.8.2/junit-4.8.2.jar
Downloaded: http://repo1.maven.org/maven2/org/slf4j/slf4j-api/1.6.1/slf4j-api-1.6.1.jar (0
B at 0.0 KB/sec)
Downloading: http://repo1.maven.org/maven2/jline/jline/0.9.94/jline-0.9.94.jar
Downloaded: http://repo1.maven.org/maven2/junit/junit/4.8.2/junit-4.8.2.jar (0 B at 0.0 KB/sec)
Downloading: http://repo1.maven.org/maven2/commons-lang/commons-lang/2.6/commons-lang-2.6.jar
Downloaded: http://repo1.maven.org/maven2/org/slf4j/slf4j-nop/1.6.1/slf4j-nop-1.6.1.jar (5
KB at 3.6 KB/sec)
Downloading: http://repo1.maven.org/maven2/org/apache/maven/wagon/wagon-file/1.0-beta-7/wagon-file-1.0-beta-7.jar
Downloaded: http://repo1.maven.org/maven2/org/fusesource/mvnplugins/scala-mojo-support/1.16/scala-mojo-support-1.16.jar
(199 KB at 96.8 KB/sec)
Downloading: http://repo1.maven.org/maven2/org/apache/maven/wagon/wagon-ssh/1.0-beta-7/wagon-ssh-1.0-beta-7.jar
Downloaded: http://repo1.maven.org/maven2/org/apache/maven/maven-plugin-tools-api/2.1/maven-plugin-tools-api-2.1.jar
(29 KB at 12.2 KB/sec)
Downloading: http://repo1.maven.org/maven2/com/jcraft/jsch/0.1.38/jsch-0.1.38.jar
Downloaded: http://repo1.maven.org/maven2/jline/jline/0.9.94/jline-0.9.94.jar (86 KB at 33.6
KB/sec)
Downloading: http://repo1.maven.org/maven2/org/apache/maven/wagon/wagon-ssh-common/1.0-beta-7/wagon-ssh-common-1.0-beta-7.jar
Downloaded: http://repo1.maven.org/maven2/commons-lang/commons-lang/2.6/commons-lang-2.6.jar
(278 KB at 111.0 KB/sec)
Downloading: http://repo1.maven.org/maven2/org/codehaus/plexus/plexus-interactivity-api/1.0-alpha-6/plexus-interactivity-api-1.0-alpha-6.jar
Downloaded: http://repo1.maven.org/maven2/org/apache/maven/wagon/wagon-file/1.0-beta-7/wagon-file-1.0-beta-7.jar
(11 KB at 4.3 KB/sec)
Downloading: http://repo1.maven.org/maven2/org/apache/maven/wagon/wagon-http-lightweight/1.0-beta-7/wagon-http-lightweight-1.0-beta-7.jar
Downloaded: http://repo1.maven.org/maven2/org/apache/maven/wagon/wagon-ssh/1.0-beta-7/wagon-ssh-1.0-beta-7.jar
(28 KB at 12.3 KB/sec)
Downloading: http://repo1.maven.org/maven2/org/apache/maven/wagon/wagon-http-shared/1.0-beta-7/wagon-http-shared-1.0-beta-7.jar
Downloaded: http://repo1.maven.org/maven2/com/jcraft/jsch/0.1.38/jsch-0.1.38.jar (174 KB at
63.1 KB/sec)
Downloading: http://repo1.maven.org/maven2/nekohtml/xercesMinimal/1.9.6.2/xercesMinimal-1.9.6.2.jar
Downloaded: http://repo1.maven.org/maven2/org/apache/maven/wagon/wagon-ssh-common/1.0-beta-7/wagon-ssh-common-1.0-beta-7.jar
(27 KB at 10.6 KB/sec)
Downloading: http://repo1.maven.org/maven2/nekohtml/nekohtml/1.9.6.2/nekohtml-1.9.6.2.jar
Downloaded: http://repo1.maven.org/maven2/org/codehaus/plexus/plexus-interactivity-api/1.0-alpha-6/plexus-interactivity-api-1.0-alpha-6.jar
(12 KB at 4.6 KB/sec)
Downloading: http://repo1.maven.org/maven2/commons-logging/commons-logging/1.1.1/commons-logging-1.1.1.jar
Downloaded: http://repo1.maven.org/maven2/org/apache/maven/wagon/wagon-http-lightweight/1.0-beta-7/wagon-http-lightweight-1.0-beta-7.jar
(15 KB at 6.5 KB/sec)
Downloading: http://repo1.maven.org/maven2/org/codehaus/plexus/plexus-utils/2.0.2/plexus-utils-2.0.2.jar
Downloaded: http://repo1.maven.org/maven2/org/apache/maven/wagon/wagon-http-shared/1.0-beta-7/wagon-http-shared-1.0-beta-7.jar
(25 KB at 10.0 KB/sec)
Downloading: http://repo1.maven.org/maven2/org/codehaus/swizzle/swizzle-confluence/1.4/swizzle-confluence-1.4.jar
Downloaded: http://repo1.maven.org/maven2/nekohtml/xercesMinimal/1.9.6.2/xercesMinimal-1.9.6.2.jar
(39 KB at 15.5 KB/sec)
Downloading: http://repo1.maven.org/maven2/xmlrpc/xmlrpc-client/3.0/xmlrpc-client-3.0.jar
Downloaded: http://repo1.maven.org/maven2/nekohtml/nekohtml/1.9.6.2/nekohtml-1.9.6.2.jar (110
KB at 39.7 KB/sec)
Downloading: http://repo1.maven.org/maven2/org/apache/xmlrpc/xmlrpc-common/3.0/xmlrpc-common-3.0.jar
Downloaded: http://repo1.maven.org/maven2/commons-logging/commons-logging/1.1.1/commons-logging-1.1.1.jar
(60 KB at 23.8 KB/sec)
Downloading: http://repo1.maven.org/maven2/org/apache/ws/commons/ws-commons-util/1.0.1/ws-commons-util-1.0.1.jar
Downloaded: http://repo1.maven.org/maven2/org/codehaus/plexus/plexus-utils/2.0.2/plexus-utils-2.0.2.jar
(218 KB at 79.1 KB/sec)
Downloaded: http://repo1.maven.org/maven2/org/codehaus/swizzle/swizzle-confluence/1.4/swizzle-confluence-1.4.jar
(29 KB at 12.7 KB/sec)
Downloaded: http://repo1.maven.org/maven2/xmlrpc/xmlrpc-client/3.0/xmlrpc-client-3.0.jar (43
KB at 18.8 KB/sec)
Downloaded: http://repo1.maven.org/maven2/org/apache/xmlrpc/xmlrpc-common/3.0/xmlrpc-common-3.0.jar
(96 KB at 47.9 KB/sec)
Downloaded: http://repo1.maven.org/maven2/org/apache/ws/commons/ws-commons-util/1.0.1/ws-commons-util-1.0.1.jar
(35 KB at 17.0 KB/sec)
Processing Configuration for child elements
Processing child [project]
Processing child [workingDirectory]
Processing child [webappDirectory]
Processing child [targetDirectory]
Processing child [testClassPathElements]
[INFO] Generating static website from Scalate Templates and wiki files...
[INFO] template properties: null
Using dir: <https://builds.apache.org/job/ActiveMQ-Apollo-Deploy/ws/trunk/apollo-website/src/blog>
at request path: /blog
[INFO]     processing <https://builds.apache.org/job/ActiveMQ-Apollo-Deploy/ws/trunk/apollo-website/src/blog/index.page>
with uri: /blog/index.page => 
[INFO]     processing <https://builds.apache.org/job/ActiveMQ-Apollo-Deploy/ws/trunk/apollo-website/src/blog/releases/release-1-0-beta4.page>
with uri: /blog/releases/release-1-0-beta4.page => 
[INFO]     processing <https://builds.apache.org/job/ActiveMQ-Apollo-Deploy/ws/trunk/apollo-website/src/blog/releases/release-1-0-beta2.page>
with uri: /blog/releases/release-1-0-beta2.page => 
[INFO]     processing <https://builds.apache.org/job/ActiveMQ-Apollo-Deploy/ws/trunk/apollo-website/src/blog/releases/release-1-0-beta6.page>
with uri: /blog/releases/release-1-0-beta6.page => 
[INFO]     processing <https://builds.apache.org/job/ActiveMQ-Apollo-Deploy/ws/trunk/apollo-website/src/blog/releases/release-1-0-beta3.page>
with uri: /blog/releases/release-1-0-beta3.page => 
[INFO]     processing <https://builds.apache.org/job/ActiveMQ-Apollo-Deploy/ws/trunk/apollo-website/src/blog/releases/release-1-0-beta1.page>
with uri: /blog/releases/release-1-0-beta1.page => 
[INFO]     processing <https://builds.apache.org/job/ActiveMQ-Apollo-Deploy/ws/trunk/apollo-website/src/blog/releases/release-1-0-beta5.page>
with uri: /blog/releases/release-1-0-beta5.page => 
[INFO]     processing <https://builds.apache.org/job/ActiveMQ-Apollo-Deploy/ws/trunk/apollo-website/src/blog/releases/release-1.0.page>
with uri: /blog/releases/release-1.0.page => 
Using dir: <https://builds.apache.org/job/ActiveMQ-Apollo-Deploy/ws/trunk/apollo-website/src/blog>
at request path: /blog
[INFO]     processing <https://builds.apache.org/job/ActiveMQ-Apollo-Deploy/ws/trunk/apollo-website/src/blog/index.rss.feed>
with uri: /blog/index.rss.feed => 
[INFO]     processing <https://builds.apache.org/job/ActiveMQ-Apollo-Deploy/ws/trunk/apollo-website/src/index.page>
with uri: /index.page => 
[INFO]     processing <https://builds.apache.org/job/ActiveMQ-Apollo-Deploy/ws/trunk/apollo-website/src/versions/index.page>
with uri: /versions/index.page => 
[INFO]     processing <https://builds.apache.org/job/ActiveMQ-Apollo-Deploy/ws/trunk/apollo-website/src/documentation/verification.md>
with uri: /documentation/verification.md => 
[INFO]     processing <https://builds.apache.org/job/ActiveMQ-Apollo-Deploy/ws/trunk/apollo-website/src/documentation/index.page>
with uri: /documentation/index.page => 
[INFO]     processing <https://builds.apache.org/job/ActiveMQ-Apollo-Deploy/ws/trunk/apollo-website/src/documentation/module-organization.page>
with uri: /documentation/module-organization.page => 
[INFO]     processing <https://builds.apache.org/job/ActiveMQ-Apollo-Deploy/ws/trunk/apollo-website/src/documentation/extending-guide.md>
with uri: /documentation/extending-guide.md => 
[INFO]     processing <https://builds.apache.org/job/ActiveMQ-Apollo-Deploy/ws/trunk/apollo-website/src/documentation/performance-scaling.md>
with uri: /documentation/performance-scaling.md => 
[INFO]     processing <https://builds.apache.org/job/ActiveMQ-Apollo-Deploy/ws/trunk/apollo-website/src/documentation/getting-started.md>
with uri: /documentation/getting-started.md => 
[INFO]     processing <https://builds.apache.org/job/ActiveMQ-Apollo-Deploy/ws/trunk/apollo-website/src/documentation/user-manual.md>
with uri: /documentation/user-manual.md => 
[INFO]     processing <https://builds.apache.org/job/ActiveMQ-Apollo-Deploy/ws/trunk/apollo-website/src/documentation/architecture.md>
with uri: /documentation/architecture.md => 
[INFO]     processing <https://builds.apache.org/job/ActiveMQ-Apollo-Deploy/ws/trunk/apollo-website/src/documentation/management-api.md>
with uri: /documentation/management-api.md => 
[INFO]     processing <https://builds.apache.org/job/ActiveMQ-Apollo-Deploy/ws/trunk/apollo-website/src/download.page>
with uri: /download.page => 
[INFO]     processing <https://builds.apache.org/job/ActiveMQ-Apollo-Deploy/ws/trunk/apollo-website/src/community/release-guide.page>
with uri: /community/release-guide.page => 
[INFO]     processing <https://builds.apache.org/job/ActiveMQ-Apollo-Deploy/ws/trunk/apollo-website/src/community/index.page>
with uri: /community/index.page => 
[INFO]     processing <https://builds.apache.org/job/ActiveMQ-Apollo-Deploy/ws/trunk/apollo-website/src/community/faq.page>
with uri: /community/faq.page => 
[INFO]     processing <https://builds.apache.org/job/ActiveMQ-Apollo-Deploy/ws/trunk/apollo-website/src/community/building.page>
with uri: /community/building.page => 
[INFO]     processing <https://builds.apache.org/job/ActiveMQ-Apollo-Deploy/ws/trunk/apollo-website/src/community/site.page>
with uri: /community/site.page => 
[INFO]     processing <https://builds.apache.org/job/ActiveMQ-Apollo-Deploy/ws/trunk/apollo-website/src/community/contributing.page>
with uri: /community/contributing.page => 
[INFO]     processing <https://builds.apache.org/job/ActiveMQ-Apollo-Deploy/ws/trunk/apollo-website/src/community/source.page>
with uri: /community/source.page => 
[INFO]     processing <https://builds.apache.org/job/ActiveMQ-Apollo-Deploy/ws/trunk/apollo-website/src/community/support.page>
with uri: /community/support.page => 
[INFO]     processing <https://builds.apache.org/job/ActiveMQ-Apollo-Deploy/ws/trunk/apollo-website/src/community/developers.page>
with uri: /community/developers.page => 
[INFO]     processing <https://builds.apache.org/job/ActiveMQ-Apollo-Deploy/ws/trunk/apollo-website/src/privacy-policy.page>
with uri: /privacy-policy.page => 
[INFO] [INFO] Installing <https://builds.apache.org/job/ActiveMQ-Apollo-Deploy/ws/trunk/apollo-website/pom.xml>
to <https://builds.apache.org/job/ActiveMQ-Apollo-Deploy/ws/.repository/org/apache/activemq/apollo-website/1.1-SNAPSHOT/apollo-website-1.1-SNAPSHOT.pom>

[INFO] --- maven-install-plugin:2.3.1:install (default-install) @ apollo-website ---
[INFO] Downloading: https://repository.apache.org/content/repositories/snapshots/org/apache/activemq/apollo-website/1.1-SNAPSHOT/maven-metadata.xml

[INFO] --- maven-deploy-plugin:2.5:deploy (default-deploy) @ apollo-website ---
Downloaded: https://repository.apache.org/content/repositories/snapshots/org/apache/activemq/apollo-website/1.1-SNAPSHOT/maven-metadata.xml
(606 B at 1.3 KB/sec)
Uploading: https://repository.apache.org/content/repositories/snapshots/org/apache/activemq/apollo-website/1.1-SNAPSHOT/apollo-website-1.1-20120130.031549-6.pom
Uploaded: https://repository.apache.org/content/repositories/snapshots/org/apache/activemq/apollo-website/1.1-SNAPSHOT/apollo-website-1.1-20120130.031549-6.pom
(13 KB at 163.8 KB/sec)
Downloading: https://repository.apache.org/content/repositories/snapshots/org/apache/activemq/apollo-website/maven-metadata.xml
Downloaded: https://repository.apache.org/content/repositories/snapshots/org/apache/activemq/apollo-website/maven-metadata.xml
(329 B at 5.8 KB/sec)
Uploading: https://repository.apache.org/content/repositories/snapshots/org/apache/activemq/apollo-website/1.1-SNAPSHOT/maven-metadata.xml
Uploaded: https://repository.apache.org/content/repositories/snapshots/org/apache/activemq/apollo-website/1.1-SNAPSHOT/maven-metadata.xml
(606 B at 5.9 KB/sec)
Uploading: https://repository.apache.org/content/repositories/snapshots/org/apache/activemq/apollo-website/maven-metadata.xml
Uploaded: https://repository.apache.org/content/repositories/snapshots/org/apache/activemq/apollo-website/maven-metadata.xml
(329 B at 1.2 KB/sec)
[JENKINS] Archiving disabled - not archiving <https://builds.apache.org/job/ActiveMQ-Apollo-Deploy/ws/trunk/apollo-website/pom.xml>
[INFO]                                                                         
[INFO] ------------------------------------------------------------------------
[INFO] Skipping apache-apollo
[INFO] This project has been banned from the build due to previous failures.
[INFO] ------------------------------------------------------------------------
[INFO] ------------------------------------------------------------------------
[INFO] Reactor Summary:
[INFO] 
[INFO] Apache ActiveMQ Apollo Project .................... SUCCESS [4:22.289s]
[INFO] apollo-boot ....................................... SUCCESS [26.020s]
[INFO] apollo-scala ...................................... SUCCESS [49.670s]
[INFO] apollo-util ....................................... SUCCESS [1:06.973s]
[INFO] apollo-dto ........................................ SUCCESS [32.596s]
[INFO] apollo-selector ................................... SUCCESS [49.460s]
[INFO] apollo-broker ..................................... SUCCESS [57.417s]
[INFO] apollo-web ........................................ FAILURE [37.293s]
[INFO] apollo-leveldb .................................... SKIPPED
[INFO] apollo-bdb ........................................ SKIPPED
[INFO] apollo-stomp ...................................... SKIPPED
[INFO] apollo-openwire-generator ......................... SUCCESS [16.521s]
[INFO] apollo-openwire ................................... SKIPPED
[INFO] apollo-cli ........................................ SKIPPED
[INFO] apollo-website .................................... SUCCESS [1:28.472s]
[INFO] apache-apollo ..................................... SKIPPED
[INFO] ------------------------------------------------------------------------
[INFO] BUILD FAILURE
[INFO] ------------------------------------------------------------------------
[INFO] Total time: 11:28.591s
[INFO] Finished at: Mon Jan 30 03:15:50 UTC 2012
[INFO] Final Memory: 120M/1000M
[INFO] ------------------------------------------------------------------------
Waiting for Jenkins to finish collecting data
mavenExecutionResult exceptions not empty
message : Failed to execute goal on project apollo-web: Could not resolve dependencies for
project org.apache.activemq:apollo-web:jar:1.1-SNAPSHOT: Failed to collect dependencies for
[org.apache.activemq:apollo-broker:jar:1.1-SNAPSHOT (compile), org.fusesource.scalate:scalate-core:jar:1.5.3
(compile), com.sun.jersey:jersey-server:jar:1.5 (compile), javax.servlet:servlet-api:jar:2.5
(provided), org.codehaus.jackson:jackson-jaxrs:jar:1.7.5 (compile), org.codehaus.jackson:jackson-xc:jar:1.7.5
(compile), org.eclipse.jetty.aggregate:jetty-all-server:jar:7.1.6.v20100715 (compile?), net.sf.josql:josql:jar:1.5
(compile), net.sf.josql:gentlyweb-utils:jar:1.5 (compile), org.scala-lang:scala-library:jar:2.9.1
(compile), org.fusesource.scalate:scalate-test:jar:1.5.3 (test), org.apache.activemq:apollo-util:jar:tests:1.1-SNAPSHOT
(test), commons-codec:commons-codec:jar:1.4 (compile?), junit:junit:jar:4.7 (test), org.scalatest:scalatest_2.9.1:jar:1.6.1
(test), org.slf4j:slf4j-log4j12:jar:1.6.1 (test)]
cause : Could not resolve dependencies for project org.apache.activemq:apollo-web:jar:1.1-SNAPSHOT:
Failed to collect dependencies for [org.apache.activemq:apollo-broker:jar:1.1-SNAPSHOT (compile),
org.fusesource.scalate:scalate-core:jar:1.5.3 (compile), com.sun.jersey:jersey-server:jar:1.5
(compile), javax.servlet:servlet-api:jar:2.5 (provided), org.codehaus.jackson:jackson-jaxrs:jar:1.7.5
(compile), org.codehaus.jackson:jackson-xc:jar:1.7.5 (compile), org.eclipse.jetty.aggregate:jetty-all-server:jar:7.1.6.v20100715
(compile?), net.sf.josql:josql:jar:1.5 (compile), net.sf.josql:gentlyweb-utils:jar:1.5 (compile),
org.scala-lang:scala-library:jar:2.9.1 (compile), org.fusesource.scalate:scalate-test:jar:1.5.3
(test), org.apache.activemq:apollo-util:jar:tests:1.1-SNAPSHOT (test), commons-codec:commons-codec:jar:1.4
(compile?), junit:junit:jar:4.7 (test), org.scalatest:scalatest_2.9.1:jar:1.6.1 (test), org.slf4j:slf4j-log4j12:jar:1.6.1
(test)]
Stack trace : 
org.apache.maven.lifecycle.LifecycleExecutionException: Failed to execute goal on project
apollo-web: Could not resolve dependencies for project org.apache.activemq:apollo-web:jar:1.1-SNAPSHOT:
Failed to collect dependencies for [org.apache.activemq:apollo-broker:jar:1.1-SNAPSHOT (compile),
org.fusesource.scalate:scalate-core:jar:1.5.3 (compile), com.sun.jersey:jersey-server:jar:1.5
(compile), javax.servlet:servlet-api:jar:2.5 (provided), org.codehaus.jackson:jackson-jaxrs:jar:1.7.5
(compile), org.codehaus.jackson:jackson-xc:jar:1.7.5 (compile), org.eclipse.jetty.aggregate:jetty-all-server:jar:7.1.6.v20100715
(compile?), net.sf.josql:josql:jar:1.5 (compile), net.sf.josql:gentlyweb-utils:jar:1.5 (compile),
org.scala-lang:scala-library:jar:2.9.1 (compile), org.fusesource.scalate:scalate-test:jar:1.5.3
(test), org.apache.activemq:apollo-util:jar:tests:1.1-SNAPSHOT (test), commons-codec:commons-codec:jar:1.4
(compile?), junit:junit:jar:4.7 (test), org.scalatest:scalatest_2.9.1:jar:1.6.1 (test), org.slf4j:slf4j-log4j12:jar:1.6.1
(test)]
	at org.apache.maven.lifecycle.internal.LifecycleDependencyResolver.getDependencies(LifecycleDependencyResolver.java:190)
	at org.apache.maven.lifecycle.internal.LifecycleDependencyResolver.resolveProjectDependencies(LifecycleDependencyResolver.java:104)
	at org.apache.maven.lifecycle.internal.MojoExecutor.ensureDependenciesAreResolved(MojoExecutor.java:258)
	at org.apache.maven.lifecycle.internal.MojoExecutor.execute(MojoExecutor.java:201)
	at org.apache.maven.lifecycle.internal.MojoExecutor.execute(MojoExecutor.java:153)
	at org.apache.maven.lifecycle.internal.MojoExecutor.execute(MojoExecutor.java:145)
	at org.apache.maven.lifecycle.internal.LifecycleModuleBuilder.buildProject(LifecycleModuleBuilder.java:84)
	at org.apache.maven.lifecycle.internal.LifecycleModuleBuilder.buildProject(LifecycleModuleBuilder.java:59)
	at org.apache.maven.lifecycle.internal.LifecycleStarter.singleThreadedBuild(LifecycleStarter.java:183)
	at org.apache.maven.lifecycle.internal.LifecycleStarter.execute(LifecycleStarter.java:161)
	at org.apache.maven.DefaultMaven.doExecute(DefaultMaven.java:319)
	at org.apache.maven.DefaultMaven.execute(DefaultMaven.java:156)
	at org.jvnet.hudson.maven3.launcher.Maven3Launcher.main(Maven3Launcher.java:79)
	at sun.reflect.NativeMethodAccessorImpl.invoke0(Native Method)
	at sun.reflect.NativeMethodAccessorImpl.invoke(NativeMethodAccessorImpl.java:39)
	at sun.reflect.DelegatingMethodAccessorImpl.invoke(DelegatingMethodAccessorImpl.java:25)
	at java.lang.reflect.Method.invoke(Method.java:597)
	at org.codehaus.plexus.classworlds.launcher.Launcher.launchStandard(Launcher.java:329)
	at org.codehaus.plexus.classworlds.launcher.Launcher.launch(Launcher.java:239)
	at org.jvnet.hudson.maven3.agent.Maven3Main.launch(Maven3Main.java:158)
	at hudson.maven.Maven3Builder.call(Maven3Builder.java:104)
	at hudson.maven.Maven3Builder.call(Maven3Builder.java:70)
	at hudson.remoting.UserRequest.perform(UserRequest.java:118)
	at hudson.remoting.UserRequest.perform(UserRequest.java:48)
	at hudson.remoting.Request$2.run(Request.java:287)
	at java.util.concurrent.Executors$RunnableAdapter.call(Executors.java:441)
	at java.util.concurrent.FutureTask$Sync.innerRun(FutureTask.java:303)
	at java.util.concurrent.FutureTask.run(FutureTask.java:138)
	at java.util.concurrent.ThreadPoolExecutor$Worker.runTask(ThreadPoolExecutor.java:886)
	at java.util.concurrent.ThreadPoolExecutor$Worker.run(ThreadPoolExecutor.java:908)
	at java.lang.Thread.run(Thread.java:662)
Caused by: org.apache.maven.project.DependencyResolutionException: Could not resolve dependencies
for project org.apache.activemq:apollo-web:jar:1.1-SNAPSHOT: Failed to collect dependencies
for [org.apache.activemq:apollo-broker:jar:1.1-SNAPSHOT (compile), org.fusesource.scalate:scalate-core:jar:1.5.3
(compile), com.sun.jersey:jersey-server:jar:1.5 (compile), javax.servlet:servlet-api:jar:2.5
(provided), org.codehaus.jackson:jackson-jaxrs:jar:1.7.5 (compile), org.codehaus.jackson:jackson-xc:jar:1.7.5
(compile), org.eclipse.jetty.aggregate:jetty-all-server:jar:7.1.6.v20100715 (compile?), net.sf.josql:josql:jar:1.5
(compile), net.sf.josql:gentlyweb-utils:jar:1.5 (compile), org.scala-lang:scala-library:jar:2.9.1
(compile), org.fusesource.scalate:scalate-test:jar:1.5.3 (test), org.apache.activemq:apollo-util:jar:tests:1.1-SNAPSHOT
(test), commons-codec:commons-codec:jar:1.4 (compile?), junit:junit:jar:4.7 (test), org.scalatest:scalatest_2.9.1:jar:1.6.1
(test), org.slf4j:slf4j-log4j12:jar:1.6.1 (test)]
	at org.apache.maven.project.DefaultProjectDependenciesResolver.resolve(DefaultProjectDependenciesResolver.java:127)
	at org.apache.maven.lifecycle.internal.LifecycleDependencyResolver.getDependencies(LifecycleDependencyResolver.java:165)
	... 30 more
Caused by: org.sonatype.aether.collection.DependencyCollectionException: Failed to collect
dependencies for [org.apache.activemq:apollo-broker:jar:1.1-SNAPSHOT (compile), org.fusesource.scalate:scalate-core:jar:1.5.3
(compile), com.sun.jersey:jersey-server:jar:1.5 (compile), javax.servlet:servlet-api:jar:2.5
(provided), org.codehaus.jackson:jackson-jaxrs:jar:1.7.5 (compile), org.codehaus.jackson:jackson-xc:jar:1.7.5
(compile), org.eclipse.jetty.aggregate:jetty-all-server:jar:7.1.6.v20100715 (compile?), net.sf.josql:josql:jar:1.5
(compile), net.sf.josql:gentlyweb-utils:jar:1.5 (compile), org.scala-lang:scala-library:jar:2.9.1
(compile), org.fusesource.scalate:scalate-test:jar:1.5.3 (test), org.apache.activemq:apollo-util:jar:tests:1.1-SNAPSHOT
(test), commons-codec:commons-codec:jar:1.4 (compile?), junit:junit:jar:4.7 (test), org.scalatest:scalatest_2.9.1:jar:1.6.1
(test), org.slf4j:slf4j-log4j12:jar:1.6.1 (test)]
	at org.sonatype.aether.impl.internal.DefaultDependencyCollector.collectDependencies(DefaultDependencyCollector.java:251)
	at org.sonatype.aether.impl.internal.DefaultRepositorySystem.collectDependencies(DefaultRepositorySystem.java:318)
	at org.apache.maven.project.DefaultProjectDependenciesResolver.resolve(DefaultProjectDependenciesResolver.java:119)
	... 31 more
Caused by: org.sonatype.aether.resolution.ArtifactDescriptorException: Failed to read artifact
descriptor for net.sf.josql:josql:jar:1.5
	at org.apache.maven.repository.internal.DefaultArtifactDescriptorReader.loadPom(DefaultArtifactDescriptorReader.java:283)
	at org.apache.maven.repository.internal.DefaultArtifactDescriptorReader.readArtifactDescriptor(DefaultArtifactDescriptorReader.java:173)
	at org.sonatype.aether.impl.internal.DefaultDependencyCollector.process(DefaultDependencyCollector.java:419)
	at org.sonatype.aether.impl.internal.DefaultDependencyCollector.collectDependencies(DefaultDependencyCollector.java:233)
	... 33 more
Caused by: org.sonatype.aether.resolution.ArtifactResolutionException: Could not transfer
artifact net.sf.josql:josql:pom:1.5 from/to com.fusesource.m2 (http://repo.fusesource.com/nexus/content/groups/public/):
Error transferring file: Server returned HTTP response code: 503 for URL: http://repo.fusesource.com/nexus/content/groups/public/net/sf/josql/josql/1.5/josql-1.5.pom
	at org.sonatype.aether.impl.internal.DefaultArtifactResolver.resolveArtifacts(DefaultArtifactResolver.java:526)
	at org.sonatype.aether.impl.internal.DefaultArtifactResolver.resolveArtifact(DefaultArtifactResolver.java:214)
	at org.apache.maven.repository.internal.DefaultArtifactDescriptorReader.loadPom(DefaultArtifactDescriptorReader.java:268)
	... 36 more
Caused by: org.sonatype.aether.transfer.ArtifactTransferException: Could not transfer artifact
net.sf.josql:josql:pom:1.5 from/to com.fusesource.m2 (http://repo.fusesource.com/nexus/content/groups/public/):
Error transferring file: Server returned HTTP response code: 503 for URL: http://repo.fusesource.com/nexus/content/groups/public/net/sf/josql/josql/1.5/josql-1.5.pom
	at org.sonatype.aether.connector.wagon.WagonRepositoryConnector$4.wrap(WagonRepositoryConnector.java:949)
	at org.sonatype.aether.connector.wagon.WagonRepositoryConnector$4.wrap(WagonRepositoryConnector.java:940)
	at org.sonatype.aether.connector.wagon.WagonRepositoryConnector$GetTask.flush(WagonRepositoryConnector.java:696)
	at org.sonatype.aether.connector.wagon.WagonRepositoryConnector$GetTask.flush(WagonRepositoryConnector.java:690)
	at org.sonatype.aether.connector.wagon.WagonRepositoryConnector.get(WagonRepositoryConnector.java:435)
	at org.sonatype.aether.impl.internal.DefaultArtifactResolver.resolveArtifacts(DefaultArtifactResolver.java:438)
	... 38 more
Caused by: org.apache.maven.wagon.TransferFailedException: Error transferring file: Server
returned HTTP response code: 503 for URL: http://repo.fusesource.com/nexus/content/groups/public/net/sf/josql/josql/1.5/josql-1.5.pom
	at org.apache.maven.wagon.providers.http.LightweightHttpWagon.fillInputData(LightweightHttpWagon.java:143)
	at org.apache.maven.wagon.StreamWagon.getInputStream(StreamWagon.java:116)
	at org.apache.maven.wagon.StreamWagon.getIfNewer(StreamWagon.java:88)
	at org.apache.maven.wagon.StreamWagon.get(StreamWagon.java:61)
	at org.sonatype.aether.connector.wagon.WagonRepositoryConnector$GetTask.run(WagonRepositoryConnector.java:605)
	... 3 more
Caused by: java.io.IOException: Server returned HTTP response code: 503 for URL: http://repo.fusesource.com/nexus/content/groups/public/net/sf/josql/josql/1.5/josql-1.5.pom
	at sun.reflect.GeneratedConstructorAccessor9.newInstance(Unknown Source)
	at sun.reflect.DelegatingConstructorAccessorImpl.newInstance(DelegatingConstructorAccessorImpl.java:27)
	at java.lang.reflect.Constructor.newInstance(Constructor.java:513)
	at sun.net.www.protocol.http.HttpURLConnection$6.run(HttpURLConnection.java:1491)
	at java.security.AccessController.doPrivileged(Native Method)
	at sun.net.www.protocol.http.HttpURLConnection.getChainedException(HttpURLConnection.java:1485)
	at sun.net.www.protocol.http.HttpURLConnection.getInputStream(HttpURLConnection.java:1139)
	at org.apache.maven.wagon.providers.http.LightweightHttpWagon.fillInputData(LightweightHttpWagon.java:122)
	... 7 more
Caused by: java.io.IOException: Server returned HTTP response code: 503 for URL: http://repo.fusesource.com/nexus/content/groups/public/net/sf/josql/josql/1.5/josql-1.5.pom
	at sun.net.www.protocol.http.HttpURLConnection.getInputStream(HttpURLConnection.java:1436)
	at java.net.HttpURLConnection.getResponseCode(HttpURLConnection.java:379)
	at org.apache.maven.wagon.providers.http.LightweightHttpWagon.fillInputData(LightweightHttpWagon.java:115)
	... 7 more
channel stopped


Mime
View raw message