activemq-commits mailing list archives

Site index · List index
Message view « Date » · « Thread »
Top « Date » · « Thread »
From Apache Jenkins Server <jenk...@builds.apache.org>
Subject Build failed in Jenkins: ActiveMQ-Apollo #569
Date Mon, 30 Jan 2012 13:27:01 GMT
See <https://builds.apache.org/job/ActiveMQ-Apollo/569/>

------------------------------------------
[...truncated 3439 lines...]
org.apache.activemq.apollo.openwire.generator.ApolloMarshallingGenerator processing class:
SessionInfo
org.apache.activemq.apollo.openwire.generator.ApolloMarshallingGenerator processing class:
ExceptionResponse
org.apache.activemq.apollo.openwire.generator.ApolloMarshallingGenerator processing class:
ActiveMQQueue
org.apache.activemq.apollo.openwire.generator.ApolloMarshallingGenerator processing class:
ActiveMQMessage
org.apache.activemq.apollo.openwire.generator.ApolloMarshallingGenerator processing class:
WireFormatInfo
org.apache.activemq.apollo.openwire.generator.ApolloMarshallingGenerator processing class:
SubscriptionInfo
org.apache.activemq.apollo.openwire.generator.ApolloMarshallingGenerator processing class:
ActiveMQTempTopic
org.apache.activemq.apollo.openwire.generator.ApolloMarshallingGenerator processing class:
MessageDispatchNotification
org.apache.activemq.apollo.openwire.generator.ApolloMarshallingGenerator processing class:
ConnectionId
org.apache.activemq.apollo.openwire.generator.ApolloMarshallingGenerator processing class:
ActiveMQDestination
org.apache.activemq.apollo.openwire.generator.ApolloMarshallingGenerator processing class:
ConsumerInfo
org.apache.activemq.apollo.openwire.generator.ApolloMarshallingGenerator processing class:
ShutdownInfo
org.apache.activemq.apollo.openwire.generator.ApolloMarshallingGenerator processing class:
LastPartialCommand
org.apache.activemq.apollo.openwire.generator.ApolloMarshallingGenerator processing class:
DiscoveryEvent
org.apache.activemq.apollo.openwire.generator.ApolloMarshallingGenerator processing class:
ActiveMQTextMessage
org.apache.activemq.apollo.openwire.generator.ApolloMarshallingGenerator processing class:
ActiveMQTopic
org.apache.activemq.apollo.openwire.generator.ApolloMarshallingGenerator processing class:
ActiveMQStreamMessage
org.apache.activemq.apollo.openwire.generator.ApolloMarshallingGenerator processing class:
MessageAck
org.apache.activemq.apollo.openwire.generator.ApolloMarshallingGenerator processing class:
Message
org.apache.activemq.apollo.openwire.generator.ApolloMarshallingGenerator processing class:
DataArrayResponse
org.apache.activemq.apollo.openwire.generator.ApolloMarshallingGenerator processing class:
ControlCommand
org.apache.activemq.apollo.openwire.generator.ApolloMarshallingGenerator processing class:
ProducerAck
org.apache.activemq.apollo.openwire.generator.ApolloMarshallingGenerator processing class:
DataResponse
org.apache.activemq.apollo.openwire.generator.ApolloMarshallingGenerator processing class:
RemoveInfo
org.apache.activemq.apollo.openwire.generator.ApolloMarshallingGenerator processing class:
FlushCommand
org.apache.activemq.apollo.openwire.generator.ApolloMarshallingGenerator processing class:
BaseCommand
org.apache.activemq.apollo.openwire.generator.ApolloMarshallingGenerator processing class:
ActiveMQTempDestination
org.apache.activemq.apollo.openwire.generator.ApolloMarshallingGenerator processing class:
LocalTransactionId
org.apache.activemq.apollo.openwire.generator.ApolloMarshallingGenerator processing class:
NetworkBridgeFilter
org.apache.activemq.apollo.openwire.generator.ApolloMarshallingGenerator processing class:
IntegerResponse
org.apache.activemq.apollo.openwire.generator.ApolloMarshallingGenerator processing class:
ProducerId
org.apache.activemq.apollo.openwire.generator.ApolloMarshallingGenerator processing class:
TransactionInfo
org.apache.activemq.apollo.openwire.generator.ApolloMarshallingGenerator processing class:
ConnectionInfo
org.apache.activemq.apollo.openwire.generator.ApolloMarshallingGenerator processing class:
ActiveMQMapMessage
org.apache.activemq.apollo.openwire.generator.ApolloMarshallingGenerator processing class:
ActiveMQBlobMessage
org.apache.activemq.apollo.openwire.generator.ApolloMarshallingGenerator processing class:
DestinationInfo
org.apache.activemq.apollo.openwire.generator.ApolloMarshallingGenerator processing class:
KeepAliveInfo
org.apache.activemq.apollo.openwire.generator.ApolloMarshallingGenerator processing class:
XATransactionId
org.apache.activemq.apollo.openwire.generator.ApolloMarshallingGenerator processing class:
RemoveSubscriptionInfo
org.apache.activemq.apollo.openwire.generator.ApolloMarshallingGenerator processing class:
ProducerInfo
org.apache.activemq.apollo.openwire.generator.ApolloMarshallingGenerator processing class:
MessageId
org.apache.activemq.apollo.openwire.generator.ApolloMarshallingGenerator processing class:
MessagePull
org.apache.activemq.apollo.openwire.generator.ApolloMarshallingGenerator processing class:
ConsumerId
org.apache.activemq.apollo.openwire.generator.ApolloMarshallingGenerator processing class:
ActiveMQObjectMessage
org.apache.activemq.apollo.openwire.generator.ApolloMarshallingGenerator processing class:
ActiveMQTempQueue
======================================================
 Generating Marshallers for OpenWire version: 8
======================================================
org.apache.activemq.apollo.openwire.generator.ApolloMarshallingGenerator generating files
in: <https://builds.apache.org/job/ActiveMQ-Apollo/ws/trunk/apollo-openwire/target/generated-sources/openwire/org/apache/activemq/apollo/openwire/codec/v8>
org.apache.activemq.apollo.openwire.generator.ApolloMarshallingGenerator processing class:
BrokerInfo
org.apache.activemq.apollo.openwire.generator.ApolloMarshallingGenerator processing class:
ActiveMQBytesMessage
org.apache.activemq.apollo.openwire.generator.ApolloMarshallingGenerator processing class:
ConnectionControl
org.apache.activemq.apollo.openwire.generator.ApolloMarshallingGenerator processing class:
ConnectionError
org.apache.activemq.apollo.openwire.generator.ApolloMarshallingGenerator processing class:
TransactionId
org.apache.activemq.apollo.openwire.generator.ApolloMarshallingGenerator processing class:
PartialCommand
org.apache.activemq.apollo.openwire.generator.ApolloMarshallingGenerator processing class:
MessageDispatch
org.apache.activemq.apollo.openwire.generator.ApolloMarshallingGenerator processing class:
ConsumerControl
org.apache.activemq.apollo.openwire.generator.ApolloMarshallingGenerator processing class:
Response
org.apache.activemq.apollo.openwire.generator.ApolloMarshallingGenerator processing class:
ReplayCommand
org.apache.activemq.apollo.openwire.generator.ApolloMarshallingGenerator processing class:
SessionId
org.apache.activemq.apollo.openwire.generator.ApolloMarshallingGenerator processing class:
BrokerId
org.apache.activemq.apollo.openwire.generator.ApolloMarshallingGenerator processing class:
SessionInfo
org.apache.activemq.apollo.openwire.generator.ApolloMarshallingGenerator processing class:
ExceptionResponse
org.apache.activemq.apollo.openwire.generator.ApolloMarshallingGenerator processing class:
ActiveMQQueue
org.apache.activemq.apollo.openwire.generator.ApolloMarshallingGenerator processing class:
ActiveMQMessage
org.apache.activemq.apollo.openwire.generator.ApolloMarshallingGenerator processing class:
WireFormatInfo
org.apache.activemq.apollo.openwire.generator.ApolloMarshallingGenerator processing class:
SubscriptionInfo
org.apache.activemq.apollo.openwire.generator.ApolloMarshallingGenerator processing class:
ActiveMQTempTopic
org.apache.activemq.apollo.openwire.generator.ApolloMarshallingGenerator processing class:
MessageDispatchNotification
org.apache.activemq.apollo.openwire.generator.ApolloMarshallingGenerator processing class:
ConnectionId
org.apache.activemq.apollo.openwire.generator.ApolloMarshallingGenerator processing class:
ActiveMQDestination
org.apache.activemq.apollo.openwire.generator.ApolloMarshallingGenerator processing class:
ConsumerInfo
org.apache.activemq.apollo.openwire.generator.ApolloMarshallingGenerator processing class:
ShutdownInfo
org.apache.activemq.apollo.openwire.generator.ApolloMarshallingGenerator processing class:
LastPartialCommand
org.apache.activemq.apollo.openwire.generator.ApolloMarshallingGenerator processing class:
DiscoveryEvent
org.apache.activemq.apollo.openwire.generator.ApolloMarshallingGenerator processing class:
ActiveMQTextMessage
org.apache.activemq.apollo.openwire.generator.ApolloMarshallingGenerator processing class:
ActiveMQTopic
org.apache.activemq.apollo.openwire.generator.ApolloMarshallingGenerator processing class:
ActiveMQStreamMessage
org.apache.activemq.apollo.openwire.generator.ApolloMarshallingGenerator processing class:
MessageAck
org.apache.activemq.apollo.openwire.generator.ApolloMarshallingGenerator processing class:
Message
org.apache.activemq.apollo.openwire.generator.ApolloMarshallingGenerator processing class:
DataArrayResponse
org.apache.activemq.apollo.openwire.generator.ApolloMarshallingGenerator processing class:
ControlCommand
org.apache.activemq.apollo.openwire.generator.ApolloMarshallingGenerator processing class:
ProducerAck
org.apache.activemq.apollo.openwire.generator.ApolloMarshallingGenerator processing class:
DataResponse
org.apache.activemq.apollo.openwire.generator.ApolloMarshallingGenerator processing class:
RemoveInfo
org.apache.activemq.apollo.openwire.generator.ApolloMarshallingGenerator processing class:
FlushCommand
org.apache.activemq.apollo.openwire.generator.ApolloMarshallingGenerator processing class:
BaseCommand
org.apache.activemq.apollo.openwire.generator.ApolloMarshallingGenerator processing class:
ActiveMQTempDestination
org.apache.activemq.apollo.openwire.generator.ApolloMarshallingGenerator processing class:
LocalTransactionId
org.apache.activemq.apollo.openwire.generator.ApolloMarshallingGenerator processing class:
NetworkBridgeFilter
org.apache.activemq.apollo.openwire.generator.ApolloMarshallingGenerator processing class:
IntegerResponse
org.apache.activemq.apollo.openwire.generator.ApolloMarshallingGenerator processing class:
ProducerId
org.apache.activemq.apollo.openwire.generator.ApolloMarshallingGenerator processing class:
TransactionInfo
org.apache.activemq.apollo.openwire.generator.ApolloMarshallingGenerator processing class:
ConnectionInfo
org.apache.activemq.apollo.openwire.generator.ApolloMarshallingGenerator processing class:
ActiveMQMapMessage
org.apache.activemq.apollo.openwire.generator.ApolloMarshallingGenerator processing class:
ActiveMQBlobMessage
org.apache.activemq.apollo.openwire.generator.ApolloMarshallingGenerator processing class:
DestinationInfo
org.apache.activemq.apollo.openwire.generator.ApolloMarshallingGenerator processing class:
KeepAliveInfo
org.apache.activemq.apollo.openwire.generator.ApolloMarshallingGenerator processing class:
XATransactionId
org.apache.activemq.apollo.openwire.generator.ApolloMarshallingGenerator processing class:
RemoveSubscriptionInfo
org.apache.activemq.apollo.openwire.generator.ApolloMarshallingGenerator processing class:
ProducerInfo
org.apache.activemq.apollo.openwire.generator.ApolloMarshallingGenerator processing class:
MessageId
org.apache.activemq.apollo.openwire.generator.ApolloMarshallingGenerator processing class:
MessagePull
org.apache.activemq.apollo.openwire.generator.ApolloMarshallingGenerator processing class:
ConsumerId
org.apache.activemq.apollo.openwire.generator.ApolloMarshallingGenerator processing class:
ActiveMQObjectMessage
org.apache.activemq.apollo.openwire.generator.ApolloMarshallingGenerator processing class:
ActiveMQTempQueue
[INFO] Executed tasks
[INFO] [INFO] Source directory: <https://builds.apache.org/job/ActiveMQ-Apollo/ws/trunk/apollo-openwire/target/generated-sources/openwire>
added.

[INFO] --- build-helper-maven-plugin:1.7:add-source (default) @ apollo-openwire ---
[INFO] 
[INFO] --- maven-remote-resources-plugin:1.1:process (default) @ apollo-openwire ---
[INFO] Using 'UTF-8' encoding to copy filtered resources.
[INFO] [INFO] skip non existing resourceDirectory <https://builds.apache.org/job/ActiveMQ-Apollo/ws/trunk/apollo-openwire/target/schema>
[INFO] Copying 5 resources
[INFO] Copying 3 resources

[INFO] --- maven-resources-plugin:2.4.3:resources (default-resources) @ apollo-openwire ---
[INFO] [INFO] Compiling 539 source files to <https://builds.apache.org/job/ActiveMQ-Apollo/ws/trunk/apollo-openwire/target/classes>

[INFO] --- maven-compiler-plugin:2.3.2:compile (default-compile) @ apollo-openwire ---
[INFO] Checking for multiple versions of scala
[INFO] [INFO] includes = [**/*.scala,**/*.java,]
[INFO] excludes = []

[INFO] --- maven-scala-plugin:2.15.2:compile (default) @ apollo-openwire ---
[INFO] <https://builds.apache.org/job/ActiveMQ-Apollo/ws/trunk/apollo-openwire/src/main/scala>:-1:
info: compiling
[INFO] <https://builds.apache.org/job/ActiveMQ-Apollo/ws/trunk/apollo-openwire/target/generated-sources/openwire>:-1:
info: compiling
[INFO] Compiling 547 source files to <https://builds.apache.org/job/ActiveMQ-Apollo/ws/trunk/apollo-openwire/target/classes>
at 1327929997835
[INFO] compiler plugin: BasicArtifact(org.scala-lang.plugins,continuations,2.9.1)
[INFO] compiler plugin: BasicArtifact(org.fusesource.jvmassert,jvmassert,1.2)
[ERROR] <https://builds.apache.org/job/ActiveMQ-Apollo/ws/trunk/apollo-openwire/src/main/scala/org/apache/activemq/apollo/openwire/DestinationConverter.scala>:41:
error: value sanitize_destinations is not a member of org.apache.activemq.apollo.broker.DestinationParser
[INFO]   OPENWIRE_PARSER.sanitize_destinations = true
[INFO]                   ^
[ERROR] one error found
[JENKINS] Archiving disabled - not archiving <https://builds.apache.org/job/ActiveMQ-Apollo/ws/trunk/apollo-openwire/pom.xml>
[INFO] Downloading: http://download.java.net/maven/2/org/iq80/snappy/snappy/0.2/snappy-0.2.pom
                                                                        
[INFO] ------------------------------------------------------------------------
[INFO] Building apache-apollo 1.0-SNAPSHOT
[INFO] ------------------------------------------------------------------------
Downloading: http://maven.glassfish.org/content/groups/glassfish/org/iq80/snappy/snappy/0.2/snappy-0.2.pom
Downloaded: http://maven.glassfish.org/content/groups/glassfish/org/iq80/snappy/snappy/0.2/snappy-0.2.pom
(14 KB at 18.9 KB/sec)
Downloading: http://download.java.net/maven/2/org/iq80/snappy/snappy/0.2/snappy-0.2.jar
Downloading: http://maven.glassfish.org/content/groups/glassfish/org/iq80/snappy/snappy/0.2/snappy-0.2.jar
Downloaded: http://maven.glassfish.org/content/groups/glassfish/org/iq80/snappy/snappy/0.2/snappy-0.2.jar
(48 KB at 53.7 KB/sec)
[INFO] 
[INFO] --- maven-clean-plugin:2.4.1:clean (default-clean) @ apache-apollo ---
[INFO] 
[INFO] --- maven-enforcer-plugin:1.0:enforce (default) @ apache-apollo ---
[INFO] 
[INFO] --- maven-remote-resources-plugin:1.1:process (default) @ apache-apollo ---
[INFO] 
[INFO] --- maven-site-plugin:3.0:attach-descriptor (attach-descriptor) @ apache-apollo ---
[INFO] 
[INFO] --- maven-assembly-plugin:2.2.1:single (unix-bin) @ apache-apollo ---
[INFO] Reading assembly descriptor: <https://builds.apache.org/job/ActiveMQ-Apollo/ws/trunk/apollo-distro/src/main/descriptors/unix-bin.xml>
[WARNING] Cannot include project artifact: org.apache.activemq:apache-apollo:pom:1.0-SNAPSHOT;
it doesn't have an associated file or directory.
[WARNING] Cannot include project artifact: org.apache.activemq:apache-apollo:pom:1.0-SNAPSHOT;
it doesn't have an associated file or directory.
[INFO] Building tar : <https://builds.apache.org/job/ActiveMQ-Apollo/ws/trunk/apollo-distro/target/apache-apollo-1.0-SNAPSHOT-unix-distro.tar.gz>
[INFO] [INFO] Reading assembly descriptor: <https://builds.apache.org/job/ActiveMQ-Apollo/ws/trunk/apollo-distro/src/main/descriptors/windows-bin.xml>

[INFO] --- maven-assembly-plugin:2.2.1:single (windows-bin) @ apache-apollo ---
[WARNING] Cannot include project artifact: org.apache.activemq:apache-apollo:pom:1.0-SNAPSHOT;
it doesn't have an associated file or directory.
[WARNING] Cannot include project artifact: org.apache.activemq:apache-apollo:pom:1.0-SNAPSHOT;
it doesn't have an associated file or directory.
[INFO] Building zip: <https://builds.apache.org/job/ActiveMQ-Apollo/ws/trunk/apollo-distro/target/apache-apollo-1.0-SNAPSHOT-windows-distro.zip>
[INFO] [INFO] Installing <https://builds.apache.org/job/ActiveMQ-Apollo/ws/trunk/apollo-distro/pom.xml>
to /home/jenkins/.m2/repository/org/apache/activemq/apache-apollo/1.0-SNAPSHOT/apache-apollo-1.0-SNAPSHOT.pom

[INFO] --- maven-install-plugin:2.3.1:install (default-install) @ apache-apollo ---[INFO]
Installing <https://builds.apache.org/job/ActiveMQ-Apollo/ws/trunk/apollo-distro/target/apache-apollo-1.0-SNAPSHOT-unix-distro.tar.gz>
to /home/jenkins/.m2/repository/org/apache/activemq/apache-apollo/1.0-SNAPSHOT/apache-apollo-1.0-SNAPSHOT-unix-distro.tar.gz

[INFO] Installing <https://builds.apache.org/job/ActiveMQ-Apollo/ws/trunk/apollo-distro/target/apache-apollo-1.0-SNAPSHOT-windows-distro.zip>
to /home/jenkins/.m2/repository/org/apache/activemq/apache-apollo/1.0-SNAPSHOT/apache-apollo-1.0-SNAPSHOT-windows-distro.zip
[JENKINS] Archiving disabled - not archiving <https://builds.apache.org/job/ActiveMQ-Apollo/ws/trunk/apollo-distro/pom.xml>
[JENKINS] Archiving disabled - not archiving <https://builds.apache.org/job/ActiveMQ-Apollo/ws/trunk/apollo-distro/target/apache-apollo-1.0-SNAPSHOT-unix-distro.tar.gz>
[JENKINS] Archiving disabled - not archiving <https://builds.apache.org/job/ActiveMQ-Apollo/ws/trunk/apollo-distro/target/apache-apollo-1.0-SNAPSHOT-windows-distro.zip>
[INFO] ------------------------------------------------------------------------
[INFO] Reactor Summary:
[INFO] 
[INFO] Apache ActiveMQ Apollo Project .................... SUCCESS [31.106s]
[INFO] apollo-boot ....................................... SUCCESS [8.201s]
[INFO] apollo-scala ...................................... SUCCESS [1.604s]
[INFO] apollo-util ....................................... SUCCESS [1:59.900s]
[INFO] apollo-dto ........................................ SUCCESS [7.771s]
[INFO] apollo-selector ................................... SUCCESS [4.797s]
[INFO] apollo-broker ..................................... SUCCESS [1:07.317s]
[INFO] apollo-web ........................................ SUCCESS [44.556s]
[INFO] apollo-leveldb .................................... SUCCESS [40.543s]
[INFO] apollo-bdb ........................................ SUCCESS [28.366s]
[INFO] apollo-stomp ...................................... SUCCESS [1:03.498s]
[INFO] apollo-cli ........................................ SUCCESS [33.995s]
[INFO] apollo-website .................................... SUCCESS [25.320s]
[INFO] apollo-openwire-generator ......................... SUCCESS [23.767s]
[INFO] apollo-openwire ................................... FAILURE [24.915s]
[INFO] apache-apollo ..................................... SUCCESS [11.784s]
[INFO] ------------------------------------------------------------------------
[INFO] BUILD FAILURE
[INFO] ------------------------------------------------------------------------
[INFO] Total time: 9:05.509s
[INFO] Finished at: Mon Jan 30 13:26:58 UTC 2012
[INFO] Final Memory: 284M/1140M
[INFO] ------------------------------------------------------------------------
Waiting for Jenkins to finish collecting data
mavenExecutionResult exceptions not empty
message : Failed to execute goal org.scala-tools:maven-scala-plugin:2.15.2:compile (default)
on project apollo-openwire: wrap: org.apache.commons.exec.ExecuteException: Process exited
with an error: 1(Exit value: 1)
cause : wrap: org.apache.commons.exec.ExecuteException: Process exited with an error: 1(Exit
value: 1)
Stack trace : 
org.apache.maven.lifecycle.LifecycleExecutionException: Failed to execute goal org.scala-tools:maven-scala-plugin:2.15.2:compile
(default) on project apollo-openwire: wrap: org.apache.commons.exec.ExecuteException: Process
exited with an error: 1(Exit value: 1)
	at org.apache.maven.lifecycle.internal.MojoExecutor.execute(MojoExecutor.java:217)
	at org.apache.maven.lifecycle.internal.MojoExecutor.execute(MojoExecutor.java:153)
	at org.apache.maven.lifecycle.internal.MojoExecutor.execute(MojoExecutor.java:145)
	at org.apache.maven.lifecycle.internal.LifecycleModuleBuilder.buildProject(LifecycleModuleBuilder.java:84)
	at org.apache.maven.lifecycle.internal.LifecycleModuleBuilder.buildProject(LifecycleModuleBuilder.java:59)
	at org.apache.maven.lifecycle.internal.LifecycleStarter.singleThreadedBuild(LifecycleStarter.java:183)
	at org.apache.maven.lifecycle.internal.LifecycleStarter.execute(LifecycleStarter.java:161)
	at org.apache.maven.DefaultMaven.doExecute(DefaultMaven.java:319)
	at org.apache.maven.DefaultMaven.execute(DefaultMaven.java:156)
	at org.jvnet.hudson.maven3.launcher.Maven3Launcher.main(Maven3Launcher.java:79)
	at sun.reflect.NativeMethodAccessorImpl.invoke0(Native Method)
	at sun.reflect.NativeMethodAccessorImpl.invoke(NativeMethodAccessorImpl.java:39)
	at sun.reflect.DelegatingMethodAccessorImpl.invoke(DelegatingMethodAccessorImpl.java:25)
	at java.lang.reflect.Method.invoke(Method.java:597)
	at org.codehaus.plexus.classworlds.launcher.Launcher.launchStandard(Launcher.java:329)
	at org.codehaus.plexus.classworlds.launcher.Launcher.launch(Launcher.java:239)
	at org.jvnet.hudson.maven3.agent.Maven3Main.launch(Maven3Main.java:158)
	at hudson.maven.Maven3Builder.call(Maven3Builder.java:104)
	at hudson.maven.Maven3Builder.call(Maven3Builder.java:70)
	at hudson.remoting.UserRequest.perform(UserRequest.java:118)
	at hudson.remoting.UserRequest.perform(UserRequest.java:48)
	at hudson.remoting.Request$2.run(Request.java:287)
	at java.util.concurrent.Executors$RunnableAdapter.call(Executors.java:441)
	at java.util.concurrent.FutureTask$Sync.innerRun(FutureTask.java:303)
	at java.util.concurrent.FutureTask.run(FutureTask.java:138)
	at java.util.concurrent.ThreadPoolExecutor$Worker.runTask(ThreadPoolExecutor.java:886)
	at java.util.concurrent.ThreadPoolExecutor$Worker.run(ThreadPoolExecutor.java:908)
	at java.lang.Thread.run(Thread.java:662)
Caused by: org.apache.maven.plugin.MojoExecutionException: wrap: org.apache.commons.exec.ExecuteException:
Process exited with an error: 1(Exit value: 1)
	at org_scala_tools_maven.ScalaMojoSupport.execute(ScalaMojoSupport.java:350)
	at org.apache.maven.plugin.DefaultBuildPluginManager.executeMojo(DefaultBuildPluginManager.java:107)
	at org.apache.maven.lifecycle.internal.MojoExecutor.execute(MojoExecutor.java:209)
	... 27 more
Caused by: org.apache.commons.exec.ExecuteException: Process exited with an error: 1(Exit
value: 1)
	at org.apache.commons.exec.DefaultExecutor.executeInternal(DefaultExecutor.java:346)
	at org.apache.commons.exec.DefaultExecutor.execute(DefaultExecutor.java:149)
	at org.apache.commons.exec.DefaultExecutor.execute(DefaultExecutor.java:136)
	at org_scala_tools_maven_executions.JavaMainCallerByFork.run(JavaMainCallerByFork.java:80)
	at org_scala_tools_maven.ScalaCompilerSupport.compile(ScalaCompilerSupport.java:124)
	at org_scala_tools_maven.ScalaCompilerSupport.doExecute(ScalaCompilerSupport.java:80)
	at org_scala_tools_maven.ScalaMojoSupport.execute(ScalaMojoSupport.java:342)
	... 29 more
channel stopped


Mime
View raw message