activemq-commits mailing list archives

Site index · List index
Message view « Date » · « Thread »
Top « Date » · « Thread »
From Apache Jenkins Server <jenk...@builds.apache.org>
Subject Build failed in Jenkins: ActiveMQ-Apollo #521
Date Tue, 17 Jan 2012 20:54:07 GMT
See <https://builds.apache.org/job/ActiveMQ-Apollo/521/>

------------------------------------------
[...truncated 2944 lines...]
[INFO]  found   : Long
[INFO]  required: Int
[INFO]     Option(config.max_data_length).map(MemoryPropertyEditor.parse(_)).foreach( codec.max_data_length
= _ )
[INFO]                                                                                   
                    ^
[ERROR] F:\hudson\hudson-slave\workspace\ActiveMQ-Apollo\trunk\apollo-stomp\src\main\scala\org\apache\activemq\apollo\stomp\StompProtocolHandler.scala:597:
error: type mismatch;
[INFO]  found   : Long
[INFO]  required: Int
[INFO]     Option(config.max_header_length).map(MemoryPropertyEditor.parse(_)).foreach( codec.max_header_length
= _ )
[INFO]                                                                                   
                        ^
[ERROR] two errors found
[JENKINS] Archiving disabled - not archiving F:\hudson\hudson-slave\workspace\ActiveMQ-Apollo\trunk\apollo-stomp\pom.xml
[INFO]                                                                         
[INFO] ------------------------------------------------------------------------
[INFO] Skipping apollo-cli
[INFO] This project has been banned from the build due to previous failures.
[INFO] ------------------------------------------------------------------------
[INFO]                                                                         
[INFO] ------------------------------------------------------------------------
[INFO] Building apollo-website 1.0-SNAPSHOT
[INFO] ------------------------------------------------------------------------
[INFO] 
[INFO] --- maven-clean-plugin:2.4.1:clean (default-clean) @ apollo-website ---
[INFO] 
[INFO] --- maven-enforcer-plugin:1.0:enforce (default) @ apollo-website ---
[INFO] [WARNING] Parameter tasks is deprecated, use target instead

[INFO] --- maven-antrun-plugin:1.7:run (default) @ apollo-website ---
[INFO] Executing tasks

main:
    [mkdir] Created dir: F:\hudson\hudson-slave\workspace\ActiveMQ-Apollo\trunk\apollo-website\target\sitegen\documentation\schema
[schemagen] Generating schema from 65 source files
Note: Writing F:\hudson\hudson-slave\workspace\ActiveMQ-Apollo\trunk\apollo-website\target\sitegen\documentation\schema\apollo.xsd
[INFO] Executed tasks
[INFO] 
[INFO] --- maven-remote-resources-plugin:1.1:process (default) @ apollo-website ---
[INFO] 
[INFO] --- maven-scala-plugin:2.15.2:compile (default) @ apollo-website ---
[INFO] Checking for multiple versions of scala
[INFO] includes = [**/*.scala,**/*.java,]
[INFO] excludes = []
[INFO] F:\hudson\hudson-slave\workspace\ActiveMQ-Apollo\trunk\apollo-website\ext:-1: info:
compiling
[INFO] Compiling 3 source files to F:\hudson\hudson-slave\workspace\ActiveMQ-Apollo\trunk\apollo-website\target\classes
at 1326833613628
[INFO] compiler plugin: BasicArtifact(org.scala-lang.plugins,continuations,2.9.1)
[INFO] compiler plugin: BasicArtifact(org.fusesource.jvmassert,jvmassert,1.2)
[INFO] prepare-compile in 0 s
[INFO] compile in 7 s
[INFO] [INFO] Checking for multiple versions of scala

[INFO] --- maven-scala-plugin:2.15.2:testCompile (default) @ apollo-website ---
[INFO] includes = [**/*.scala,**/*.java,]
[INFO] excludes = []
[WARNING] No source files found.
[INFO] 
[INFO] --- maven-site-plugin:3.0:attach-descriptor (attach-descriptor) @ apollo-website ---
[INFO] 
[INFO] --- maven-enforcer-plugin:1.0:enforce (default) @ apollo-website ---
[JENKINS] Archiving disabled - not archiving F:\hudson\hudson-slave\workspace\ActiveMQ-Apollo\trunk\apollo-website\pom.xml
Jan 17, 2012 8:53:43 PM hudson.maven.ExecutedMojo <init>
WARNING: Failed to getClass for org.apache.maven.plugin.source.SourceJarMojo
[INFO] 
[INFO] --- maven-source-plugin:2.1.2:jar (attach-sources) @ apollo-website ---
[INFO] 
[INFO] --- maven-enforcer-plugin:1.0:enforce (default) @ apollo-website ---
[INFO] [WARNING] Parameter tasks is deprecated, use target instead

[INFO] --- maven-antrun-plugin:1.7:run (default) @ apollo-website ---
[INFO] Executing tasks

main:
[schemagen] Generating schema from 65 source files
Note: Writing F:\hudson\hudson-slave\workspace\ActiveMQ-Apollo\trunk\apollo-website\target\sitegen\documentation\schema\apollo.xsd
[INFO] Executed tasks
[INFO] 
[INFO] --- maven-remote-resources-plugin:1.1:process (default) @ apollo-website ---
[INFO] 
[INFO] --- maven-scala-plugin:2.15.2:compile (default) @ apollo-website ---
[INFO] Checking for multiple versions of scala
[INFO] includes = [**/*.scala,**/*.java,]
[INFO] excludes = []
[INFO] Nothing to compile - all classes are up to date
[INFO] 
[INFO] --- maven-scala-plugin:2.15.2:testCompile (default) @ apollo-website ---
[INFO] Checking for multiple versions of scala
[INFO] includes = [**/*.scala,**/*.java,]
[INFO] excludes = []
[WARNING] No source files found.
[INFO] 
[INFO] --- maven-site-plugin:3.0:attach-descriptor (attach-descriptor) @ apollo-website ---
[INFO] 
[INFO] --- maven-enforcer-plugin:1.0:enforce (default) @ apollo-website ---
[JENKINS] Archiving disabled - not archiving F:\hudson\hudson-slave\workspace\ActiveMQ-Apollo\trunk\apollo-website\pom.xml
Jan 17, 2012 8:53:45 PM hudson.maven.ExecutedMojo <init>
WARNING: Failed to getClass for org.apache.maven.plugin.source.SourceJarMojo
[INFO] 
[INFO] --- maven-source-plugin:2.1.2:jar (attach-sources) @ apollo-website ---
[JENKINS] Archiving disabled - not archiving F:\hudson\hudson-slave\workspace\ActiveMQ-Apollo\trunk\apollo-website\pom.xml
Jan 17, 2012 8:53:45 PM hudson.maven.ExecutedMojo <init>
WARNING: Failed to getClass for org.fusesource.scalate.maven.SiteGenMojo
[INFO] Processing Configuration for child elements
Processing child [project]

Processing child [workingDirectory]
[INFO] Processing child [webappDirectory]
Processing child [targetDirectory]
Processing child [testClassPathElements]
--- maven-scalate-plugin:1.5.3:sitegen (sitegen) @ apollo-website ---
[INFO] Generating static website from Scalate Templates and wiki files...
[INFO] template properties: null
Using dir: F:\hudson\hudson-slave\workspace\ActiveMQ-Apollo\trunk\apollo-website\src\blog
at request path: /blog
[INFO]     processing F:\hudson\hudson-slave\workspace\ActiveMQ-Apollo\trunk\apollo-website\src\blog\index.page
with uri: /blog/index.page => 
Using dir: F:\hudson\hudson-slave\workspace\ActiveMQ-Apollo\trunk\apollo-website\src\blog
at request path: /blog
[INFO]     processing F:\hudson\hudson-slave\workspace\ActiveMQ-Apollo\trunk\apollo-website\src\blog\index.rss.feed
with uri: /blog/index.rss.feed => 
[INFO]     processing F:\hudson\hudson-slave\workspace\ActiveMQ-Apollo\trunk\apollo-website\src\blog\releases\release-1-0-beta1.page
with uri: /blog/releases/release-1-0-beta1.page => 
[INFO]     processing F:\hudson\hudson-slave\workspace\ActiveMQ-Apollo\trunk\apollo-website\src\blog\releases\release-1-0-beta2.page
with uri: /blog/releases/release-1-0-beta2.page => 
[INFO]     processing F:\hudson\hudson-slave\workspace\ActiveMQ-Apollo\trunk\apollo-website\src\blog\releases\release-1-0-beta3.page
with uri: /blog/releases/release-1-0-beta3.page => 
[INFO]     processing F:\hudson\hudson-slave\workspace\ActiveMQ-Apollo\trunk\apollo-website\src\blog\releases\release-1-0-beta4.page
with uri: /blog/releases/release-1-0-beta4.page => 
[INFO]     processing F:\hudson\hudson-slave\workspace\ActiveMQ-Apollo\trunk\apollo-website\src\blog\releases\release-1-0-beta5.page
with uri: /blog/releases/release-1-0-beta5.page => 
[INFO]     processing F:\hudson\hudson-slave\workspace\ActiveMQ-Apollo\trunk\apollo-website\src\blog\releases\release-1-0-beta6.page
with uri: /blog/releases/release-1-0-beta6.page => 
[INFO]     processing F:\hudson\hudson-slave\workspace\ActiveMQ-Apollo\trunk\apollo-website\src\community\building.page
with uri: /community/building.page => 
[INFO]     processing F:\hudson\hudson-slave\workspace\ActiveMQ-Apollo\trunk\apollo-website\src\community\contributing.page
with uri: /community/contributing.page => 
[INFO]     processing F:\hudson\hudson-slave\workspace\ActiveMQ-Apollo\trunk\apollo-website\src\community\developers.page
with uri: /community/developers.page => 
[INFO]     processing F:\hudson\hudson-slave\workspace\ActiveMQ-Apollo\trunk\apollo-website\src\community\faq.page
with uri: /community/faq.page => 
[INFO]     processing F:\hudson\hudson-slave\workspace\ActiveMQ-Apollo\trunk\apollo-website\src\community\index.page
with uri: /community/index.page => 
[INFO]     processing F:\hudson\hudson-slave\workspace\ActiveMQ-Apollo\trunk\apollo-website\src\community\release-guide.page
with uri: /community/release-guide.page => 
[INFO]     processing F:\hudson\hudson-slave\workspace\ActiveMQ-Apollo\trunk\apollo-website\src\community\site.page
with uri: /community/site.page => 
[INFO]     processing F:\hudson\hudson-slave\workspace\ActiveMQ-Apollo\trunk\apollo-website\src\community\source.page
with uri: /community/source.page => 
[INFO]     processing F:\hudson\hudson-slave\workspace\ActiveMQ-Apollo\trunk\apollo-website\src\community\support.page
with uri: /community/support.page => 
[INFO]     processing F:\hudson\hudson-slave\workspace\ActiveMQ-Apollo\trunk\apollo-website\src\documentation\architecture.md
with uri: /documentation/architecture.md => 
[INFO]     processing F:\hudson\hudson-slave\workspace\ActiveMQ-Apollo\trunk\apollo-website\src\documentation\extending-guide.md
with uri: /documentation/extending-guide.md => 
[INFO]     processing F:\hudson\hudson-slave\workspace\ActiveMQ-Apollo\trunk\apollo-website\src\documentation\getting-started.md
with uri: /documentation/getting-started.md => 
[INFO]     processing F:\hudson\hudson-slave\workspace\ActiveMQ-Apollo\trunk\apollo-website\src\documentation\index.page
with uri: /documentation/index.page => 
[INFO]     processing F:\hudson\hudson-slave\workspace\ActiveMQ-Apollo\trunk\apollo-website\src\documentation\management-api.md
with uri: /documentation/management-api.md => 
[INFO]     processing F:\hudson\hudson-slave\workspace\ActiveMQ-Apollo\trunk\apollo-website\src\documentation\module-organization.page
with uri: /documentation/module-organization.page => 
[INFO]     processing F:\hudson\hudson-slave\workspace\ActiveMQ-Apollo\trunk\apollo-website\src\documentation\performance-scaling.md
with uri: /documentation/performance-scaling.md => 
[INFO]     processing F:\hudson\hudson-slave\workspace\ActiveMQ-Apollo\trunk\apollo-website\src\documentation\user-manual.md
with uri: /documentation/user-manual.md => 
[INFO]     processing F:\hudson\hudson-slave\workspace\ActiveMQ-Apollo\trunk\apollo-website\src\documentation\verification.md
with uri: /documentation/verification.md => 
[INFO]     processing F:\hudson\hudson-slave\workspace\ActiveMQ-Apollo\trunk\apollo-website\src\download.page
with uri: /download.page => 
[INFO]     processing F:\hudson\hudson-slave\workspace\ActiveMQ-Apollo\trunk\apollo-website\src\index.page
with uri: /index.page => 
[INFO]     processing F:\hudson\hudson-slave\workspace\ActiveMQ-Apollo\trunk\apollo-website\src\privacy-policy.page
with uri: /privacy-policy.page => 
[INFO]     processing F:\hudson\hudson-slave\workspace\ActiveMQ-Apollo\trunk\apollo-website\src\versions\index.page
with uri: /versions/index.page => 
[INFO] 
[INFO] [INFO] Installing F:\hudson\hudson-slave\workspace\ActiveMQ-Apollo\trunk\apollo-website\pom.xml
to C:\Users\hudson\.m2\repository\org\apache\activemq\apollo-website\1.0-SNAPSHOT\apollo-website-1.0-SNAPSHOT.pom
--- maven-install-plugin:2.3.1:install (default-install) @ apollo-website ---
[JENKINS] Archiving disabled - not archiving F:\hudson\hudson-slave\workspace\ActiveMQ-Apollo\trunk\apollo-website\pom.xml
[INFO]                                                                         
[INFO] ------------------------------------------------------------------------
[INFO] Skipping apache-apollo
[INFO] This project has been banned from the build due to previous failures.
[INFO] ------------------------------------------------------------------------
[INFO]                                                                         
[INFO] ------------------------------------------------------------------------
[INFO] Building apollo-karaf-feature 1.0-SNAPSHOT
[INFO] ------------------------------------------------------------------------
[INFO] 
[INFO] --- maven-clean-plugin:2.4.1:clean (default-clean) @ apollo-karaf-feature ---
[INFO] 
[INFO] --- maven-enforcer-plugin:1.0:enforce (default) @ apollo-karaf-feature ---
[INFO] 
[INFO] --- maven-remote-resources-plugin:1.1:process (default) @ apollo-karaf-feature ---
[INFO] 
[INFO] --- maven-resources-plugin:2.4.3:resources (filter) @ apollo-karaf-feature ---
[INFO] Using 'UTF-8' encoding to copy filtered resources.
[INFO] Copying 1 resource
[INFO] Copying 3 resources
[INFO] 
[INFO] --- maven-site-plugin:3.0:attach-descriptor (attach-descriptor) @ apollo-karaf-feature
---
[INFO] 
[INFO] --- build-helper-maven-plugin:1.2:attach-artifact (attach-artifacts) @ apollo-karaf-feature
---
[INFO] [INFO] Installing F:\hudson\hudson-slave\workspace\ActiveMQ-Apollo\trunk\apollo-karaf-feature\pom.xml
to C:\Users\hudson\.m2\repository\org\apache\activemq\apollo-karaf-feature\1.0-SNAPSHOT\apollo-karaf-feature-1.0-SNAPSHOT.pom

[INFO] --- maven-install-plugin:2.3.1:install (default-install) @ apollo-karaf-feature ---
[INFO] Installing F:\hudson\hudson-slave\workspace\ActiveMQ-Apollo\trunk\apollo-karaf-feature\target\classes\features.xml
to C:\Users\hudson\.m2\repository\org\apache\activemq\apollo-karaf-feature\1.0-SNAPSHOT\apollo-karaf-feature-1.0-SNAPSHOT-features.xml
[JENKINS] Archiving disabled - not archiving F:\hudson\hudson-slave\workspace\ActiveMQ-Apollo\trunk\apollo-karaf-feature\pom.xml
[JENKINS] Archiving disabled - not archiving F:\hudson\hudson-slave\workspace\ActiveMQ-Apollo\trunk\apollo-karaf-feature\target\classes\features.xml
[INFO] ------------------------------------------------------------------------
[INFO] Reactor Summary:
[INFO] 
[INFO] Apache ActiveMQ Apollo Project .................... SUCCESS [7.093s]
[INFO] apollo-boot ....................................... SUCCESS [6.948s]
[INFO] apollo-scala ...................................... SUCCESS [1.663s]
[INFO] apollo-util ....................................... SUCCESS [54.376s]
[INFO] apollo-dto ........................................ SUCCESS [10.696s]
[INFO] apollo-selector ................................... SUCCESS [8.126s]
[INFO] apollo-broker ..................................... SUCCESS [1:02.295s]
[INFO] apollo-web ........................................ SUCCESS [58.992s]
[INFO] apollo-leveldb .................................... SUCCESS [53.827s]
[INFO] apollo-bdb ........................................ SUCCESS [35.289s]
[INFO] apollo-jdbm2 ...................................... SUCCESS [30.692s]
[INFO] apollo-stomp ...................................... FAILURE [16.260s]
[INFO] apollo-cli ........................................ SKIPPED
[INFO] apollo-website .................................... SUCCESS [36.435s]
[INFO] apache-apollo ..................................... SKIPPED
[INFO] apollo-karaf-feature .............................. SUCCESS [0.251s]
[INFO] ------------------------------------------------------------------------
[INFO] BUILD FAILURE
[INFO] ------------------------------------------------------------------------
[INFO] Total time: 6:24.311s
[INFO] Finished at: Tue Jan 17 20:54:04 GMT 2012
[INFO] Final Memory: 295M/1207M
[INFO] ------------------------------------------------------------------------
mavenExecutionResult exceptions not empty
message : Failed to execute goal org.scala-tools:maven-scala-plugin:2.15.2:compile (default)
on project apollo-stomp: wrap: org.apache.commons.exec.ExecuteException: Process exited with
an error: 1(Exit value: 1)
cause : wrap: org.apache.commons.exec.ExecuteException: Process exited with an error: 1(Exit
value: 1)
Stack trace : 
org.apache.maven.lifecycle.LifecycleExecutionException: Failed to execute goal org.scala-tools:maven-scala-plugin:2.15.2:compile
(default) on project apollo-stomp: wrap: org.apache.commons.exec.ExecuteException: Process
exited with an error: 1(Exit value: 1)
	at org.apache.maven.lifecycle.internal.MojoExecutor.execute(MojoExecutor.java:217)
	at org.apache.maven.lifecycle.internal.MojoExecutor.execute(MojoExecutor.java:153)
	at org.apache.maven.lifecycle.internal.MojoExecutor.execute(MojoExecutor.java:145)
	at org.apache.maven.lifecycle.internal.LifecycleModuleBuilder.buildProject(LifecycleModuleBuilder.java:84)
	at org.apache.maven.lifecycle.internal.LifecycleModuleBuilder.buildProject(LifecycleModuleBuilder.java:59)
	at org.apache.maven.lifecycle.internal.LifecycleStarter.singleThreadedBuild(LifecycleStarter.java:183)
	at org.apache.maven.lifecycle.internal.LifecycleStarter.execute(LifecycleStarter.java:161)
	at org.apache.maven.DefaultMaven.doExecute(DefaultMaven.java:319)
	at org.apache.maven.DefaultMaven.execute(DefaultMaven.java:156)
	at org.jvnet.hudson.maven3.launcher.Maven3Launcher.main(Maven3Launcher.java:79)
	at sun.reflect.NativeMethodAccessorImpl.invoke0(Native Method)
	at sun.reflect.NativeMethodAccessorImpl.invoke(NativeMethodAccessorImpl.java:39)
	at sun.reflect.DelegatingMethodAccessorImpl.invoke(DelegatingMethodAccessorImpl.java:25)
	at java.lang.reflect.Method.invoke(Method.java:597)
	at org.codehaus.plexus.classworlds.launcher.Launcher.launchStandard(Launcher.java:329)
	at org.codehaus.plexus.classworlds.launcher.Launcher.launch(Launcher.java:239)
	at org.jvnet.hudson.maven3.agent.Maven3Main.launch(Maven3Main.java:158)
	at hudson.maven.Maven3Builder.call(Maven3Builder.java:104)
	at hudson.maven.Maven3Builder.call(Maven3Builder.java:70)
	at hudson.remoting.UserRequest.perform(UserRequest.java:118)
	at hudson.remoting.UserRequest.perform(UserRequest.java:48)
	at hudson.remoting.Request$2.run(Request.java:287)
	at java.util.concurrent.Executors$RunnableAdapter.call(Executors.java:441)
	at java.util.concurrent.FutureTask$Sync.innerRun(FutureTask.java:303)
	at java.util.concurrent.FutureTask.run(FutureTask.java:138)
	at java.util.concurrent.ThreadPoolExecutor$Worker.runTask(ThreadPoolExecutor.java:886)
	at java.util.concurrent.ThreadPoolExecutor$Worker.run(ThreadPoolExecutor.java:908)
	at java.lang.Thread.run(Thread.java:662)
Caused by: org.apache.maven.plugin.MojoExecutionException: wrap: org.apache.commons.exec.ExecuteException:
Process exited with an error: 1(Exit value: 1)
	at org_scala_tools_maven.ScalaMojoSupport.execute(ScalaMojoSupport.java:350)
	at org.apache.maven.plugin.DefaultBuildPluginManager.executeMojo(DefaultBuildPluginManager.java:107)
	at org.apache.maven.lifecycle.internal.MojoExecutor.execute(MojoExecutor.java:209)
	... 27 more
Caused by: org.apache.commons.exec.ExecuteException: Process exited with an error: 1(Exit
value: 1)
	at org.apache.commons.exec.DefaultExecutor.executeInternal(DefaultExecutor.java:346)
	at org.apache.commons.exec.DefaultExecutor.execute(DefaultExecutor.java:149)
	at org.apache.commons.exec.DefaultExecutor.execute(DefaultExecutor.java:136)
	at org_scala_tools_maven_executions.JavaMainCallerByFork.run(JavaMainCallerByFork.java:80)
	at org_scala_tools_maven.ScalaCompilerSupport.compile(ScalaCompilerSupport.java:124)
	at org_scala_tools_maven.ScalaCompilerSupport.doExecute(ScalaCompilerSupport.java:80)
	at org_scala_tools_maven.ScalaMojoSupport.execute(ScalaMojoSupport.java:342)
	... 29 more
channel stopped


Mime
View raw message