activemq-commits mailing list archives

Site index · List index
Message view « Date » · « Thread »
Top « Date » · « Thread »
From Apache Jenkins Server <jenk...@builds.apache.org>
Subject Build failed in Jenkins: ActiveMQ-Apollo-Deploy #176
Date Fri, 09 Dec 2011 04:35:12 GMT
See <https://builds.apache.org/job/ActiveMQ-Apollo-Deploy/176/changes>

Changes:

[chirino] Fixes APLO-107 : Create an apollo-itests module and port some ActiveMQ 5.x tests
over to it

Patch provided by Stan Lewis.  Thanks!

[chirino] [maven-release-plugin] prepare for next development iteration

[chirino] [maven-release-plugin] prepare release apollo-project-1.0-beta6

[chirino] Small perf optimization.

[chirino] More tweaks to get APLO-96 more perfect.  We now doing swaps when fast consumers
are attached.

[chirino] Improve send performance of TCP transport by allowing writes to batch before they
get flushed.

[chirino] Fixes APLO-106: Odd reply-to headers do not cause errors

[chirino] Avoid creating a TreeSet if it's not needed or if the values are not sortable.

[chirino] A little follow on work to APLO-96, when a freshly enqueued message is marked as
prefetched also move to it the consumer memory space.

[chirino] Fixes APLO-104: Internal Server Error log message does not provide enough information

Also allow destination names to include a space.

[chirino] Fixes APLO-105 : Avoid NPE if the consumer has been closed.

[chirino] Prepping for a release.

------------------------------------------
[...truncated 6525 lines...]
Downloaded: http://repo1.maven.org/maven2/org/codehaus/plexus/plexus-archiver/1.1/plexus-archiver-1.1.pom
(2 KB at 6.5 KB/sec)
Downloading: http://repo.fusesource.com/nexus/content/groups/public/org/codehaus/plexus/plexus-io/1.0.1/plexus-io-1.0.1.pom
Downloading: http://scala-tools.org/repo-releases/org/codehaus/plexus/plexus-io/1.0.1/plexus-io-1.0.1.pom
Downloading: http://download.java.net/maven/2/org/codehaus/plexus/plexus-io/1.0.1/plexus-io-1.0.1.pom
Downloading: http://repo1.maven.org/maven2/org/codehaus/plexus/plexus-io/1.0.1/plexus-io-1.0.1.pom
Downloaded: http://repo1.maven.org/maven2/org/codehaus/plexus/plexus-io/1.0.1/plexus-io-1.0.1.pom
(2 KB at 3.7 KB/sec)
Downloading: http://repo.fusesource.com/nexus/content/groups/public/org/apache/maven/shared/maven-shared-io/1.1/maven-shared-io-1.1.pom
Downloading: http://scala-tools.org/repo-releases/org/apache/maven/shared/maven-shared-io/1.1/maven-shared-io-1.1.pom
Downloading: http://download.java.net/maven/2/org/apache/maven/shared/maven-shared-io/1.1/maven-shared-io-1.1.pom
Downloading: http://repo1.maven.org/maven2/org/apache/maven/shared/maven-shared-io/1.1/maven-shared-io-1.1.pom
Downloaded: http://repo1.maven.org/maven2/org/apache/maven/shared/maven-shared-io/1.1/maven-shared-io-1.1.pom
(4 KB at 13.0 KB/sec)
Downloading: http://repo.fusesource.com/nexus/content/groups/public/org/apache/maven/shared/maven-filtering/1.0/maven-filtering-1.0.pom
Downloading: http://scala-tools.org/repo-releases/org/apache/maven/shared/maven-filtering/1.0/maven-filtering-1.0.pom
Downloading: http://download.java.net/maven/2/org/apache/maven/shared/maven-filtering/1.0/maven-filtering-1.0.pom
Downloading: http://repo1.maven.org/maven2/org/apache/maven/shared/maven-filtering/1.0/maven-filtering-1.0.pom
Downloaded: http://repo1.maven.org/maven2/org/apache/maven/shared/maven-filtering/1.0/maven-filtering-1.0.pom
(6 KB at 18.4 KB/sec)
Downloading: http://repo.fusesource.com/nexus/content/groups/public/org/apache/maven/shared/maven-repository-builder/1.0-alpha-2/maven-repository-builder-1.0-alpha-2.pom
Downloading: http://scala-tools.org/repo-releases/org/apache/maven/shared/maven-repository-builder/1.0-alpha-2/maven-repository-builder-1.0-alpha-2.pom
Downloading: http://download.java.net/maven/2/org/apache/maven/shared/maven-repository-builder/1.0-alpha-2/maven-repository-builder-1.0-alpha-2.pom
Downloading: http://repo1.maven.org/maven2/org/apache/maven/shared/maven-repository-builder/1.0-alpha-2/maven-repository-builder-1.0-alpha-2.pom
Downloaded: http://repo1.maven.org/maven2/org/apache/maven/shared/maven-repository-builder/1.0-alpha-2/maven-repository-builder-1.0-alpha-2.pom
(4 KB at 10.3 KB/sec)
Downloading: http://repo.fusesource.com/nexus/content/groups/public/org/apache/maven/shared/maven-common-artifact-filters/1.0-alpha-1/maven-common-artifact-filters-1.0-alpha-1.pom
Downloading: http://scala-tools.org/repo-releases/org/apache/maven/shared/maven-common-artifact-filters/1.0-alpha-1/maven-common-artifact-filters-1.0-alpha-1.pom
Downloading: http://download.java.net/maven/2/org/apache/maven/shared/maven-common-artifact-filters/1.0-alpha-1/maven-common-artifact-filters-1.0-alpha-1.pom
Downloading: http://repo1.maven.org/maven2/org/apache/maven/shared/maven-common-artifact-filters/1.0-alpha-1/maven-common-artifact-filters-1.0-alpha-1.pom
Downloaded: http://repo1.maven.org/maven2/org/apache/maven/shared/maven-common-artifact-filters/1.0-alpha-1/maven-common-artifact-filters-1.0-alpha-1.pom
(2 KB at 5.7 KB/sec)
Downloading: http://repo.fusesource.com/nexus/content/groups/public/org/apache/maven/shared/maven-shared-components/6/maven-shared-components-6.pom
Downloading: http://scala-tools.org/repo-releases/org/apache/maven/shared/maven-shared-components/6/maven-shared-components-6.pom
Downloading: http://download.java.net/maven/2/org/apache/maven/shared/maven-shared-components/6/maven-shared-components-6.pom
Downloading: http://repo1.maven.org/maven2/org/apache/maven/shared/maven-shared-components/6/maven-shared-components-6.pom
Downloaded: http://repo1.maven.org/maven2/org/apache/maven/shared/maven-shared-components/6/maven-shared-components-6.pom
(4 KB at 9.9 KB/sec)
Downloading: http://repo.fusesource.com/nexus/content/groups/public/org/apache/maven/doxia/doxia-sink-api/1.1/doxia-sink-api-1.1.jar
Downloading: http://repo.fusesource.com/nexus/content/groups/public/org/apache/maven/shared/maven-common-artifact-filters/1.3/maven-common-artifact-filters-1.3.jar
Downloading: http://repo.fusesource.com/nexus/content/groups/public/org/codehaus/plexus/plexus-archiver/1.1/plexus-archiver-1.1.jar
Downloading: http://repo.fusesource.com/nexus/content/groups/public/org/apache/maven/shared/maven-shared-io/1.1/maven-shared-io-1.1.jar
Downloading: http://repo.fusesource.com/nexus/content/groups/public/org/apache/maven/shared/maven-filtering/1.0/maven-filtering-1.0.jar
Downloading: http://repo.fusesource.com/nexus/content/groups/public/org/codehaus/plexus/plexus-io/1.0.1/plexus-io-1.0.1.jar
Downloading: http://repo.fusesource.com/nexus/content/groups/public/org/apache/maven/shared/maven-repository-builder/1.0-alpha-2/maven-repository-builder-1.0-alpha-2.jar
Downloading: http://scala-tools.org/repo-releases/org/apache/maven/doxia/doxia-sink-api/1.1/doxia-sink-api-1.1.jar
Downloading: http://scala-tools.org/repo-releases/org/apache/maven/shared/maven-common-artifact-filters/1.3/maven-common-artifact-filters-1.3.jar
Downloading: http://scala-tools.org/repo-releases/org/apache/maven/shared/maven-shared-io/1.1/maven-shared-io-1.1.jar
Downloading: http://scala-tools.org/repo-releases/org/codehaus/plexus/plexus-archiver/1.1/plexus-archiver-1.1.jar
Downloading: http://scala-tools.org/repo-releases/org/apache/maven/shared/maven-filtering/1.0/maven-filtering-1.0.jar
Downloading: http://scala-tools.org/repo-releases/org/codehaus/plexus/plexus-io/1.0.1/plexus-io-1.0.1.jar
Downloading: http://scala-tools.org/repo-releases/org/apache/maven/shared/maven-repository-builder/1.0-alpha-2/maven-repository-builder-1.0-alpha-2.jar
Downloading: http://download.java.net/maven/2/org/apache/maven/doxia/doxia-sink-api/1.1/doxia-sink-api-1.1.jar
Downloading: http://download.java.net/maven/2/org/codehaus/plexus/plexus-archiver/1.1/plexus-archiver-1.1.jar
Downloading: http://download.java.net/maven/2/org/apache/maven/shared/maven-shared-io/1.1/maven-shared-io-1.1.jar
Downloading: http://download.java.net/maven/2/org/apache/maven/shared/maven-common-artifact-filters/1.3/maven-common-artifact-filters-1.3.jar
Downloading: http://download.java.net/maven/2/org/apache/maven/shared/maven-filtering/1.0/maven-filtering-1.0.jar
Downloading: http://download.java.net/maven/2/org/codehaus/plexus/plexus-io/1.0.1/plexus-io-1.0.1.jar
Downloading: http://download.java.net/maven/2/org/apache/maven/shared/maven-repository-builder/1.0-alpha-2/maven-repository-builder-1.0-alpha-2.jar
Downloading: http://repo1.maven.org/maven2/org/apache/maven/doxia/doxia-sink-api/1.1/doxia-sink-api-1.1.jar
Downloading: http://repo1.maven.org/maven2/org/apache/maven/shared/maven-common-artifact-filters/1.3/maven-common-artifact-filters-1.3.jar
Downloading: http://repo1.maven.org/maven2/org/apache/maven/shared/maven-shared-io/1.1/maven-shared-io-1.1.jar
Downloading: http://repo1.maven.org/maven2/org/codehaus/plexus/plexus-archiver/1.1/plexus-archiver-1.1.jar
Downloading: http://repo1.maven.org/maven2/org/apache/maven/shared/maven-filtering/1.0/maven-filtering-1.0.jar
Downloaded: http://repo1.maven.org/maven2/org/apache/maven/doxia/doxia-sink-api/1.1/doxia-sink-api-1.1.jar
(13 KB at 9.6 KB/sec)
Downloading: http://repo1.maven.org/maven2/org/codehaus/plexus/plexus-io/1.0.1/plexus-io-1.0.1.jar
Downloaded: http://repo1.maven.org/maven2/org/apache/maven/shared/maven-common-artifact-filters/1.3/maven-common-artifact-filters-1.3.jar
(31 KB at 19.4 KB/sec)
Downloading: http://repo1.maven.org/maven2/org/apache/maven/shared/maven-repository-builder/1.0-alpha-2/maven-repository-builder-1.0-alpha-2.jar
Downloaded: http://repo1.maven.org/maven2/org/apache/maven/shared/maven-shared-io/1.1/maven-shared-io-1.1.jar
(39 KB at 21.4 KB/sec)
Downloaded: http://repo1.maven.org/maven2/org/apache/maven/shared/maven-filtering/1.0/maven-filtering-1.0.jar
(42 KB at 20.4 KB/sec)
Downloaded: http://repo1.maven.org/maven2/org/codehaus/plexus/plexus-archiver/1.1/plexus-archiver-1.1.jar
(178 KB at 69.5 KB/sec)
Downloaded: http://repo1.maven.org/maven2/org/codehaus/plexus/plexus-io/1.0.1/plexus-io-1.0.1.jar
(50 KB at 28.2 KB/sec)
Downloaded: http://repo1.maven.org/maven2/org/apache/maven/shared/maven-repository-builder/1.0-alpha-2/maven-repository-builder-1.0-alpha-2.jar
(23 KB at 13.0 KB/sec)
[INFO] Reading assembly descriptor: <https://builds.apache.org/job/ActiveMQ-Apollo-Deploy/ws/trunk/apollo-distro/src/main/descriptors/unix-bin.xml>
[WARNING] Cannot include project artifact: org.apache.activemq:apache-apollo:pom:1.0-SNAPSHOT;
it doesn't have an associated file or directory.
[WARNING] Cannot include project artifact: org.apache.activemq:apache-apollo:pom:1.0-SNAPSHOT;
it doesn't have an associated file or directory.
[INFO] No files selected for line-ending conversion or filtering. Skipping: <https://builds.apache.org/job/ActiveMQ-Apollo-Deploy/ws/trunk/apollo-distro/..>
[INFO] Building tar : <https://builds.apache.org/job/ActiveMQ-Apollo-Deploy/ws/trunk/apollo-distro/target/apache-apollo-1.0-SNAPSHOT-unix-distro.tar.gz>
[INFO] [INFO] Reading assembly descriptor: <https://builds.apache.org/job/ActiveMQ-Apollo-Deploy/ws/trunk/apollo-distro/src/main/descriptors/windows-bin.xml>

[INFO] --- maven-assembly-plugin:2.2.1:single (windows-bin) @ apache-apollo ---[WARNING] Cannot
include project artifact: org.apache.activemq:apache-apollo:pom:1.0-SNAPSHOT; it doesn't have
an associated file or directory.

[WARNING] Cannot include project artifact: org.apache.activemq:apache-apollo:pom:1.0-SNAPSHOT;
it doesn't have an associated file or directory.
[INFO] No files selected for line-ending conversion or filtering. Skipping: <https://builds.apache.org/job/ActiveMQ-Apollo-Deploy/ws/trunk/apollo-distro/..>
[INFO] Building zip: <https://builds.apache.org/job/ActiveMQ-Apollo-Deploy/ws/trunk/apollo-distro/target/apache-apollo-1.0-SNAPSHOT-windows-distro.zip>
[INFO] [INFO] Installing <https://builds.apache.org/job/ActiveMQ-Apollo-Deploy/ws/trunk/apollo-distro/pom.xml>
to <https://builds.apache.org/job/ActiveMQ-Apollo-Deploy/ws/.repository/org/apache/activemq/apache-apollo/1.0-SNAPSHOT/apache-apollo-1.0-SNAPSHOT.pom>
[INFO] Installing <https://builds.apache.org/job/ActiveMQ-Apollo-Deploy/ws/trunk/apollo-distro/target/apache-apollo-1.0-SNAPSHOT-unix-distro.tar.gz>
to <https://builds.apache.org/job/ActiveMQ-Apollo-Deploy/ws/.repository/org/apache/activemq/apache-apollo/1.0-SNAPSHOT/apache-apollo-1.0-SNAPSHOT-unix-distro.tar.gz>

[INFO] [INFO] Installing <https://builds.apache.org/job/ActiveMQ-Apollo-Deploy/ws/trunk/apollo-distro/target/apache-apollo-1.0-SNAPSHOT-windows-distro.zip>
to <https://builds.apache.org/job/ActiveMQ-Apollo-Deploy/ws/.repository/org/apache/activemq/apache-apollo/1.0-SNAPSHOT/apache-apollo-1.0-SNAPSHOT-windows-distro.zip>
--- maven-install-plugin:2.3.1:install (default-install) @ apache-apollo ---
[INFO] Downloading: https://repository.apache.org/content/repositories/snapshots/org/apache/activemq/apache-apollo/1.0-SNAPSHOT/maven-metadata.xml

[INFO] --- maven-deploy-plugin:2.5:deploy (default-deploy) @ apache-apollo ---
Downloaded: https://repository.apache.org/content/repositories/snapshots/org/apache/activemq/apache-apollo/1.0-SNAPSHOT/maven-metadata.xml
(2 KB at 2.0 KB/sec)
Uploading: https://repository.apache.org/content/repositories/snapshots/org/apache/activemq/apache-apollo/1.0-SNAPSHOT/apache-apollo-1.0-20111209.043437-218.pom
Uploaded: https://repository.apache.org/content/repositories/snapshots/org/apache/activemq/apache-apollo/1.0-SNAPSHOT/apache-apollo-1.0-20111209.043437-218.pom
(6 KB at 27.2 KB/sec)
Downloading: https://repository.apache.org/content/repositories/snapshots/org/apache/activemq/apache-apollo/maven-metadata.xml
Downloaded: https://repository.apache.org/content/repositories/snapshots/org/apache/activemq/apache-apollo/maven-metadata.xml
(290 B at 2.7 KB/sec)
Uploading: https://repository.apache.org/content/repositories/snapshots/org/apache/activemq/apache-apollo/1.0-SNAPSHOT/maven-metadata.xml
Uploaded: https://repository.apache.org/content/repositories/snapshots/org/apache/activemq/apache-apollo/1.0-SNAPSHOT/maven-metadata.xml
(2 KB at 5.8 KB/sec)
Uploading: https://repository.apache.org/content/repositories/snapshots/org/apache/activemq/apache-apollo/maven-metadata.xml
Uploaded: https://repository.apache.org/content/repositories/snapshots/org/apache/activemq/apache-apollo/maven-metadata.xml
(290 B at 1.4 KB/sec)
Uploading: https://repository.apache.org/content/repositories/snapshots/org/apache/activemq/apache-apollo/1.0-SNAPSHOT/apache-apollo-1.0-20111209.043437-218-unix-distro.tar.gz
Uploaded: https://repository.apache.org/content/repositories/snapshots/org/apache/activemq/apache-apollo/1.0-SNAPSHOT/apache-apollo-1.0-20111209.043437-218-unix-distro.tar.gz
(19774 KB at 2615.9 KB/sec)
Uploading: https://repository.apache.org/content/repositories/snapshots/org/apache/activemq/apache-apollo/1.0-SNAPSHOT/maven-metadata.xml
Uploaded: https://repository.apache.org/content/repositories/snapshots/org/apache/activemq/apache-apollo/1.0-SNAPSHOT/maven-metadata.xml
(2 KB at 6.1 KB/sec)
Uploading: https://repository.apache.org/content/repositories/snapshots/org/apache/activemq/apache-apollo/1.0-SNAPSHOT/apache-apollo-1.0-20111209.043437-218-windows-distro.zip
Uploaded: https://repository.apache.org/content/repositories/snapshots/org/apache/activemq/apache-apollo/1.0-SNAPSHOT/apache-apollo-1.0-20111209.043437-218-windows-distro.zip
(19846 KB at 5897.7 KB/sec)
Uploading: https://repository.apache.org/content/repositories/snapshots/org/apache/activemq/apache-apollo/1.0-SNAPSHOT/maven-metadata.xml
Uploaded: https://repository.apache.org/content/repositories/snapshots/org/apache/activemq/apache-apollo/1.0-SNAPSHOT/maven-metadata.xml
(2 KB at 5.4 KB/sec)
[JENKINS] Archiving disabled - not archiving <https://builds.apache.org/job/ActiveMQ-Apollo-Deploy/ws/trunk/apollo-distro/pom.xml>
[JENKINS] Archiving disabled - not archiving <https://builds.apache.org/job/ActiveMQ-Apollo-Deploy/ws/trunk/apollo-distro/target/apache-apollo-1.0-SNAPSHOT-unix-distro.tar.gz>
[JENKINS] Archiving disabled - not archiving <https://builds.apache.org/job/ActiveMQ-Apollo-Deploy/ws/trunk/apollo-distro/target/apache-apollo-1.0-SNAPSHOT-windows-distro.zip>
[INFO] Downloading: http://repo.fusesource.com/nexus/content/groups/public/org/codehaus/mojo/build-helper-maven-plugin/1.2/build-helper-maven-plugin-1.2.pom
                                                                        
[INFO] ------------------------------------------------------------------------
[INFO] Building apollo-karaf-feature 1.0-SNAPSHOT
[INFO] ------------------------------------------------------------------------
Downloading: http://scala-tools.org/repo-releases/org/codehaus/mojo/build-helper-maven-plugin/1.2/build-helper-maven-plugin-1.2.pom
Downloading: http://download.java.net/maven/2/org/codehaus/mojo/build-helper-maven-plugin/1.2/build-helper-maven-plugin-1.2.pom
Downloading: http://repo1.maven.org/maven2/org/codehaus/mojo/build-helper-maven-plugin/1.2/build-helper-maven-plugin-1.2.pom
Downloaded: http://repo1.maven.org/maven2/org/codehaus/mojo/build-helper-maven-plugin/1.2/build-helper-maven-plugin-1.2.pom
(3 KB at 7.8 KB/sec)
Downloading: http://repo.fusesource.com/nexus/content/groups/public/org/codehaus/mojo/build-helper-maven-plugin/1.2/build-helper-maven-plugin-1.2.jar
Downloading: http://scala-tools.org/repo-releases/org/codehaus/mojo/build-helper-maven-plugin/1.2/build-helper-maven-plugin-1.2.jar
Downloading: http://download.java.net/maven/2/org/codehaus/mojo/build-helper-maven-plugin/1.2/build-helper-maven-plugin-1.2.jar
Downloading: http://repo1.maven.org/maven2/org/codehaus/mojo/build-helper-maven-plugin/1.2/build-helper-maven-plugin-1.2.jar
Downloaded: http://repo1.maven.org/maven2/org/codehaus/mojo/build-helper-maven-plugin/1.2/build-helper-maven-plugin-1.2.jar
(11 KB at 33.5 KB/sec)
[INFO] 
[INFO] --- maven-clean-plugin:2.4.1:clean (default-clean) @ apollo-karaf-feature ---
[INFO] 
[INFO] --- maven-enforcer-plugin:1.0:enforce (default) @ apollo-karaf-feature ---
[INFO] 
[INFO] --- maven-remote-resources-plugin:1.1:process (default) @ apollo-karaf-feature ---
[INFO] [INFO] Using 'UTF-8' encoding to copy filtered resources.
[INFO] Copying 1 resource
[INFO] Copying 3 resources

[INFO] --- maven-resources-plugin:2.4.3:resources (filter) @ apollo-karaf-feature ---
[INFO] Downloading: http://repo.fusesource.com/nexus/content/groups/public/org/apache/maven/maven-project/2.0.2/maven-project-2.0.2.pom

[INFO] --- build-helper-maven-plugin:1.2:attach-artifact (attach-artifacts) @ apollo-karaf-feature
---
Downloaded: http://repo.fusesource.com/nexus/content/groups/public/org/apache/maven/maven-project/2.0.2/maven-project-2.0.2.pom
(2 KB at 1.9 KB/sec)
Downloading: http://repo.fusesource.com/nexus/content/groups/public/org/apache/maven/maven-profile/2.0.2/maven-profile-2.0.2.pom
Downloaded: http://repo.fusesource.com/nexus/content/groups/public/org/apache/maven/maven-profile/2.0.2/maven-profile-2.0.2.pom
(2 KB at 1.6 KB/sec)
Downloading: http://repo.fusesource.com/nexus/content/groups/public/org/apache/maven/maven-model/2.0.2/maven-model-2.0.2.pom
Downloaded: http://repo.fusesource.com/nexus/content/groups/public/org/apache/maven/maven-model/2.0.2/maven-model-2.0.2.pom
(3 KB at 1.9 KB/sec)
Downloading: http://repo.fusesource.com/nexus/content/groups/public/org/codehaus/plexus/plexus-utils/1.1/plexus-utils-1.1.jar
Downloaded: http://repo.fusesource.com/nexus/content/groups/public/org/codehaus/plexus/plexus-utils/1.1/plexus-utils-1.1.jar
(165 KB at 142.8 KB/sec)
[INFO] Installing <https://builds.apache.org/job/ActiveMQ-Apollo-Deploy/ws/trunk/apollo-karaf-feature/pom.xml>
to <https://builds.apache.org/job/ActiveMQ-Apollo-Deploy/ws/.repository/org/apache/activemq/apollo-karaf-feature/1.0-SNAPSHOT/apollo-karaf-feature-1.0-SNAPSHOT.pom>
[INFO] [INFO] Installing <https://builds.apache.org/job/ActiveMQ-Apollo-Deploy/ws/trunk/apollo-karaf-feature/target/classes/features.xml>
to <https://builds.apache.org/job/ActiveMQ-Apollo-Deploy/ws/.repository/org/apache/activemq/apollo-karaf-feature/1.0-SNAPSHOT/apollo-karaf-feature-1.0-SNAPSHOT-features.xml>

[INFO] --- maven-install-plugin:2.3.1:install (default-install) @ apollo-karaf-feature ---
[INFO] Downloading: https://repository.apache.org/content/repositories/snapshots/org/apache/activemq/apollo-karaf-feature/1.0-SNAPSHOT/maven-metadata.xml

[INFO] --- maven-deploy-plugin:2.5:deploy (default-deploy) @ apollo-karaf-feature ---
Downloaded: https://repository.apache.org/content/repositories/snapshots/org/apache/activemq/apollo-karaf-feature/1.0-SNAPSHOT/maven-metadata.xml
(831 B at 3.6 KB/sec)
Uploading: https://repository.apache.org/content/repositories/snapshots/org/apache/activemq/apollo-karaf-feature/1.0-SNAPSHOT/apollo-karaf-feature-1.0-20111209.043501-139.pom
Uploaded: https://repository.apache.org/content/repositories/snapshots/org/apache/activemq/apollo-karaf-feature/1.0-SNAPSHOT/apollo-karaf-feature-1.0-20111209.043501-139.pom
(3 KB at 14.7 KB/sec)
Downloading: https://repository.apache.org/content/repositories/snapshots/org/apache/activemq/apollo-karaf-feature/maven-metadata.xml
Downloaded: https://repository.apache.org/content/repositories/snapshots/org/apache/activemq/apollo-karaf-feature/maven-metadata.xml
(297 B at 2.5 KB/sec)
Uploading: https://repository.apache.org/content/repositories/snapshots/org/apache/activemq/apollo-karaf-feature/1.0-SNAPSHOT/maven-metadata.xml
Uploaded: https://repository.apache.org/content/repositories/snapshots/org/apache/activemq/apollo-karaf-feature/1.0-SNAPSHOT/maven-metadata.xml
(831 B at 4.9 KB/sec)
Uploading: https://repository.apache.org/content/repositories/snapshots/org/apache/activemq/apollo-karaf-feature/maven-metadata.xml
Uploaded: https://repository.apache.org/content/repositories/snapshots/org/apache/activemq/apollo-karaf-feature/maven-metadata.xml
(297 B at 1.5 KB/sec)
Uploading: https://repository.apache.org/content/repositories/snapshots/org/apache/activemq/apollo-karaf-feature/1.0-SNAPSHOT/apollo-karaf-feature-1.0-20111209.043501-139-features.xml
Uploaded: https://repository.apache.org/content/repositories/snapshots/org/apache/activemq/apollo-karaf-feature/1.0-SNAPSHOT/apollo-karaf-feature-1.0-20111209.043501-139-features.xml
(4 KB at 10.6 KB/sec)
Uploading: https://repository.apache.org/content/repositories/snapshots/org/apache/activemq/apollo-karaf-feature/1.0-SNAPSHOT/maven-metadata.xml
Uploaded: https://repository.apache.org/content/repositories/snapshots/org/apache/activemq/apollo-karaf-feature/1.0-SNAPSHOT/maven-metadata.xml
(831 B at 4.2 KB/sec)
[JENKINS] Archiving disabled - not archiving <https://builds.apache.org/job/ActiveMQ-Apollo-Deploy/ws/trunk/apollo-karaf-feature/pom.xml>
[JENKINS] Archiving disabled - not archiving <https://builds.apache.org/job/ActiveMQ-Apollo-Deploy/ws/trunk/apollo-karaf-feature/target/classes/features.xml>
[INFO] ------------------------------------------------------------------------
[INFO] Reactor Summary:
[INFO] 
[INFO] Apache ActiveMQ Apollo Project .................... SUCCESS [4:23.598s]
[INFO] apollo-boot ....................................... SUCCESS [1:05.278s]
[INFO] apollo-scala ...................................... SUCCESS [1:36.891s]
[INFO] apollo-util ....................................... SUCCESS [1:06.904s]
[INFO] apollo-transport .................................. SUCCESS [10.442s]
[INFO] apollo-dto ........................................ SUCCESS [58.734s]
[INFO] apollo-selector ................................... SUCCESS [1:03.121s]
[INFO] apollo-broker ..................................... SUCCESS [2:13.407s]
[INFO] apollo-tcp ........................................ SUCCESS [1:26.632s]
[INFO] apollo-web ........................................ SUCCESS [2:32.099s]
[INFO] apollo-leveldb .................................... SUCCESS [57.185s]
[INFO] apollo-bdb ........................................ SUCCESS [51.606s]
[INFO] apollo-jdbm2 ...................................... SUCCESS [29.459s]
[INFO] apollo-stomp ...................................... SUCCESS [55.194s]
[INFO] apollo-cli ........................................ SUCCESS [2:02.904s]
[INFO] apollo-website .................................... SUCCESS [55.832s]
[INFO] apollo-itests ..................................... FAILURE [12.883s]
[INFO] apache-apollo ..................................... SUCCESS [52.991s]
[INFO] apollo-karaf-feature .............................. SUCCESS [12.988s]
[INFO] ------------------------------------------------------------------------
[INFO] BUILD FAILURE
[INFO] ------------------------------------------------------------------------
[INFO] Total time: 25:12.160s
[INFO] Finished at: Fri Dec 09 04:35:03 UTC 2011
[INFO] Final Memory: 324M/1000M
[INFO] ------------------------------------------------------------------------
mavenExecutionResult exceptions not empty
message : Failed to execute goal on project apollo-itests: Could not resolve dependencies
for project org.apache.activemq:apollo-itests:jar:1.0-SNAPSHOT: Could not find artifact org.fusesource.stompjms:stompjms-client:jar:1.4-SNAPSHOT
in Nexus (http://repository.apache.org/snapshots)
cause : Could not resolve dependencies for project org.apache.activemq:apollo-itests:jar:1.0-SNAPSHOT:
Could not find artifact org.fusesource.stompjms:stompjms-client:jar:1.4-SNAPSHOT in Nexus
(http://repository.apache.org/snapshots)
Stack trace : 
org.apache.maven.lifecycle.LifecycleExecutionException: Failed to execute goal on project
apollo-itests: Could not resolve dependencies for project org.apache.activemq:apollo-itests:jar:1.0-SNAPSHOT:
Could not find artifact org.fusesource.stompjms:stompjms-client:jar:1.4-SNAPSHOT in Nexus
(http://repository.apache.org/snapshots)
	at org.apache.maven.lifecycle.internal.LifecycleDependencyResolver.getDependencies(LifecycleDependencyResolver.java:190)
	at org.apache.maven.lifecycle.internal.LifecycleDependencyResolver.resolveProjectDependencies(LifecycleDependencyResolver.java:104)
	at org.apache.maven.lifecycle.internal.MojoExecutor.ensureDependenciesAreResolved(MojoExecutor.java:258)
	at org.apache.maven.lifecycle.internal.MojoExecutor.execute(MojoExecutor.java:201)
	at org.apache.maven.lifecycle.internal.MojoExecutor.execute(MojoExecutor.java:153)
	at org.apache.maven.lifecycle.internal.MojoExecutor.execute(MojoExecutor.java:145)
	at org.apache.maven.lifecycle.internal.LifecycleModuleBuilder.buildProject(LifecycleModuleBuilder.java:84)
	at org.apache.maven.lifecycle.internal.LifecycleModuleBuilder.buildProject(LifecycleModuleBuilder.java:59)
	at org.apache.maven.lifecycle.internal.LifecycleStarter.singleThreadedBuild(LifecycleStarter.java:183)
	at org.apache.maven.lifecycle.internal.LifecycleStarter.execute(LifecycleStarter.java:161)
	at org.apache.maven.DefaultMaven.doExecute(DefaultMaven.java:319)
	at org.apache.maven.DefaultMaven.execute(DefaultMaven.java:156)
	at org.jvnet.hudson.maven3.launcher.Maven3Launcher.main(Maven3Launcher.java:79)
	at sun.reflect.NativeMethodAccessorImpl.invoke0(Native Method)
	at sun.reflect.NativeMethodAccessorImpl.invoke(NativeMethodAccessorImpl.java:39)
	at sun.reflect.DelegatingMethodAccessorImpl.invoke(DelegatingMethodAccessorImpl.java:25)
	at java.lang.reflect.Method.invoke(Method.java:597)
	at org.codehaus.plexus.classworlds.launcher.Launcher.launchStandard(Launcher.java:329)
	at org.codehaus.plexus.classworlds.launcher.Launcher.launch(Launcher.java:239)
	at org.jvnet.hudson.maven3.agent.Maven3Main.launch(Maven3Main.java:158)
	at hudson.maven.Maven3Builder.call(Maven3Builder.java:122)
	at hudson.maven.Maven3Builder.call(Maven3Builder.java:74)
	at hudson.remoting.UserRequest.perform(UserRequest.java:118)
	at hudson.remoting.UserRequest.perform(UserRequest.java:48)
	at hudson.remoting.Request$2.run(Request.java:287)
	at java.util.concurrent.Executors$RunnableAdapter.call(Executors.java:441)
	at java.util.concurrent.FutureTask$Sync.innerRun(FutureTask.java:303)
	at java.util.concurrent.FutureTask.run(FutureTask.java:138)
	at java.util.concurrent.ThreadPoolExecutor$Worker.runTask(ThreadPoolExecutor.java:886)
	at java.util.concurrent.ThreadPoolExecutor$Worker.run(ThreadPoolExecutor.java:908)
	at java.lang.Thread.run(Thread.java:662)
Caused by: org.apache.maven.project.DependencyResolutionException: Could not resolve dependencies
for project org.apache.activemq:apollo-itests:jar:1.0-SNAPSHOT: Could not find artifact org.fusesource.stompjms:stompjms-client:jar:1.4-SNAPSHOT
in Nexus (http://repository.apache.org/snapshots)
	at org.apache.maven.project.DefaultProjectDependenciesResolver.resolve(DefaultProjectDependenciesResolver.java:156)
	at org.apache.maven.lifecycle.internal.LifecycleDependencyResolver.getDependencies(LifecycleDependencyResolver.java:165)
	... 30 more
Caused by: org.sonatype.aether.resolution.ArtifactResolutionException: Could not find artifact
org.fusesource.stompjms:stompjms-client:jar:1.4-SNAPSHOT in Nexus (http://repository.apache.org/snapshots)
	at org.sonatype.aether.impl.internal.DefaultArtifactResolver.resolveArtifacts(DefaultArtifactResolver.java:526)
	at org.sonatype.aether.impl.internal.DefaultRepositorySystem.resolveArtifacts(DefaultRepositorySystem.java:304)
	at org.sonatype.aether.impl.internal.DefaultRepositorySystem.resolveDependencies(DefaultRepositorySystem.java:334)
	at org.apache.maven.project.DefaultProjectDependenciesResolver.resolve(DefaultProjectDependenciesResolver.java:150)
	... 31 more
Caused by: org.sonatype.aether.transfer.ArtifactNotFoundException: Could not find artifact
org.fusesource.stompjms:stompjms-client:jar:1.4-SNAPSHOT in Nexus (http://repository.apache.org/snapshots)
	at org.sonatype.aether.connector.wagon.WagonRepositoryConnector$4.wrap(WagonRepositoryConnector.java:945)
	at org.sonatype.aether.connector.wagon.WagonRepositoryConnector$4.wrap(WagonRepositoryConnector.java:940)
	at org.sonatype.aether.connector.wagon.WagonRepositoryConnector$GetTask.flush(WagonRepositoryConnector.java:696)
	at org.sonatype.aether.connector.wagon.WagonRepositoryConnector$GetTask.flush(WagonRepositoryConnector.java:690)
	at org.sonatype.aether.connector.wagon.WagonRepositoryConnector.get(WagonRepositoryConnector.java:435)
	at org.sonatype.aether.impl.internal.DefaultArtifactResolver.resolveArtifacts(DefaultArtifactResolver.java:438)
	... 34 more
Sending e-mails to: commits@activemq.apache.org
channel stopped
IRC notifier plugin: Sending notification to: #activemq


Mime
View raw message