activemq-commits mailing list archives

Site index · List index
Message view « Date » · « Thread »
Top « Date » · « Thread »
From Apache Jenkins Server <jenk...@builds.apache.org>
Subject Build failed in Jenkins: ActiveMQ-Apollo #489
Date Mon, 12 Dec 2011 23:09:37 GMT
See <https://builds.apache.org/job/ActiveMQ-Apollo/489/>

------------------------------------------
[...truncated 3602 lines...]
[WARNING] No source files found.
[INFO] 
[INFO] --- maven-enforcer-plugin:1.0:enforce (default) @ apollo-website ---
[JENKINS] Archiving disabled - not archiving F:\hudson\hudson-slave\workspace\ActiveMQ-Apollo\trunk\apollo-website\pom.xml
ignoring exception during new ExecutedMojo null
[INFO] 
[INFO] --- maven-source-plugin:2.1.2:jar (attach-sources) @ apollo-website ---
[INFO] 
[INFO] --- maven-enforcer-plugin:1.0:enforce (default) @ apollo-website ---
[INFO] 
[INFO] --- maven-antrun-plugin:1.7:run (default) @ apollo-website ---
[WARNING] Parameter tasks is deprecated, use target instead
[INFO] Executing tasks

main:
[schemagen] Generating schema from 64 source files
Note: Writing F:\hudson\hudson-slave\workspace\ActiveMQ-Apollo\trunk\apollo-website\target\sitegen\documentation\schema\apollo.xsd
[INFO] Executed tasks
[INFO] 
[INFO] --- maven-remote-resources-plugin:1.1:process (default) @ apollo-website ---
[INFO] 
[INFO] --- maven-scala-plugin:2.15.2:compile (default) @ apollo-website ---
[INFO] Checking for multiple versions of scala
[INFO] includes = [**/*.scala,**/*.java,]
[INFO] excludes = []
[INFO] Nothing to compile - all classes are up to date
[INFO] 
[INFO] --- maven-scala-plugin:2.15.2:testCompile (default) @ apollo-website ---
[INFO] Checking for multiple versions of scala
[INFO] includes = [**/*.scala,**/*.java,]
[INFO] excludes = []
[WARNING] No source files found.
[INFO] 
[INFO] --- maven-enforcer-plugin:1.0:enforce (default) @ apollo-website ---
[JENKINS] Archiving disabled - not archiving F:\hudson\hudson-slave\workspace\ActiveMQ-Apollo\trunk\apollo-website\pom.xml
ignoring exception during new ExecutedMojo null
[INFO] 
[INFO] --- maven-source-plugin:2.1.2:jar (attach-sources) @ apollo-website ---
[JENKINS] Archiving disabled - not archiving F:\hudson\hudson-slave\workspace\ActiveMQ-Apollo\trunk\apollo-website\pom.xml
ignoring exception during new ExecutedMojo null
[INFO] 
[INFO] --- maven-scalate-plugin:1.5.3:sitegen (sitegen) @ apollo-website ---
Processing Configuration for child elements
Processing child [project]
Processing child [workingDirectory]
Processing child [webappDirectory]
Processing child [targetDirectory]
Processing child [testClassPathElements]
[INFO] Generating static website from Scalate Templates and wiki files...
[INFO] template properties: null
Using dir: F:\hudson\hudson-slave\workspace\ActiveMQ-Apollo\trunk\apollo-website\src\blog
at request path: /blog
[INFO]     processing F:\hudson\hudson-slave\workspace\ActiveMQ-Apollo\trunk\apollo-website\src\blog\index.page
with uri: /blog/index.page => 
Using dir: F:\hudson\hudson-slave\workspace\ActiveMQ-Apollo\trunk\apollo-website\src\blog
at request path: /blog
[INFO]     processing F:\hudson\hudson-slave\workspace\ActiveMQ-Apollo\trunk\apollo-website\src\blog\index.rss.feed
with uri: /blog/index.rss.feed => 
[INFO]     processing F:\hudson\hudson-slave\workspace\ActiveMQ-Apollo\trunk\apollo-website\src\blog\releases\release-1-0-beta1.page
with uri: /blog/releases/release-1-0-beta1.page => 
[INFO]     processing F:\hudson\hudson-slave\workspace\ActiveMQ-Apollo\trunk\apollo-website\src\blog\releases\release-1-0-beta2.page
with uri: /blog/releases/release-1-0-beta2.page => 
[INFO]     processing F:\hudson\hudson-slave\workspace\ActiveMQ-Apollo\trunk\apollo-website\src\blog\releases\release-1-0-beta3.page
with uri: /blog/releases/release-1-0-beta3.page => 
[INFO]     processing F:\hudson\hudson-slave\workspace\ActiveMQ-Apollo\trunk\apollo-website\src\blog\releases\release-1-0-beta4.page
with uri: /blog/releases/release-1-0-beta4.page => 
[INFO]     processing F:\hudson\hudson-slave\workspace\ActiveMQ-Apollo\trunk\apollo-website\src\blog\releases\release-1-0-beta5.page
with uri: /blog/releases/release-1-0-beta5.page => 
[INFO]     processing F:\hudson\hudson-slave\workspace\ActiveMQ-Apollo\trunk\apollo-website\src\blog\releases\release-1-0-beta6.page
with uri: /blog/releases/release-1-0-beta6.page => 
[INFO]     processing F:\hudson\hudson-slave\workspace\ActiveMQ-Apollo\trunk\apollo-website\src\community\building.page
with uri: /community/building.page => 
[INFO]     processing F:\hudson\hudson-slave\workspace\ActiveMQ-Apollo\trunk\apollo-website\src\community\contributing.page
with uri: /community/contributing.page => 
[INFO]     processing F:\hudson\hudson-slave\workspace\ActiveMQ-Apollo\trunk\apollo-website\src\community\developers.page
with uri: /community/developers.page => 
[INFO]     processing F:\hudson\hudson-slave\workspace\ActiveMQ-Apollo\trunk\apollo-website\src\community\faq.page
with uri: /community/faq.page => 
[INFO]     processing F:\hudson\hudson-slave\workspace\ActiveMQ-Apollo\trunk\apollo-website\src\community\index.page
with uri: /community/index.page => 
[INFO]     processing F:\hudson\hudson-slave\workspace\ActiveMQ-Apollo\trunk\apollo-website\src\community\release-guide.page
with uri: /community/release-guide.page => 
[INFO]     processing F:\hudson\hudson-slave\workspace\ActiveMQ-Apollo\trunk\apollo-website\src\community\site.page
with uri: /community/site.page => 
[INFO]     processing F:\hudson\hudson-slave\workspace\ActiveMQ-Apollo\trunk\apollo-website\src\community\source.page
with uri: /community/source.page => 
[INFO]     processing F:\hudson\hudson-slave\workspace\ActiveMQ-Apollo\trunk\apollo-website\src\community\support.page
with uri: /community/support.page => 
[INFO]     processing F:\hudson\hudson-slave\workspace\ActiveMQ-Apollo\trunk\apollo-website\src\documentation\architecture.md
with uri: /documentation/architecture.md => 
[INFO]     processing F:\hudson\hudson-slave\workspace\ActiveMQ-Apollo\trunk\apollo-website\src\documentation\extending-guide.md
with uri: /documentation/extending-guide.md => 
[INFO]     processing F:\hudson\hudson-slave\workspace\ActiveMQ-Apollo\trunk\apollo-website\src\documentation\getting-started.md
with uri: /documentation/getting-started.md => 
[INFO]     processing F:\hudson\hudson-slave\workspace\ActiveMQ-Apollo\trunk\apollo-website\src\documentation\index.page
with uri: /documentation/index.page => 
[INFO]     processing F:\hudson\hudson-slave\workspace\ActiveMQ-Apollo\trunk\apollo-website\src\documentation\management-api.md
with uri: /documentation/management-api.md => 
[INFO]     processing F:\hudson\hudson-slave\workspace\ActiveMQ-Apollo\trunk\apollo-website\src\documentation\module-organization.page
with uri: /documentation/module-organization.page => 
[INFO]     processing F:\hudson\hudson-slave\workspace\ActiveMQ-Apollo\trunk\apollo-website\src\documentation\performance-scaling.md
with uri: /documentation/performance-scaling.md => 
[INFO]     processing F:\hudson\hudson-slave\workspace\ActiveMQ-Apollo\trunk\apollo-website\src\documentation\user-manual.md
with uri: /documentation/user-manual.md => 
[INFO]     processing F:\hudson\hudson-slave\workspace\ActiveMQ-Apollo\trunk\apollo-website\src\documentation\verification.md
with uri: /documentation/verification.md => 
[INFO]     processing F:\hudson\hudson-slave\workspace\ActiveMQ-Apollo\trunk\apollo-website\src\download.page
with uri: /download.page => 
[INFO]     processing F:\hudson\hudson-slave\workspace\ActiveMQ-Apollo\trunk\apollo-website\src\index.page
with uri: /index.page => 
[INFO]     processing F:\hudson\hudson-slave\workspace\ActiveMQ-Apollo\trunk\apollo-website\src\privacy-policy.page
with uri: /privacy-policy.page => 
[INFO]     processing F:\hudson\hudson-slave\workspace\ActiveMQ-Apollo\trunk\apollo-website\src\versions\index.page
with uri: /versions/index.page => 
[INFO] 
[INFO] --- maven-install-plugin:2.3.1:install (default-install) @ apollo-website ---
[INFO] Installing F:\hudson\hudson-slave\workspace\ActiveMQ-Apollo\trunk\apollo-website\pom.xml
to C:\Users\hudson\.m2\repository\org\apache\activemq\apollo-website\1.0-SNAPSHOT\apollo-website-1.0-SNAPSHOT.pom
[JENKINS] Archiving disabled - not archiving F:\hudson\hudson-slave\workspace\ActiveMQ-Apollo\trunk\apollo-website\pom.xml
[INFO]                                                                         
[INFO] ------------------------------------------------------------------------
[INFO] Building apollo-itests 1.0-SNAPSHOT
[INFO] ------------------------------------------------------------------------
Downloading: http://repo.fusesource.com/nexus/content/groups/public-snapshots/org/fusesource/stompjms/stompjms-client/1.4-SNAPSHOT/maven-metadata.xml
Downloading: http://repository.apache.org/snapshots/org/fusesource/stompjms/stompjms-client/1.4-SNAPSHOT/maven-metadata.xml
Downloading: http://download.oracle.com/maven/org/fusesource/stompjms/stompjms-client/1.4-SNAPSHOT/maven-metadata.xml
Downloading: http://scala-tools.org/repo-snapshots/org/fusesource/stompjms/stompjms-client/1.4-SNAPSHOT/maven-metadata.xml
Downloading: https://oss.sonatype.org/content/repositories/ops4j-snapshots/org/fusesource/stompjms/stompjms-client/1.4-SNAPSHOT/maven-metadata.xml
Downloading: http://repository.apache.org/snapshots/org/fusesource/stompjms/stompjms-client/1.4-SNAPSHOT/stompjms-client-1.4-SNAPSHOT.pom
Downloading: http://repo.fusesource.com/nexus/content/groups/public-snapshots/org/fusesource/stompjms/stompjms-client/1.4-SNAPSHOT/stompjms-client-1.4-SNAPSHOT.pom
Downloading: http://scala-tools.org/repo-snapshots/org/fusesource/stompjms/stompjms-client/1.4-SNAPSHOT/stompjms-client-1.4-SNAPSHOT.pom
Downloading: http://download.oracle.com/maven/org/fusesource/stompjms/stompjms-client/1.4-SNAPSHOT/stompjms-client-1.4-SNAPSHOT.pom
Downloading: https://oss.sonatype.org/content/repositories/ops4j-snapshots/org/fusesource/stompjms/stompjms-client/1.4-SNAPSHOT/stompjms-client-1.4-SNAPSHOT.pom
[WARNING] The POM for org.fusesource.stompjms:stompjms-client:jar:1.4-SNAPSHOT is missing,
no dependency information available
Downloading: http://repository.apache.org/snapshots/org/fusesource/stompjms/stompjms-client/1.4-SNAPSHOT/stompjms-client-1.4-SNAPSHOT.jar
Downloading: http://repo.fusesource.com/nexus/content/groups/public-snapshots/org/fusesource/stompjms/stompjms-client/1.4-SNAPSHOT/stompjms-client-1.4-SNAPSHOT.jar
Downloading: http://scala-tools.org/repo-snapshots/org/fusesource/stompjms/stompjms-client/1.4-SNAPSHOT/stompjms-client-1.4-SNAPSHOT.jar
Downloading: http://download.oracle.com/maven/org/fusesource/stompjms/stompjms-client/1.4-SNAPSHOT/stompjms-client-1.4-SNAPSHOT.jar
Downloading: https://oss.sonatype.org/content/repositories/ops4j-snapshots/org/fusesource/stompjms/stompjms-client/1.4-SNAPSHOT/stompjms-client-1.4-SNAPSHOT.jar
[JENKINS] Archiving disabled - not archiving F:\hudson\hudson-slave\workspace\ActiveMQ-Apollo\trunk\apollo-itests\pom.xml
[INFO]                                                                         
[INFO] ------------------------------------------------------------------------
[INFO] Building apache-apollo 1.0-SNAPSHOT
[INFO] ------------------------------------------------------------------------
[INFO] 
[INFO] --- maven-clean-plugin:2.4.1:clean (default-clean) @ apache-apollo ---
[INFO] 
[INFO] --- maven-enforcer-plugin:1.0:enforce (default) @ apache-apollo ---
[INFO] 
[INFO] --- maven-remote-resources-plugin:1.1:process (default) @ apache-apollo ---
[INFO] 
[INFO] --- maven-assembly-plugin:2.2.1:single (unix-bin) @ apache-apollo ---
[INFO] Reading assembly descriptor: F:\hudson\hudson-slave\workspace\ActiveMQ-Apollo\trunk\apollo-distro/src/main/descriptors/unix-bin.xml
[WARNING] Cannot include project artifact: org.apache.activemq:apache-apollo:pom:1.0-SNAPSHOT;
it doesn't have an associated file or directory.
[WARNING] Cannot include project artifact: org.apache.activemq:apache-apollo:pom:1.0-SNAPSHOT;
it doesn't have an associated file or directory.
[INFO] No files selected for line-ending conversion or filtering. Skipping: F:\hudson\hudson-slave\workspace\ActiveMQ-Apollo\trunk\apollo-distro\..
[INFO] Building tar : F:\hudson\hudson-slave\workspace\ActiveMQ-Apollo\trunk\apollo-distro\target\apache-apollo-1.0-SNAPSHOT-unix-distro.tar.gz
[INFO] [INFO] Reading assembly descriptor: F:\hudson\hudson-slave\workspace\ActiveMQ-Apollo\trunk\apollo-distro/src/main/descriptors/windows-bin.xml

[INFO] --- maven-assembly-plugin:2.2.1:single (windows-bin) @ apache-apollo ---
[WARNING] Cannot include project artifact: org.apache.activemq:apache-apollo:pom:1.0-SNAPSHOT;
it doesn't have an associated file or directory.
[WARNING] Cannot include project artifact: org.apache.activemq:apache-apollo:pom:1.0-SNAPSHOT;
it doesn't have an associated file or directory.
[INFO] No files selected for line-ending conversion or filtering. Skipping: F:\hudson\hudson-slave\workspace\ActiveMQ-Apollo\trunk\apollo-distro\..
[INFO] Building zip: F:\hudson\hudson-slave\workspace\ActiveMQ-Apollo\trunk\apollo-distro\target\apache-apollo-1.0-SNAPSHOT-windows-distro.zip
[INFO] [INFO] Installing F:\hudson\hudson-slave\workspace\ActiveMQ-Apollo\trunk\apollo-distro\pom.xml
to C:\Users\hudson\.m2\repository\org\apache\activemq\apache-apollo\1.0-SNAPSHOT\apache-apollo-1.0-SNAPSHOT.pom

[INFO] --- maven-install-plugin:2.3.1:install (default-install) @ apache-apollo ---
[INFO] Installing F:\hudson\hudson-slave\workspace\ActiveMQ-Apollo\trunk\apollo-distro\target\apache-apollo-1.0-SNAPSHOT-unix-distro.tar.gz
to C:\Users\hudson\.m2\repository\org\apache\activemq\apache-apollo\1.0-SNAPSHOT\apache-apollo-1.0-SNAPSHOT-unix-distro.tar.gz
[INFO] Installing F:\hudson\hudson-slave\workspace\ActiveMQ-Apollo\trunk\apollo-distro\target\apache-apollo-1.0-SNAPSHOT-windows-distro.zip
to C:\Users\hudson\.m2\repository\org\apache\activemq\apache-apollo\1.0-SNAPSHOT\apache-apollo-1.0-SNAPSHOT-windows-distro.zip
[JENKINS] Archiving disabled - not archiving F:\hudson\hudson-slave\workspace\ActiveMQ-Apollo\trunk\apollo-distro\pom.xml
[JENKINS] Archiving disabled - not archiving F:\hudson\hudson-slave\workspace\ActiveMQ-Apollo\trunk\apollo-distro\target\apache-apollo-1.0-SNAPSHOT-unix-distro.tar.gz
[JENKINS] Archiving disabled - not archiving F:\hudson\hudson-slave\workspace\ActiveMQ-Apollo\trunk\apollo-distro\target\apache-apollo-1.0-SNAPSHOT-windows-distro.zip
[INFO]                                                                         
[INFO] ------------------------------------------------------------------------
[INFO] Building apollo-karaf-feature 1.0-SNAPSHOT
[INFO] ------------------------------------------------------------------------
[INFO] 
[INFO] --- maven-clean-plugin:2.4.1:clean (default-clean) @ apollo-karaf-feature ---
[INFO] 
[INFO] --- maven-enforcer-plugin:1.0:enforce (default) @ apollo-karaf-feature ---
[INFO] 
[INFO] --- maven-remote-resources-plugin:1.1:process (default) @ apollo-karaf-feature ---
[INFO] [INFO] Using 'UTF-8' encoding to copy filtered resources.

[INFO] --- maven-resources-plugin:2.4.3:resources (filter) @ apollo-karaf-feature ---
[INFO] Copying 1 resource
[INFO] Copying 3 resources
[INFO] 
[INFO] --- build-helper-maven-plugin:1.2:attach-artifact (attach-artifacts) @ apollo-karaf-feature
---
[INFO] 
[INFO] Installing F:\hudson\hudson-slave\workspace\ActiveMQ-Apollo\trunk\apollo-karaf-feature\pom.xml
to C:\Users\hudson\.m2\repository\org\apache\activemq\apollo-karaf-feature\1.0-SNAPSHOT\apollo-karaf-feature-1.0-SNAPSHOT.pom
[INFO] --- maven-install-plugin:2.3.1:install (default-install) @ apollo-karaf-feature ---
[INFO] Installing F:\hudson\hudson-slave\workspace\ActiveMQ-Apollo\trunk\apollo-karaf-feature\target\classes\features.xml
to C:\Users\hudson\.m2\repository\org\apache\activemq\apollo-karaf-feature\1.0-SNAPSHOT\apollo-karaf-feature-1.0-SNAPSHOT-features.xml
[JENKINS] Archiving disabled - not archiving F:\hudson\hudson-slave\workspace\ActiveMQ-Apollo\trunk\apollo-karaf-feature\pom.xml
[JENKINS] Archiving disabled - not archiving F:\hudson\hudson-slave\workspace\ActiveMQ-Apollo\trunk\apollo-karaf-feature\target\classes\features.xml
[INFO] ------------------------------------------------------------------------
[INFO] Reactor Summary:
[INFO] 
[INFO] Apache ActiveMQ Apollo Project .................... SUCCESS [2.592s]
[INFO] apollo-boot ....................................... SUCCESS [1.808s]
[INFO] apollo-scala ...................................... SUCCESS [3.002s]
[INFO] apollo-util ....................................... SUCCESS [38.837s]
[INFO] apollo-transport .................................. SUCCESS [1.325s]
[INFO] apollo-dto ........................................ SUCCESS [5.964s]
[INFO] apollo-selector ................................... SUCCESS [4.133s]
[INFO] apollo-broker ..................................... SUCCESS [1:00.941s]
[INFO] apollo-tcp ........................................ SUCCESS [1.108s]
[INFO] apollo-web ........................................ SUCCESS [45.819s]
[INFO] apollo-leveldb .................................... SUCCESS [44.331s]
[INFO] apollo-bdb ........................................ SUCCESS [30.587s]
[INFO] apollo-jdbm2 ...................................... SUCCESS [31.196s]
[INFO] apollo-stomp ...................................... SUCCESS [1:08.763s]
[INFO] apollo-cli ........................................ SUCCESS [22.501s]
[INFO] apollo-website .................................... SUCCESS [30.132s]
[INFO] apollo-itests ..................................... FAILURE [5.691s]
[INFO] apache-apollo ..................................... SUCCESS [10.200s]
[INFO] apollo-karaf-feature .............................. SUCCESS [0.226s]
[INFO] ------------------------------------------------------------------------
[INFO] BUILD FAILURE
[INFO] ------------------------------------------------------------------------
[INFO] Total time: 6:54.613s
[INFO] Finished at: Mon Dec 12 23:09:33 GMT 2011
[INFO] Final Memory: 348M/1048M
[INFO] ------------------------------------------------------------------------
mavenExecutionResult exceptions not empty
message : Failed to execute goal on project apollo-itests: Could not resolve dependencies
for project org.apache.activemq:apollo-itests:jar:1.0-SNAPSHOT: Could not find artifact org.fusesource.stompjms:stompjms-client:jar:1.4-SNAPSHOT
in Nexus (http://repository.apache.org/snapshots)
cause : Could not resolve dependencies for project org.apache.activemq:apollo-itests:jar:1.0-SNAPSHOT:
Could not find artifact org.fusesource.stompjms:stompjms-client:jar:1.4-SNAPSHOT in Nexus
(http://repository.apache.org/snapshots)
Stack trace : 
org.apache.maven.lifecycle.LifecycleExecutionException: Failed to execute goal on project
apollo-itests: Could not resolve dependencies for project org.apache.activemq:apollo-itests:jar:1.0-SNAPSHOT:
Could not find artifact org.fusesource.stompjms:stompjms-client:jar:1.4-SNAPSHOT in Nexus
(http://repository.apache.org/snapshots)
	at org.apache.maven.lifecycle.internal.LifecycleDependencyResolver.getDependencies(LifecycleDependencyResolver.java:190)
	at org.apache.maven.lifecycle.internal.LifecycleDependencyResolver.resolveProjectDependencies(LifecycleDependencyResolver.java:104)
	at org.apache.maven.lifecycle.internal.MojoExecutor.ensureDependenciesAreResolved(MojoExecutor.java:258)
	at org.apache.maven.lifecycle.internal.MojoExecutor.execute(MojoExecutor.java:201)
	at org.apache.maven.lifecycle.internal.MojoExecutor.execute(MojoExecutor.java:153)
	at org.apache.maven.lifecycle.internal.MojoExecutor.execute(MojoExecutor.java:145)
	at org.apache.maven.lifecycle.internal.LifecycleModuleBuilder.buildProject(LifecycleModuleBuilder.java:84)
	at org.apache.maven.lifecycle.internal.LifecycleModuleBuilder.buildProject(LifecycleModuleBuilder.java:59)
	at org.apache.maven.lifecycle.internal.LifecycleStarter.singleThreadedBuild(LifecycleStarter.java:183)
	at org.apache.maven.lifecycle.internal.LifecycleStarter.execute(LifecycleStarter.java:161)
	at org.apache.maven.DefaultMaven.doExecute(DefaultMaven.java:319)
	at org.apache.maven.DefaultMaven.execute(DefaultMaven.java:156)
	at org.jvnet.hudson.maven3.launcher.Maven3Launcher.main(Maven3Launcher.java:79)
	at sun.reflect.NativeMethodAccessorImpl.invoke0(Native Method)
	at sun.reflect.NativeMethodAccessorImpl.invoke(NativeMethodAccessorImpl.java:39)
	at sun.reflect.DelegatingMethodAccessorImpl.invoke(DelegatingMethodAccessorImpl.java:25)
	at java.lang.reflect.Method.invoke(Method.java:597)
	at org.codehaus.plexus.classworlds.launcher.Launcher.launchStandard(Launcher.java:329)
	at org.codehaus.plexus.classworlds.launcher.Launcher.launch(Launcher.java:239)
	at org.jvnet.hudson.maven3.agent.Maven3Main.launch(Maven3Main.java:158)
	at hudson.maven.Maven3Builder.call(Maven3Builder.java:122)
	at hudson.maven.Maven3Builder.call(Maven3Builder.java:74)
	at hudson.remoting.UserRequest.perform(UserRequest.java:118)
	at hudson.remoting.UserRequest.perform(UserRequest.java:48)
	at hudson.remoting.Request$2.run(Request.java:287)
	at java.util.concurrent.Executors$RunnableAdapter.call(Executors.java:441)
	at java.util.concurrent.FutureTask$Sync.innerRun(FutureTask.java:303)
	at java.util.concurrent.FutureTask.run(FutureTask.java:138)
	at java.util.concurrent.ThreadPoolExecutor$Worker.runTask(ThreadPoolExecutor.java:886)
	at java.util.concurrent.ThreadPoolExecutor$Worker.run(ThreadPoolExecutor.java:908)
	at java.lang.Thread.run(Thread.java:662)
Caused by: org.apache.maven.project.DependencyResolutionException: Could not resolve dependencies
for project org.apache.activemq:apollo-itests:jar:1.0-SNAPSHOT: Could not find artifact org.fusesource.stompjms:stompjms-client:jar:1.4-SNAPSHOT
in Nexus (http://repository.apache.org/snapshots)
	at org.apache.maven.project.DefaultProjectDependenciesResolver.resolve(DefaultProjectDependenciesResolver.java:156)
	at org.apache.maven.lifecycle.internal.LifecycleDependencyResolver.getDependencies(LifecycleDependencyResolver.java:165)
	... 30 more
Caused by: org.sonatype.aether.resolution.ArtifactResolutionException: Could not find artifact
org.fusesource.stompjms:stompjms-client:jar:1.4-SNAPSHOT in Nexus (http://repository.apache.org/snapshots)
	at org.sonatype.aether.impl.internal.DefaultArtifactResolver.resolveArtifacts(DefaultArtifactResolver.java:526)
	at org.sonatype.aether.impl.internal.DefaultRepositorySystem.resolveArtifacts(DefaultRepositorySystem.java:304)
	at org.sonatype.aether.impl.internal.DefaultRepositorySystem.resolveDependencies(DefaultRepositorySystem.java:334)
	at org.apache.maven.project.DefaultProjectDependenciesResolver.resolve(DefaultProjectDependenciesResolver.java:150)
	... 31 more
Caused by: org.sonatype.aether.transfer.ArtifactNotFoundException: Could not find artifact
org.fusesource.stompjms:stompjms-client:jar:1.4-SNAPSHOT in Nexus (http://repository.apache.org/snapshots)
	at org.sonatype.aether.connector.wagon.WagonRepositoryConnector$4.wrap(WagonRepositoryConnector.java:945)
	at org.sonatype.aether.connector.wagon.WagonRepositoryConnector$4.wrap(WagonRepositoryConnector.java:940)
	at org.sonatype.aether.connector.wagon.WagonRepositoryConnector$GetTask.flush(WagonRepositoryConnector.java:696)
	at org.sonatype.aether.connector.wagon.WagonRepositoryConnector$GetTask.flush(WagonRepositoryConnector.java:690)
	at org.sonatype.aether.connector.wagon.WagonRepositoryConnector.get(WagonRepositoryConnector.java:435)
	at org.sonatype.aether.impl.internal.DefaultArtifactResolver.resolveArtifacts(DefaultArtifactResolver.java:438)
	... 34 more
Maven failed with error.
Sending e-mails to: commits@activemq.apache.org
Sending e-mails to: commits@activemq.apache.org
channel stopped


Mime
View raw message