activemq-commits mailing list archives

Site index · List index
Message view « Date » · « Thread »
Top « Date » · « Thread »
From Apache Jenkins Server <jenk...@builds.apache.org>
Subject Build failed in Jenkins: ActiveMQ-Apollo-Deploy #187
Date Fri, 30 Dec 2011 03:27:12 GMT
See <https://builds.apache.org/job/ActiveMQ-Apollo-Deploy/187/changes>

Changes:

[chirino] Fixes linux test failure

[chirino] Revert "Revert "Remove the scala-compiler dependency from the poms.""

This reverts commit cfb623253defb1c3833ac9984c2970c550d813ab.

[chirino] Revert "Remove the scala-compiler dependency from the poms."

This reverts commit 956584347f47a43bcacd0b3c94abc10bf580b971.

------------------------------------------
[...truncated 6770 lines...]

[INFO] --- maven-assembly-plugin:2.2.1:single (unix-bin) @ apache-apollo ---
Downloading: http://scala-tools.org/repo-releases/org/apache/maven/shared/maven-common-artifact-filters/1.3/maven-common-artifact-filters-1.3.pom
Downloading: http://download.java.net/maven/2/org/apache/maven/shared/maven-common-artifact-filters/1.3/maven-common-artifact-filters-1.3.pom
Downloading: http://repo1.maven.org/maven2/org/apache/maven/shared/maven-common-artifact-filters/1.3/maven-common-artifact-filters-1.3.pom
Downloaded: http://repo1.maven.org/maven2/org/apache/maven/shared/maven-common-artifact-filters/1.3/maven-common-artifact-filters-1.3.pom
(4 KB at 11.3 KB/sec)
Downloading: http://repo.fusesource.com/nexus/content/groups/public/org/codehaus/plexus/plexus-archiver/1.1/plexus-archiver-1.1.pom
Downloading: http://scala-tools.org/repo-releases/org/codehaus/plexus/plexus-archiver/1.1/plexus-archiver-1.1.pom
Downloading: http://download.java.net/maven/2/org/codehaus/plexus/plexus-archiver/1.1/plexus-archiver-1.1.pom
Downloading: http://repo1.maven.org/maven2/org/codehaus/plexus/plexus-archiver/1.1/plexus-archiver-1.1.pom
Downloaded: http://repo1.maven.org/maven2/org/codehaus/plexus/plexus-archiver/1.1/plexus-archiver-1.1.pom
(2 KB at 6.5 KB/sec)
Downloading: http://repo.fusesource.com/nexus/content/groups/public/org/codehaus/plexus/plexus-io/1.0.1/plexus-io-1.0.1.pom
Downloading: http://scala-tools.org/repo-releases/org/codehaus/plexus/plexus-io/1.0.1/plexus-io-1.0.1.pom
Downloading: http://download.java.net/maven/2/org/codehaus/plexus/plexus-io/1.0.1/plexus-io-1.0.1.pom
Downloading: http://repo1.maven.org/maven2/org/codehaus/plexus/plexus-io/1.0.1/plexus-io-1.0.1.pom
Downloaded: http://repo1.maven.org/maven2/org/codehaus/plexus/plexus-io/1.0.1/plexus-io-1.0.1.pom
(2 KB at 4.0 KB/sec)
Downloading: http://repo.fusesource.com/nexus/content/groups/public/org/apache/maven/shared/maven-shared-io/1.1/maven-shared-io-1.1.pom
Downloading: http://scala-tools.org/repo-releases/org/apache/maven/shared/maven-shared-io/1.1/maven-shared-io-1.1.pom
Downloading: http://download.java.net/maven/2/org/apache/maven/shared/maven-shared-io/1.1/maven-shared-io-1.1.pom
Downloading: http://repo1.maven.org/maven2/org/apache/maven/shared/maven-shared-io/1.1/maven-shared-io-1.1.pom
Downloaded: http://repo1.maven.org/maven2/org/apache/maven/shared/maven-shared-io/1.1/maven-shared-io-1.1.pom
(4 KB at 12.5 KB/sec)
Downloading: http://repo.fusesource.com/nexus/content/groups/public/org/apache/maven/shared/maven-filtering/1.0/maven-filtering-1.0.pom
Downloading: http://scala-tools.org/repo-releases/org/apache/maven/shared/maven-filtering/1.0/maven-filtering-1.0.pom
Downloading: http://download.java.net/maven/2/org/apache/maven/shared/maven-filtering/1.0/maven-filtering-1.0.pom
Downloading: http://repo1.maven.org/maven2/org/apache/maven/shared/maven-filtering/1.0/maven-filtering-1.0.pom
Downloaded: http://repo1.maven.org/maven2/org/apache/maven/shared/maven-filtering/1.0/maven-filtering-1.0.pom
(6 KB at 18.0 KB/sec)
Downloading: http://repo.fusesource.com/nexus/content/groups/public/org/apache/maven/shared/maven-repository-builder/1.0-alpha-2/maven-repository-builder-1.0-alpha-2.pom
Downloading: http://scala-tools.org/repo-releases/org/apache/maven/shared/maven-repository-builder/1.0-alpha-2/maven-repository-builder-1.0-alpha-2.pom
Downloading: http://download.java.net/maven/2/org/apache/maven/shared/maven-repository-builder/1.0-alpha-2/maven-repository-builder-1.0-alpha-2.pom
Downloading: http://repo1.maven.org/maven2/org/apache/maven/shared/maven-repository-builder/1.0-alpha-2/maven-repository-builder-1.0-alpha-2.pom
Downloaded: http://repo1.maven.org/maven2/org/apache/maven/shared/maven-repository-builder/1.0-alpha-2/maven-repository-builder-1.0-alpha-2.pom
(4 KB at 10.3 KB/sec)
Downloading: http://repo.fusesource.com/nexus/content/groups/public/org/apache/maven/shared/maven-common-artifact-filters/1.0-alpha-1/maven-common-artifact-filters-1.0-alpha-1.pom
Downloading: http://scala-tools.org/repo-releases/org/apache/maven/shared/maven-common-artifact-filters/1.0-alpha-1/maven-common-artifact-filters-1.0-alpha-1.pom
Downloading: http://download.java.net/maven/2/org/apache/maven/shared/maven-common-artifact-filters/1.0-alpha-1/maven-common-artifact-filters-1.0-alpha-1.pom
Downloading: http://repo1.maven.org/maven2/org/apache/maven/shared/maven-common-artifact-filters/1.0-alpha-1/maven-common-artifact-filters-1.0-alpha-1.pom
Downloaded: http://repo1.maven.org/maven2/org/apache/maven/shared/maven-common-artifact-filters/1.0-alpha-1/maven-common-artifact-filters-1.0-alpha-1.pom
(2 KB at 5.5 KB/sec)
Downloading: http://repo.fusesource.com/nexus/content/groups/public/org/apache/maven/shared/maven-shared-components/6/maven-shared-components-6.pom
Downloading: http://scala-tools.org/repo-releases/org/apache/maven/shared/maven-shared-components/6/maven-shared-components-6.pom
Downloading: http://download.java.net/maven/2/org/apache/maven/shared/maven-shared-components/6/maven-shared-components-6.pom
Downloading: http://repo1.maven.org/maven2/org/apache/maven/shared/maven-shared-components/6/maven-shared-components-6.pom
Downloaded: http://repo1.maven.org/maven2/org/apache/maven/shared/maven-shared-components/6/maven-shared-components-6.pom
(4 KB at 5.6 KB/sec)
Downloading: http://repo.fusesource.com/nexus/content/groups/public/org/apache/maven/doxia/doxia-sink-api/1.1/doxia-sink-api-1.1.jar
Downloading: http://repo.fusesource.com/nexus/content/groups/public/org/apache/maven/shared/maven-common-artifact-filters/1.3/maven-common-artifact-filters-1.3.jar
Downloading: http://repo.fusesource.com/nexus/content/groups/public/org/codehaus/plexus/plexus-archiver/1.1/plexus-archiver-1.1.jar
Downloading: http://repo.fusesource.com/nexus/content/groups/public/org/apache/maven/shared/maven-shared-io/1.1/maven-shared-io-1.1.jar
Downloading: http://repo.fusesource.com/nexus/content/groups/public/org/apache/maven/shared/maven-filtering/1.0/maven-filtering-1.0.jar
Downloading: http://repo.fusesource.com/nexus/content/groups/public/org/codehaus/plexus/plexus-io/1.0.1/plexus-io-1.0.1.jar
Downloading: http://repo.fusesource.com/nexus/content/groups/public/org/apache/maven/shared/maven-repository-builder/1.0-alpha-2/maven-repository-builder-1.0-alpha-2.jar
Downloading: http://scala-tools.org/repo-releases/org/apache/maven/doxia/doxia-sink-api/1.1/doxia-sink-api-1.1.jar
Downloading: http://scala-tools.org/repo-releases/org/apache/maven/shared/maven-common-artifact-filters/1.3/maven-common-artifact-filters-1.3.jar
Downloading: http://scala-tools.org/repo-releases/org/codehaus/plexus/plexus-archiver/1.1/plexus-archiver-1.1.jar
Downloading: http://scala-tools.org/repo-releases/org/apache/maven/shared/maven-shared-io/1.1/maven-shared-io-1.1.jar
Downloading: http://scala-tools.org/repo-releases/org/apache/maven/shared/maven-filtering/1.0/maven-filtering-1.0.jar
Downloading: http://scala-tools.org/repo-releases/org/codehaus/plexus/plexus-io/1.0.1/plexus-io-1.0.1.jar
Downloading: http://scala-tools.org/repo-releases/org/apache/maven/shared/maven-repository-builder/1.0-alpha-2/maven-repository-builder-1.0-alpha-2.jar
Downloading: http://download.java.net/maven/2/org/apache/maven/doxia/doxia-sink-api/1.1/doxia-sink-api-1.1.jar
Downloading: http://download.java.net/maven/2/org/apache/maven/shared/maven-common-artifact-filters/1.3/maven-common-artifact-filters-1.3.jar
Downloading: http://download.java.net/maven/2/org/codehaus/plexus/plexus-archiver/1.1/plexus-archiver-1.1.jar
Downloading: http://download.java.net/maven/2/org/apache/maven/shared/maven-shared-io/1.1/maven-shared-io-1.1.jar
Downloading: http://download.java.net/maven/2/org/apache/maven/shared/maven-filtering/1.0/maven-filtering-1.0.jar
Downloading: http://download.java.net/maven/2/org/codehaus/plexus/plexus-io/1.0.1/plexus-io-1.0.1.jar
Downloading: http://download.java.net/maven/2/org/apache/maven/shared/maven-repository-builder/1.0-alpha-2/maven-repository-builder-1.0-alpha-2.jar
Downloading: http://repo1.maven.org/maven2/org/apache/maven/doxia/doxia-sink-api/1.1/doxia-sink-api-1.1.jar
Downloading: http://repo1.maven.org/maven2/org/apache/maven/shared/maven-common-artifact-filters/1.3/maven-common-artifact-filters-1.3.jar
Downloading: http://repo1.maven.org/maven2/org/codehaus/plexus/plexus-archiver/1.1/plexus-archiver-1.1.jar
Downloading: http://repo1.maven.org/maven2/org/apache/maven/shared/maven-shared-io/1.1/maven-shared-io-1.1.jar
Downloading: http://repo1.maven.org/maven2/org/apache/maven/shared/maven-filtering/1.0/maven-filtering-1.0.jar
Downloaded: http://repo1.maven.org/maven2/org/apache/maven/doxia/doxia-sink-api/1.1/doxia-sink-api-1.1.jar
(13 KB at 9.6 KB/sec)
Downloading: http://repo1.maven.org/maven2/org/codehaus/plexus/plexus-io/1.0.1/plexus-io-1.0.1.jar
Downloaded: http://repo1.maven.org/maven2/org/codehaus/plexus/plexus-archiver/1.1/plexus-archiver-1.1.jar
(178 KB at 98.3 KB/sec)
Downloading: http://repo1.maven.org/maven2/org/apache/maven/shared/maven-repository-builder/1.0-alpha-2/maven-repository-builder-1.0-alpha-2.jar
Downloaded: http://repo1.maven.org/maven2/org/apache/maven/shared/maven-shared-io/1.1/maven-shared-io-1.1.jar
(39 KB at 18.7 KB/sec)
Downloaded: http://repo1.maven.org/maven2/org/apache/maven/shared/maven-common-artifact-filters/1.3/maven-common-artifact-filters-1.3.jar
(31 KB at 13.1 KB/sec)
Downloaded: http://repo1.maven.org/maven2/org/apache/maven/shared/maven-filtering/1.0/maven-filtering-1.0.jar
(42 KB at 16.4 KB/sec)
Downloaded: http://repo1.maven.org/maven2/org/codehaus/plexus/plexus-io/1.0.1/plexus-io-1.0.1.jar
(50 KB at 24.8 KB/sec)
Downloaded: http://repo1.maven.org/maven2/org/apache/maven/shared/maven-repository-builder/1.0-alpha-2/maven-repository-builder-1.0-alpha-2.jar
(23 KB at 12.9 KB/sec)
[INFO] Reading assembly descriptor: <https://builds.apache.org/job/ActiveMQ-Apollo-Deploy/ws/trunk/apollo-distro/src/main/descriptors/unix-bin.xml>
[INFO] No files selected for line-ending conversion or filtering. Skipping: <https://builds.apache.org/job/ActiveMQ-Apollo-Deploy/ws/trunk/apollo-distro/..>
[WARNING] Cannot include project artifact: org.apache.activemq:apache-apollo:pom:1.0-SNAPSHOT;
it doesn't have an associated file or directory.
[WARNING] Cannot include project artifact: org.apache.activemq:apache-apollo:pom:1.0-SNAPSHOT;
it doesn't have an associated file or directory.
[INFO] Building tar : <https://builds.apache.org/job/ActiveMQ-Apollo-Deploy/ws/trunk/apollo-distro/target/apache-apollo-1.0-SNAPSHOT-unix-distro.tar.gz>
[INFO] Reading assembly descriptor: <https://builds.apache.org/job/ActiveMQ-Apollo-Deploy/ws/trunk/apollo-distro/src/main/descriptors/windows-bin.xml>
[INFO] 
[INFO] --- maven-assembly-plugin:2.2.1:single (windows-bin) @ apache-apollo ---
[INFO] No files selected for line-ending conversion or filtering. Skipping: <https://builds.apache.org/job/ActiveMQ-Apollo-Deploy/ws/trunk/apollo-distro/..>
[WARNING] Cannot include project artifact: org.apache.activemq:apache-apollo:pom:1.0-SNAPSHOT;
it doesn't have an associated file or directory.
[WARNING] Cannot include project artifact: org.apache.activemq:apache-apollo:pom:1.0-SNAPSHOT;
it doesn't have an associated file or directory.
[INFO] Building zip: <https://builds.apache.org/job/ActiveMQ-Apollo-Deploy/ws/trunk/apollo-distro/target/apache-apollo-1.0-SNAPSHOT-windows-distro.zip>
[INFO] Installing <https://builds.apache.org/job/ActiveMQ-Apollo-Deploy/ws/trunk/apollo-distro/pom.xml>
to <https://builds.apache.org/job/ActiveMQ-Apollo-Deploy/ws/.repository/org/apache/activemq/apache-apollo/1.0-SNAPSHOT/apache-apollo-1.0-SNAPSHOT.pom>
[INFO] [INFO] Installing <https://builds.apache.org/job/ActiveMQ-Apollo-Deploy/ws/trunk/apollo-distro/target/apache-apollo-1.0-SNAPSHOT-unix-distro.tar.gz>
to <https://builds.apache.org/job/ActiveMQ-Apollo-Deploy/ws/.repository/org/apache/activemq/apache-apollo/1.0-SNAPSHOT/apache-apollo-1.0-SNAPSHOT-unix-distro.tar.gz>
[INFO] Installing <https://builds.apache.org/job/ActiveMQ-Apollo-Deploy/ws/trunk/apollo-distro/target/apache-apollo-1.0-SNAPSHOT-windows-distro.zip>
to <https://builds.apache.org/job/ActiveMQ-Apollo-Deploy/ws/.repository/org/apache/activemq/apache-apollo/1.0-SNAPSHOT/apache-apollo-1.0-SNAPSHOT-windows-distro.zip>

[INFO] --- maven-install-plugin:2.3.1:install (default-install) @ apache-apollo ---
[INFO] Downloading: https://repository.apache.org/content/repositories/snapshots/org/apache/activemq/apache-apollo/1.0-SNAPSHOT/maven-metadata.xml

[INFO] --- maven-deploy-plugin:2.5:deploy (default-deploy) @ apache-apollo ---
Downloaded: https://repository.apache.org/content/repositories/snapshots/org/apache/activemq/apache-apollo/1.0-SNAPSHOT/maven-metadata.xml
(2 KB at 0.9 KB/sec)
Uploading: https://repository.apache.org/content/repositories/snapshots/org/apache/activemq/apache-apollo/1.0-SNAPSHOT/apache-apollo-1.0-20111230.032643-235.pom
Uploaded: https://repository.apache.org/content/repositories/snapshots/org/apache/activemq/apache-apollo/1.0-SNAPSHOT/apache-apollo-1.0-20111230.032643-235.pom
(6 KB at 8.3 KB/sec)
Downloading: https://repository.apache.org/content/repositories/snapshots/org/apache/activemq/apache-apollo/maven-metadata.xml
Downloaded: https://repository.apache.org/content/repositories/snapshots/org/apache/activemq/apache-apollo/maven-metadata.xml
(290 B at 0.6 KB/sec)
Uploading: https://repository.apache.org/content/repositories/snapshots/org/apache/activemq/apache-apollo/1.0-SNAPSHOT/maven-metadata.xml
Uploaded: https://repository.apache.org/content/repositories/snapshots/org/apache/activemq/apache-apollo/1.0-SNAPSHOT/maven-metadata.xml
(2 KB at 2.3 KB/sec)
Uploading: https://repository.apache.org/content/repositories/snapshots/org/apache/activemq/apache-apollo/maven-metadata.xml
Uploaded: https://repository.apache.org/content/repositories/snapshots/org/apache/activemq/apache-apollo/maven-metadata.xml
(290 B at 1.6 KB/sec)
Uploading: https://repository.apache.org/content/repositories/snapshots/org/apache/activemq/apache-apollo/1.0-SNAPSHOT/apache-apollo-1.0-20111230.032643-235-unix-distro.tar.gz
Uploaded: https://repository.apache.org/content/repositories/snapshots/org/apache/activemq/apache-apollo/1.0-SNAPSHOT/apache-apollo-1.0-20111230.032643-235-unix-distro.tar.gz
(20541 KB at 4309.8 KB/sec)
Uploading: https://repository.apache.org/content/repositories/snapshots/org/apache/activemq/apache-apollo/1.0-SNAPSHOT/maven-metadata.xml
Uploaded: https://repository.apache.org/content/repositories/snapshots/org/apache/activemq/apache-apollo/1.0-SNAPSHOT/maven-metadata.xml
(2 KB at 5.2 KB/sec)
Uploading: https://repository.apache.org/content/repositories/snapshots/org/apache/activemq/apache-apollo/1.0-SNAPSHOT/apache-apollo-1.0-20111230.032643-235-windows-distro.zip
Uploaded: https://repository.apache.org/content/repositories/snapshots/org/apache/activemq/apache-apollo/1.0-SNAPSHOT/apache-apollo-1.0-20111230.032643-235-windows-distro.zip
(20569 KB at 3792.2 KB/sec)
Uploading: https://repository.apache.org/content/repositories/snapshots/org/apache/activemq/apache-apollo/1.0-SNAPSHOT/maven-metadata.xml
Uploaded: https://repository.apache.org/content/repositories/snapshots/org/apache/activemq/apache-apollo/1.0-SNAPSHOT/maven-metadata.xml
(2 KB at 5.3 KB/sec)
[JENKINS] Archiving disabled - not archiving <https://builds.apache.org/job/ActiveMQ-Apollo-Deploy/ws/trunk/apollo-distro/pom.xml>
[JENKINS] Archiving disabled - not archiving <https://builds.apache.org/job/ActiveMQ-Apollo-Deploy/ws/trunk/apollo-distro/target/apache-apollo-1.0-SNAPSHOT-unix-distro.tar.gz>
[JENKINS] Archiving disabled - not archiving <https://builds.apache.org/job/ActiveMQ-Apollo-Deploy/ws/trunk/apollo-distro/target/apache-apollo-1.0-SNAPSHOT-windows-distro.zip>
[INFO] Downloading: http://repo.fusesource.com/nexus/content/groups/public/org/codehaus/mojo/build-helper-maven-plugin/1.2/build-helper-maven-plugin-1.2.pom
                                                                        
[INFO] ------------------------------------------------------------------------
[INFO] Building apollo-karaf-feature 1.0-SNAPSHOT
[INFO] ------------------------------------------------------------------------
Downloading: http://scala-tools.org/repo-releases/org/codehaus/mojo/build-helper-maven-plugin/1.2/build-helper-maven-plugin-1.2.pom
Downloading: http://download.java.net/maven/2/org/codehaus/mojo/build-helper-maven-plugin/1.2/build-helper-maven-plugin-1.2.pom
Downloading: http://repo1.maven.org/maven2/org/codehaus/mojo/build-helper-maven-plugin/1.2/build-helper-maven-plugin-1.2.pom
Downloaded: http://repo1.maven.org/maven2/org/codehaus/mojo/build-helper-maven-plugin/1.2/build-helper-maven-plugin-1.2.pom
(3 KB at 7.4 KB/sec)
Downloading: http://repo.fusesource.com/nexus/content/groups/public/org/codehaus/mojo/build-helper-maven-plugin/1.2/build-helper-maven-plugin-1.2.jar
Downloading: http://scala-tools.org/repo-releases/org/codehaus/mojo/build-helper-maven-plugin/1.2/build-helper-maven-plugin-1.2.jar
Downloading: http://download.java.net/maven/2/org/codehaus/mojo/build-helper-maven-plugin/1.2/build-helper-maven-plugin-1.2.jar
Downloading: http://repo1.maven.org/maven2/org/codehaus/mojo/build-helper-maven-plugin/1.2/build-helper-maven-plugin-1.2.jar
Downloaded: http://repo1.maven.org/maven2/org/codehaus/mojo/build-helper-maven-plugin/1.2/build-helper-maven-plugin-1.2.jar
(11 KB at 31.3 KB/sec)
[INFO] 
[INFO] --- maven-clean-plugin:2.4.1:clean (default-clean) @ apollo-karaf-feature ---
[INFO] 
[INFO] --- maven-enforcer-plugin:1.0:enforce (default) @ apollo-karaf-feature ---
[INFO] 
[INFO] --- maven-remote-resources-plugin:1.1:process (default) @ apollo-karaf-feature ---
[INFO] Using 'UTF-8' encoding to copy filtered resources.
[INFO] [INFO] Copying 1 resource
[INFO] Copying 3 resources

[INFO] --- maven-resources-plugin:2.4.3:resources (filter) @ apollo-karaf-feature ---
[INFO] 
[INFO] --- maven-site-plugin:3.0:attach-descriptor (attach-descriptor) @ apollo-karaf-feature
---
[INFO] Downloading: http://repo.fusesource.com/nexus/content/groups/public/org/apache/maven/maven-project/2.0.2/maven-project-2.0.2.pom

[INFO] --- build-helper-maven-plugin:1.2:attach-artifact (attach-artifacts) @ apollo-karaf-feature
---
Downloaded: http://repo.fusesource.com/nexus/content/groups/public/org/apache/maven/maven-project/2.0.2/maven-project-2.0.2.pom
(2 KB at 1.3 KB/sec)
Downloading: http://repo.fusesource.com/nexus/content/groups/public/org/apache/maven/maven-profile/2.0.2/maven-profile-2.0.2.pom
Downloaded: http://repo.fusesource.com/nexus/content/groups/public/org/apache/maven/maven-profile/2.0.2/maven-profile-2.0.2.pom
(2 KB at 1.4 KB/sec)
Downloading: http://repo.fusesource.com/nexus/content/groups/public/org/apache/maven/maven-model/2.0.2/maven-model-2.0.2.pom
Downloaded: http://repo.fusesource.com/nexus/content/groups/public/org/apache/maven/maven-model/2.0.2/maven-model-2.0.2.pom
(3 KB at 2.5 KB/sec)
Downloading: http://repo.fusesource.com/nexus/content/groups/public/org/codehaus/plexus/plexus-utils/1.1/plexus-utils-1.1.jar
Downloaded: http://repo.fusesource.com/nexus/content/groups/public/org/codehaus/plexus/plexus-utils/1.1/plexus-utils-1.1.jar
(165 KB at 73.1 KB/sec)
[INFO] Installing <https://builds.apache.org/job/ActiveMQ-Apollo-Deploy/ws/trunk/apollo-karaf-feature/pom.xml>
to <https://builds.apache.org/job/ActiveMQ-Apollo-Deploy/ws/.repository/org/apache/activemq/apollo-karaf-feature/1.0-SNAPSHOT/apollo-karaf-feature-1.0-SNAPSHOT.pom>
[INFO] [INFO] Installing <https://builds.apache.org/job/ActiveMQ-Apollo-Deploy/ws/trunk/apollo-karaf-feature/target/classes/features.xml>
to <https://builds.apache.org/job/ActiveMQ-Apollo-Deploy/ws/.repository/org/apache/activemq/apollo-karaf-feature/1.0-SNAPSHOT/apollo-karaf-feature-1.0-SNAPSHOT-features.xml>

[INFO] --- maven-install-plugin:2.3.1:install (default-install) @ apollo-karaf-feature ---
[INFO] Downloading: https://repository.apache.org/content/repositories/snapshots/org/apache/activemq/apollo-karaf-feature/1.0-SNAPSHOT/maven-metadata.xml

[INFO] --- maven-deploy-plugin:2.5:deploy (default-deploy) @ apollo-karaf-feature ---
Downloaded: https://repository.apache.org/content/repositories/snapshots/org/apache/activemq/apollo-karaf-feature/1.0-SNAPSHOT/maven-metadata.xml
(831 B at 0.5 KB/sec)
Uploading: https://repository.apache.org/content/repositories/snapshots/org/apache/activemq/apollo-karaf-feature/1.0-SNAPSHOT/apollo-karaf-feature-1.0-20111230.032707-156.pom
Uploaded: https://repository.apache.org/content/repositories/snapshots/org/apache/activemq/apollo-karaf-feature/1.0-SNAPSHOT/apollo-karaf-feature-1.0-20111230.032707-156.pom
(3 KB at 14.1 KB/sec)
Downloading: https://repository.apache.org/content/repositories/snapshots/org/apache/activemq/apollo-karaf-feature/maven-metadata.xml
Downloaded: https://repository.apache.org/content/repositories/snapshots/org/apache/activemq/apollo-karaf-feature/maven-metadata.xml
(297 B at 1.9 KB/sec)
Uploading: https://repository.apache.org/content/repositories/snapshots/org/apache/activemq/apollo-karaf-feature/1.0-SNAPSHOT/maven-metadata.xml
Uploaded: https://repository.apache.org/content/repositories/snapshots/org/apache/activemq/apollo-karaf-feature/1.0-SNAPSHOT/maven-metadata.xml
(831 B at 4.6 KB/sec)
Uploading: https://repository.apache.org/content/repositories/snapshots/org/apache/activemq/apollo-karaf-feature/maven-metadata.xml
Uploaded: https://repository.apache.org/content/repositories/snapshots/org/apache/activemq/apollo-karaf-feature/maven-metadata.xml
(297 B at 1.6 KB/sec)
Uploading: https://repository.apache.org/content/repositories/snapshots/org/apache/activemq/apollo-karaf-feature/1.0-SNAPSHOT/apollo-karaf-feature-1.0-20111230.032707-156-features.xml
Uploaded: https://repository.apache.org/content/repositories/snapshots/org/apache/activemq/apollo-karaf-feature/1.0-SNAPSHOT/apollo-karaf-feature-1.0-20111230.032707-156-features.xml
(4 KB at 19.3 KB/sec)
Uploading: https://repository.apache.org/content/repositories/snapshots/org/apache/activemq/apollo-karaf-feature/1.0-SNAPSHOT/maven-metadata.xml
Uploaded: https://repository.apache.org/content/repositories/snapshots/org/apache/activemq/apollo-karaf-feature/1.0-SNAPSHOT/maven-metadata.xml
(831 B at 4.8 KB/sec)
[JENKINS] Archiving disabled - not archiving <https://builds.apache.org/job/ActiveMQ-Apollo-Deploy/ws/trunk/apollo-karaf-feature/pom.xml>
[JENKINS] Archiving disabled - not archiving <https://builds.apache.org/job/ActiveMQ-Apollo-Deploy/ws/trunk/apollo-karaf-feature/target/classes/features.xml>
[INFO] ------------------------------------------------------------------------
[INFO] Reactor Summary:
[INFO] 
[INFO] Apache ActiveMQ Apollo Project .................... SUCCESS [6:36.837s]
[INFO] apollo-boot ....................................... SUCCESS [41.982s]
[INFO] apollo-scala ...................................... SUCCESS [1:10.622s]
[INFO] apollo-util ....................................... SUCCESS [1:21.635s]
[INFO] apollo-dto ........................................ SUCCESS [44.479s]
[INFO] apollo-selector ................................... SUCCESS [57.959s]
[INFO] apollo-broker ..................................... SUCCESS [1:14.768s]
[INFO] apollo-web ........................................ SUCCESS [2:47.541s]
[INFO] apollo-leveldb .................................... SUCCESS [48.409s]
[INFO] apollo-bdb ........................................ SUCCESS [30.849s]
[INFO] apollo-jdbm2 ...................................... SUCCESS [24.797s]
[INFO] apollo-stomp ...................................... SUCCESS [41.951s]
[INFO] apollo-cli ........................................ SUCCESS [1:38.758s]
[INFO] apollo-website .................................... FAILURE [23.266s]
[INFO] apache-apollo ..................................... SUCCESS [46.201s]
[INFO] apollo-karaf-feature .............................. SUCCESS [11.892s]
[INFO] ------------------------------------------------------------------------
[INFO] BUILD FAILURE
[INFO] ------------------------------------------------------------------------
[INFO] Total time: 21:11.941s
[INFO] Finished at: Fri Dec 30 03:27:09 UTC 2011
[INFO] Final Memory: 281M/973M
[INFO] ------------------------------------------------------------------------
mavenExecutionResult exceptions not empty
message : Internal error: java.lang.NullPointerException
cause : null
Stack trace : 
org.apache.maven.InternalErrorException: Internal error: java.lang.NullPointerException
	at org.apache.maven.lifecycle.internal.BuilderCommon.handleBuildError(BuilderCommon.java:128)
	at org.apache.maven.lifecycle.internal.LifecycleModuleBuilder.buildProject(LifecycleModuleBuilder.java:95)
	at org.apache.maven.lifecycle.internal.LifecycleModuleBuilder.buildProject(LifecycleModuleBuilder.java:59)
	at org.apache.maven.lifecycle.internal.LifecycleStarter.singleThreadedBuild(LifecycleStarter.java:183)
	at org.apache.maven.lifecycle.internal.LifecycleStarter.execute(LifecycleStarter.java:161)
	at org.apache.maven.DefaultMaven.doExecute(DefaultMaven.java:319)
	at org.apache.maven.DefaultMaven.execute(DefaultMaven.java:156)
	at org.jvnet.hudson.maven3.launcher.Maven3Launcher.main(Maven3Launcher.java:79)
	at sun.reflect.NativeMethodAccessorImpl.invoke0(Native Method)
	at sun.reflect.NativeMethodAccessorImpl.invoke(NativeMethodAccessorImpl.java:39)
	at sun.reflect.DelegatingMethodAccessorImpl.invoke(DelegatingMethodAccessorImpl.java:25)
	at java.lang.reflect.Method.invoke(Method.java:597)
	at org.codehaus.plexus.classworlds.launcher.Launcher.launchStandard(Launcher.java:329)
	at org.codehaus.plexus.classworlds.launcher.Launcher.launch(Launcher.java:239)
	at org.jvnet.hudson.maven3.agent.Maven3Main.launch(Maven3Main.java:158)
	at hudson.maven.Maven3Builder.call(Maven3Builder.java:112)
	at hudson.maven.Maven3Builder.call(Maven3Builder.java:70)
	at hudson.remoting.UserRequest.perform(UserRequest.java:118)
	at hudson.remoting.UserRequest.perform(UserRequest.java:48)
	at hudson.remoting.Request$2.run(Request.java:287)
	at java.util.concurrent.Executors$RunnableAdapter.call(Executors.java:441)
	at java.util.concurrent.FutureTask$Sync.innerRun(FutureTask.java:303)
	at java.util.concurrent.FutureTask.run(FutureTask.java:138)
	at java.util.concurrent.ThreadPoolExecutor$Worker.runTask(ThreadPoolExecutor.java:886)
	at java.util.concurrent.ThreadPoolExecutor$Worker.run(ThreadPoolExecutor.java:908)
	at java.lang.Thread.run(Thread.java:662)
Caused by: java.lang.NullPointerException
	at hudson.maven.ExecutedMojo.getMojoClass(ExecutedMojo.java:114)
	at hudson.maven.ExecutedMojo.<init>(ExecutedMojo.java:99)
	at hudson.maven.Maven3Builder$MavenExecutionListener.recordExecutionTime(Maven3Builder.java:524)
	at hudson.maven.Maven3Builder$MavenExecutionListener.recordMojoSucceeded(Maven3Builder.java:493)
	at hudson.maven.Maven3Builder$MavenExecutionListener.forkSucceeded(Maven3Builder.java:601)
	at org.apache.maven.lifecycle.internal.DefaultExecutionEventCatapult.fire(DefaultExecutionEventCatapult.java:97)
	at org.apache.maven.lifecycle.internal.DefaultExecutionEventCatapult.fire(DefaultExecutionEventCatapult.java:42)
	at org.apache.maven.lifecycle.internal.MojoExecutor.executeForkedExecutions(MojoExecutor.java:383)
	at org.apache.maven.lifecycle.internal.MojoExecutor.execute(MojoExecutor.java:199)
	at org.apache.maven.lifecycle.internal.MojoExecutor.execute(MojoExecutor.java:153)
	at org.apache.maven.lifecycle.internal.MojoExecutor.execute(MojoExecutor.java:145)
	at org.apache.maven.lifecycle.internal.LifecycleModuleBuilder.buildProject(LifecycleModuleBuilder.java:84)
	... 24 more
Sending e-mails to: commits@activemq.apache.org
channel stopped
IRC notifier plugin: Sending notification to: #activemq


Mime
View raw message