activemq-commits mailing list archives

Site index · List index
Message view « Date » · « Thread »
Top « Date » · « Thread »
From Apache Jenkins Server <jenk...@builds.apache.org>
Subject Build failed in Jenkins: ActiveMQ-Apollo #455
Date Wed, 23 Nov 2011 20:07:23 GMT
See <https://builds.apache.org/job/ActiveMQ-Apollo/455/>

------------------------------------------
[...truncated 3463 lines...]
[INFO] --- maven-install-plugin:2.3.1:install (default-install) @ apollo-cli ---
[INFO] Installing <https://builds.apache.org/job/ActiveMQ-Apollo/ws/trunk/apollo-cli/pom.xml>
to /home/jenkins/.m2/repository/org/apache/activemq/apollo-cli/1.0-SNAPSHOT/apollo-cli-1.0-SNAPSHOT.pom
[JENKINS] Archiving disabled - not archiving <https://builds.apache.org/job/ActiveMQ-Apollo/ws/trunk/apollo-cli/pom.xml>
[JENKINS] Archiving disabled - not archiving <https://builds.apache.org/job/ActiveMQ-Apollo/ws/trunk/apollo-cli/target/apollo-cli-1.0-SNAPSHOT.jar>
[INFO]                                                                         
[INFO] ------------------------------------------------------------------------
[INFO] Building apollo-website 1.0-SNAPSHOT
[INFO] ------------------------------------------------------------------------
Downloading: http://download.java.net/maven/2/org/fusesource/scalate/scalate-wikitext/1.5.3/scalate-wikitext-1.5.3.pom
Downloading: http://maven.glassfish.org/content/groups/glassfish/org/fusesource/scalate/scalate-wikitext/1.5.3/scalate-wikitext-1.5.3.pom
Downloaded: http://maven.glassfish.org/content/groups/glassfish/org/fusesource/scalate/scalate-wikitext/1.5.3/scalate-wikitext-1.5.3.pom
(3 KB at 1.9 KB/sec)
Downloading: http://download.java.net/maven/2/org/fusesource/scalate/scalate-page/1.5.3/scalate-page-1.5.3.pom
Downloading: http://maven.glassfish.org/content/groups/glassfish/org/fusesource/scalate/scalate-page/1.5.3/scalate-page-1.5.3.pom
Downloaded: http://maven.glassfish.org/content/groups/glassfish/org/fusesource/scalate/scalate-page/1.5.3/scalate-page-1.5.3.pom
(3 KB at 3.2 KB/sec)
Downloading: http://download.java.net/maven/2/org/fusesource/scalate/scalate-wikitext/1.5.3/scalate-wikitext-1.5.3.jar
Downloading: http://download.java.net/maven/2/org/fusesource/scalate/scalate-page/1.5.3/scalate-page-1.5.3.jar
Downloading: http://maven.glassfish.org/content/groups/glassfish/org/fusesource/scalate/scalate-wikitext/1.5.3/scalate-wikitext-1.5.3.jar
Downloading: http://maven.glassfish.org/content/groups/glassfish/org/fusesource/scalate/scalate-page/1.5.3/scalate-page-1.5.3.jar
Downloaded: http://maven.glassfish.org/content/groups/glassfish/org/fusesource/scalate/scalate-page/1.5.3/scalate-page-1.5.3.jar
(95 KB at 89.0 KB/sec)
Downloaded: http://maven.glassfish.org/content/groups/glassfish/org/fusesource/scalate/scalate-wikitext/1.5.3/scalate-wikitext-1.5.3.jar
(159 KB at 133.6 KB/sec)
[INFO] 
[INFO] --- maven-clean-plugin:2.4.1:clean (default-clean) @ apollo-website ---
[INFO] 
[INFO] --- maven-enforcer-plugin:1.0:enforce (default) @ apollo-website ---
[INFO] [WARNING] Parameter tasks is deprecated, use target instead

[INFO] --- maven-antrun-plugin:1.6:run (default) @ apollo-website ---
[INFO] Executing tasks

main:
    [mkdir] Created dir: <https://builds.apache.org/job/ActiveMQ-Apollo/ws/trunk/apollo-website/target/sitegen/documentation/schema>
[schemagen] Generating schema from 64 source files
Note: Writing <https://builds.apache.org/job/ActiveMQ-Apollo/ws/trunk/apollo-website/target/sitegen/documentation/schema/apollo.xsd>
[INFO] Executed tasks
[INFO] 
[INFO] --- maven-remote-resources-plugin:1.1:process (default) @ apollo-website ---
[INFO] [INFO] Checking for multiple versions of scala

[INFO] --- maven-scala-plugin:2.15.2:compile (default) @ apollo-website ---
[INFO] includes = [**/*.scala,**/*.java,]
[INFO] excludes = []
[INFO] /x1/jenkins/jenkins-slave/workspace/ActiveMQ-Apollo/trunk/apollo-website/ext:-1: info:
compiling
[INFO] Compiling 3 source files to /x1/jenkins/jenkins-slave/workspace/ActiveMQ-Apollo/trunk/apollo-website/target/classes
at 1322078819161
[INFO] compiler plugin: BasicArtifact(org.scala-lang.plugins,continuations,2.9.1)
[INFO] compiler plugin: BasicArtifact(org.fusesource.jvmassert,jvmassert,1.2)
[INFO] prepare-compile in 0 s
[INFO] compile in 4 s
[INFO] [INFO] Checking for multiple versions of scala

[INFO] --- maven-scala-plugin:2.15.2:testCompile (default) @ apollo-website ---[INFO] includes
= [**/*.scala,**/*.java,]
[INFO] excludes = []

[WARNING] No source files found.
[INFO] 
[INFO] --- maven-enforcer-plugin:1.0:enforce (default) @ apollo-website ---
[JENKINS] Archiving disabled - not archiving <https://builds.apache.org/job/ActiveMQ-Apollo/ws/trunk/apollo-website/pom.xml>
ignoring exception during new ExecutedMojo null
[INFO] 
[INFO] --- maven-source-plugin:2.1.2:jar (attach-sources) @ apollo-website ---
[INFO] 
[INFO] --- maven-enforcer-plugin:1.0:enforce (default) @ apollo-website ---
[INFO] [WARNING] Parameter tasks is deprecated, use target instead

[INFO] --- maven-antrun-plugin:1.6:run (default) @ apollo-website ---
[INFO] Executing tasks

main:
[schemagen] Generating schema from 64 source files
Note: Writing <https://builds.apache.org/job/ActiveMQ-Apollo/ws/trunk/apollo-website/target/sitegen/documentation/schema/apollo.xsd>
[INFO] Executed tasks
[INFO] 
[INFO] --- maven-remote-resources-plugin:1.1:process (default) @ apollo-website ---
[INFO] [INFO] Checking for multiple versions of scala

[INFO] --- maven-scala-plugin:2.15.2:compile (default) @ apollo-website ---
[INFO] includes = [**/*.scala,**/*.java,]
[INFO] excludes = []
[INFO] Nothing to compile - all classes are up to date
[INFO] [INFO] Checking for multiple versions of scala

[INFO] --- maven-scala-plugin:2.15.2:testCompile (default) @ apollo-website ---
[INFO] includes = [**/*.scala,**/*.java,]
[INFO] excludes = []
[WARNING] No source files found.
[INFO] 
[INFO] --- maven-enforcer-plugin:1.0:enforce (default) @ apollo-website ---
[JENKINS] Archiving disabled - not archiving <https://builds.apache.org/job/ActiveMQ-Apollo/ws/trunk/apollo-website/pom.xml>
ignoring exception during new ExecutedMojo null
[INFO] 
[INFO] --- maven-source-plugin:2.1.2:jar (attach-sources) @ apollo-website ---
[JENKINS] Archiving disabled - not archiving <https://builds.apache.org/job/ActiveMQ-Apollo/ws/trunk/apollo-website/pom.xml>
ignoring exception during new ExecutedMojo null
[INFO] Processing Configuration for child elements
Processing child [project]
Processing child [workingDirectory]
Processing child [webappDirectory]
Processing child [targetDirectory]
Processing child [testClassPathElements]
[INFO] Generating static website from Scalate Templates and wiki files...
[INFO] template properties: null

[INFO] --- maven-scalate-plugin:1.5.3:sitegen (sitegen) @ apollo-website ---
Using dir: <https://builds.apache.org/job/ActiveMQ-Apollo/ws/trunk/apollo-website/src/blog>
at request path: /blog
[INFO]     processing <https://builds.apache.org/job/ActiveMQ-Apollo/ws/trunk/apollo-website/src/blog/index.page>
with uri: /blog/index.page => 
[INFO]     processing <https://builds.apache.org/job/ActiveMQ-Apollo/ws/trunk/apollo-website/src/blog/releases/release-1-0-beta4.page>
with uri: /blog/releases/release-1-0-beta4.page => 
[INFO]     processing <https://builds.apache.org/job/ActiveMQ-Apollo/ws/trunk/apollo-website/src/blog/releases/release-1-0-beta2.page>
with uri: /blog/releases/release-1-0-beta2.page => 
[INFO]     processing <https://builds.apache.org/job/ActiveMQ-Apollo/ws/trunk/apollo-website/src/blog/releases/release-1-0-beta3.page>
with uri: /blog/releases/release-1-0-beta3.page => 
[INFO]     processing <https://builds.apache.org/job/ActiveMQ-Apollo/ws/trunk/apollo-website/src/blog/releases/release-1-0-beta1.page>
with uri: /blog/releases/release-1-0-beta1.page => 
[INFO]     processing <https://builds.apache.org/job/ActiveMQ-Apollo/ws/trunk/apollo-website/src/blog/releases/release-1-0-beta5.page>
with uri: /blog/releases/release-1-0-beta5.page => 
Using dir: <https://builds.apache.org/job/ActiveMQ-Apollo/ws/trunk/apollo-website/src/blog>
at request path: /blog
[INFO]     processing <https://builds.apache.org/job/ActiveMQ-Apollo/ws/trunk/apollo-website/src/blog/index.rss.feed>
with uri: /blog/index.rss.feed => 
[INFO]     processing <https://builds.apache.org/job/ActiveMQ-Apollo/ws/trunk/apollo-website/src/index.page>
with uri: /index.page => 
[INFO]     processing <https://builds.apache.org/job/ActiveMQ-Apollo/ws/trunk/apollo-website/src/versions/index.page>
with uri: /versions/index.page => 
[INFO]     processing <https://builds.apache.org/job/ActiveMQ-Apollo/ws/trunk/apollo-website/src/documentation/verification.md>
with uri: /documentation/verification.md => 
[INFO]     processing <https://builds.apache.org/job/ActiveMQ-Apollo/ws/trunk/apollo-website/src/documentation/index.page>
with uri: /documentation/index.page => 
[INFO]     processing <https://builds.apache.org/job/ActiveMQ-Apollo/ws/trunk/apollo-website/src/documentation/module-organization.page>
with uri: /documentation/module-organization.page => 
[INFO]     processing <https://builds.apache.org/job/ActiveMQ-Apollo/ws/trunk/apollo-website/src/documentation/extending-guide.md>
with uri: /documentation/extending-guide.md => 
[INFO]     processing <https://builds.apache.org/job/ActiveMQ-Apollo/ws/trunk/apollo-website/src/documentation/performance-scaling.md>
with uri: /documentation/performance-scaling.md => 
[INFO]     processing <https://builds.apache.org/job/ActiveMQ-Apollo/ws/trunk/apollo-website/src/documentation/getting-started.md>
with uri: /documentation/getting-started.md => 
[INFO]     processing <https://builds.apache.org/job/ActiveMQ-Apollo/ws/trunk/apollo-website/src/documentation/user-manual.md>
with uri: /documentation/user-manual.md => 
[INFO]     processing <https://builds.apache.org/job/ActiveMQ-Apollo/ws/trunk/apollo-website/src/documentation/architecture.md>
with uri: /documentation/architecture.md => 
[INFO]     processing <https://builds.apache.org/job/ActiveMQ-Apollo/ws/trunk/apollo-website/src/documentation/management-api.md>
with uri: /documentation/management-api.md => 
[INFO]     processing <https://builds.apache.org/job/ActiveMQ-Apollo/ws/trunk/apollo-website/src/download.page>
with uri: /download.page => 
[INFO]     processing <https://builds.apache.org/job/ActiveMQ-Apollo/ws/trunk/apollo-website/src/community/release-guide.page>
with uri: /community/release-guide.page => 
[INFO]     processing <https://builds.apache.org/job/ActiveMQ-Apollo/ws/trunk/apollo-website/src/community/index.page>
with uri: /community/index.page => 
[INFO]     processing <https://builds.apache.org/job/ActiveMQ-Apollo/ws/trunk/apollo-website/src/community/faq.page>
with uri: /community/faq.page => 
[INFO]     processing <https://builds.apache.org/job/ActiveMQ-Apollo/ws/trunk/apollo-website/src/community/building.page>
with uri: /community/building.page => 
[INFO]     processing <https://builds.apache.org/job/ActiveMQ-Apollo/ws/trunk/apollo-website/src/community/site.page>
with uri: /community/site.page => 
[INFO]     processing <https://builds.apache.org/job/ActiveMQ-Apollo/ws/trunk/apollo-website/src/community/contributing.page>
with uri: /community/contributing.page => 
[INFO]     processing <https://builds.apache.org/job/ActiveMQ-Apollo/ws/trunk/apollo-website/src/community/source.page>
with uri: /community/source.page => 
[INFO]     processing <https://builds.apache.org/job/ActiveMQ-Apollo/ws/trunk/apollo-website/src/community/support.page>
with uri: /community/support.page => 
[INFO]     processing <https://builds.apache.org/job/ActiveMQ-Apollo/ws/trunk/apollo-website/src/community/developers.page>
with uri: /community/developers.page => 
[INFO]     processing <https://builds.apache.org/job/ActiveMQ-Apollo/ws/trunk/apollo-website/src/privacy-policy.page>
with uri: /privacy-policy.page => 
[INFO] [INFO] Installing <https://builds.apache.org/job/ActiveMQ-Apollo/ws/trunk/apollo-website/pom.xml>
to /home/jenkins/.m2/repository/org/apache/activemq/apollo-website/1.0-SNAPSHOT/apollo-website-1.0-SNAPSHOT.pom

[INFO] --- maven-install-plugin:2.3.1:install (default-install) @ apollo-website ---
[JENKINS] Archiving disabled - not archiving <https://builds.apache.org/job/ActiveMQ-Apollo/ws/trunk/apollo-website/pom.xml>
[INFO]                                                                         
[INFO] ------------------------------------------------------------------------
[INFO] Skipping apache-apollo
[INFO] This project has been banned from the build due to previous failures.
[INFO] ------------------------------------------------------------------------
[INFO]                                                                         
[INFO] ------------------------------------------------------------------------
[INFO] Building apollo-karaf-feature 1.0-SNAPSHOT
[INFO] ------------------------------------------------------------------------
[INFO] 
[INFO] --- maven-clean-plugin:2.4.1:clean (default-clean) @ apollo-karaf-feature ---
[INFO] 
[INFO] --- maven-enforcer-plugin:1.0:enforce (default) @ apollo-karaf-feature ---
[INFO] 
[INFO] --- maven-remote-resources-plugin:1.1:process (default) @ apollo-karaf-feature ---
[INFO] [INFO] Using 'UTF-8' encoding to copy filtered resources.
[INFO] Copying 1 resource
[INFO] Copying 3 resources

[INFO] --- maven-resources-plugin:2.4.3:resources (filter) @ apollo-karaf-feature ---
[INFO] 
[INFO] --- build-helper-maven-plugin:1.2:attach-artifact (attach-artifacts) @ apollo-karaf-feature
---
[INFO] [INFO] Installing <https://builds.apache.org/job/ActiveMQ-Apollo/ws/trunk/apollo-karaf-feature/pom.xml>
to /home/jenkins/.m2/repository/org/apache/activemq/apollo-karaf-feature/1.0-SNAPSHOT/apollo-karaf-feature-1.0-SNAPSHOT.pom

[INFO] --- maven-install-plugin:2.3.1:install (default-install) @ apollo-karaf-feature ---
[INFO] Installing <https://builds.apache.org/job/ActiveMQ-Apollo/ws/trunk/apollo-karaf-feature/target/classes/features.xml>
to /home/jenkins/.m2/repository/org/apache/activemq/apollo-karaf-feature/1.0-SNAPSHOT/apollo-karaf-feature-1.0-SNAPSHOT-features.xml
[JENKINS] Archiving disabled - not archiving <https://builds.apache.org/job/ActiveMQ-Apollo/ws/trunk/apollo-karaf-feature/pom.xml>
[JENKINS] Archiving disabled - not archiving <https://builds.apache.org/job/ActiveMQ-Apollo/ws/trunk/apollo-karaf-feature/target/classes/features.xml>
[INFO] ------------------------------------------------------------------------
[INFO] Reactor Summary:
[INFO] 
[INFO] Apache ActiveMQ Apollo Project .................... SUCCESS [2.672s]
[INFO] apollo-boot ....................................... SUCCESS [2.279s]
[INFO] apollo-scala ...................................... SUCCESS [1.327s]
[INFO] apollo-util ....................................... SUCCESS [36.164s]
[INFO] apollo-transport .................................. SUCCESS [8.798s]
[INFO] apollo-dto ........................................ SUCCESS [4.319s]
[INFO] apollo-selector ................................... SUCCESS [2.764s]
[INFO] apollo-broker ..................................... SUCCESS [46.133s]
[INFO] apollo-tcp ........................................ SUCCESS [6.449s]
[INFO] apollo-web ........................................ SUCCESS [1:01.131s]
[INFO] apollo-leveldb .................................... FAILURE [12.164s]
[INFO] apollo-bdb ........................................ SUCCESS [33.331s]
[INFO] apollo-jdbm2 ...................................... SUCCESS [36.499s]
[INFO] apollo-stomp ...................................... SUCCESS [48.546s]
[INFO] apollo-cli ........................................ SUCCESS [13.045s]
[INFO] apollo-website .................................... SUCCESS [21.693s]
[INFO] apache-apollo ..................................... SKIPPED
[INFO] apollo-karaf-feature .............................. SUCCESS [0.443s]
[INFO] ------------------------------------------------------------------------
[INFO] BUILD FAILURE
[INFO] ------------------------------------------------------------------------
[INFO] Total time: 5:48.663s
[INFO] Finished at: Wed Nov 23 20:07:16 UTC 2011
[INFO] Final Memory: 282M/1104M
[INFO] ------------------------------------------------------------------------
mavenExecutionResult exceptions not empty
message : Failed to execute goal on project apollo-leveldb: Could not resolve dependencies
for project org.apache.activemq:apollo-leveldb:jar:1.0-SNAPSHOT: Could not find artifact org.iq80.leveldb:leveldb:jar:0.1-SNAPSHOT
in Nexus (http://repository.apache.org/snapshots)
cause : Could not resolve dependencies for project org.apache.activemq:apollo-leveldb:jar:1.0-SNAPSHOT:
Could not find artifact org.iq80.leveldb:leveldb:jar:0.1-SNAPSHOT in Nexus (http://repository.apache.org/snapshots)
Stack trace : 
org.apache.maven.lifecycle.LifecycleExecutionException: Failed to execute goal on project
apollo-leveldb: Could not resolve dependencies for project org.apache.activemq:apollo-leveldb:jar:1.0-SNAPSHOT:
Could not find artifact org.iq80.leveldb:leveldb:jar:0.1-SNAPSHOT in Nexus (http://repository.apache.org/snapshots)
	at org.apache.maven.lifecycle.internal.LifecycleDependencyResolver.getDependencies(LifecycleDependencyResolver.java:190)
	at org.apache.maven.lifecycle.internal.LifecycleDependencyResolver.resolveProjectDependencies(LifecycleDependencyResolver.java:104)
	at org.apache.maven.lifecycle.internal.MojoExecutor.ensureDependenciesAreResolved(MojoExecutor.java:258)
	at org.apache.maven.lifecycle.internal.MojoExecutor.execute(MojoExecutor.java:201)
	at org.apache.maven.lifecycle.internal.MojoExecutor.execute(MojoExecutor.java:153)
	at org.apache.maven.lifecycle.internal.MojoExecutor.execute(MojoExecutor.java:145)
	at org.apache.maven.lifecycle.internal.LifecycleModuleBuilder.buildProject(LifecycleModuleBuilder.java:84)
	at org.apache.maven.lifecycle.internal.LifecycleModuleBuilder.buildProject(LifecycleModuleBuilder.java:59)
	at org.apache.maven.lifecycle.internal.LifecycleStarter.singleThreadedBuild(LifecycleStarter.java:183)
	at org.apache.maven.lifecycle.internal.LifecycleStarter.execute(LifecycleStarter.java:161)
	at org.apache.maven.DefaultMaven.doExecute(DefaultMaven.java:319)
	at org.apache.maven.DefaultMaven.execute(DefaultMaven.java:156)
	at org.jvnet.hudson.maven3.launcher.Maven3Launcher.main(Maven3Launcher.java:79)
	at sun.reflect.NativeMethodAccessorImpl.invoke0(Native Method)
	at sun.reflect.NativeMethodAccessorImpl.invoke(NativeMethodAccessorImpl.java:39)
	at sun.reflect.DelegatingMethodAccessorImpl.invoke(DelegatingMethodAccessorImpl.java:25)
	at java.lang.reflect.Method.invoke(Method.java:597)
	at org.codehaus.plexus.classworlds.launcher.Launcher.launchStandard(Launcher.java:329)
	at org.codehaus.plexus.classworlds.launcher.Launcher.launch(Launcher.java:239)
	at org.jvnet.hudson.maven3.agent.Maven3Main.launch(Maven3Main.java:158)
	at hudson.maven.Maven3Builder.call(Maven3Builder.java:122)
	at hudson.maven.Maven3Builder.call(Maven3Builder.java:74)
	at hudson.remoting.UserRequest.perform(UserRequest.java:118)
	at hudson.remoting.UserRequest.perform(UserRequest.java:48)
	at hudson.remoting.Request$2.run(Request.java:287)
	at java.util.concurrent.Executors$RunnableAdapter.call(Executors.java:441)
	at java.util.concurrent.FutureTask$Sync.innerRun(FutureTask.java:303)
	at java.util.concurrent.FutureTask.run(FutureTask.java:138)
	at java.util.concurrent.ThreadPoolExecutor$Worker.runTask(ThreadPoolExecutor.java:886)
	at java.util.concurrent.ThreadPoolExecutor$Worker.run(ThreadPoolExecutor.java:908)
	at java.lang.Thread.run(Thread.java:662)
Caused by: org.apache.maven.project.DependencyResolutionException: Could not resolve dependencies
for project org.apache.activemq:apollo-leveldb:jar:1.0-SNAPSHOT: Could not find artifact org.iq80.leveldb:leveldb:jar:0.1-SNAPSHOT
in Nexus (http://repository.apache.org/snapshots)
	at org.apache.maven.project.DefaultProjectDependenciesResolver.resolve(DefaultProjectDependenciesResolver.java:156)
	at org.apache.maven.lifecycle.internal.LifecycleDependencyResolver.getDependencies(LifecycleDependencyResolver.java:165)
	... 30 more
Caused by: org.sonatype.aether.resolution.ArtifactResolutionException: Could not find artifact
org.iq80.leveldb:leveldb:jar:0.1-SNAPSHOT in Nexus (http://repository.apache.org/snapshots)
	at org.sonatype.aether.impl.internal.DefaultArtifactResolver.resolveArtifacts(DefaultArtifactResolver.java:526)
	at org.sonatype.aether.impl.internal.DefaultRepositorySystem.resolveArtifacts(DefaultRepositorySystem.java:304)
	at org.sonatype.aether.impl.internal.DefaultRepositorySystem.resolveDependencies(DefaultRepositorySystem.java:334)
	at org.apache.maven.project.DefaultProjectDependenciesResolver.resolve(DefaultProjectDependenciesResolver.java:150)
	... 31 more
Caused by: org.sonatype.aether.transfer.ArtifactNotFoundException: Could not find artifact
org.iq80.leveldb:leveldb:jar:0.1-SNAPSHOT in Nexus (http://repository.apache.org/snapshots)
	at org.sonatype.aether.connector.wagon.WagonRepositoryConnector$4.wrap(WagonRepositoryConnector.java:945)
	at org.sonatype.aether.connector.wagon.WagonRepositoryConnector$4.wrap(WagonRepositoryConnector.java:940)
	at org.sonatype.aether.connector.wagon.WagonRepositoryConnector$GetTask.flush(WagonRepositoryConnector.java:696)
	at org.sonatype.aether.connector.wagon.WagonRepositoryConnector$GetTask.flush(WagonRepositoryConnector.java:690)
	at org.sonatype.aether.connector.wagon.WagonRepositoryConnector.get(WagonRepositoryConnector.java:435)
	at org.sonatype.aether.impl.internal.DefaultArtifactResolver.resolveArtifacts(DefaultArtifactResolver.java:438)
	... 34 more
Sending e-mails to: commits@activemq.apache.org
channel stopped


Mime
View raw message