activemq-commits mailing list archives

Site index · List index
Message view « Date » · « Thread »
Top « Date » · « Thread »
From "Hiram Chirino (Resolved) (JIRA)" <j...@apache.org>
Subject [jira] [Resolved] (APLO-87) Build fails on windows
Date Tue, 11 Oct 2011 16:23:12 GMT

     [ https://issues.apache.org/jira/browse/APLO-87?page=com.atlassian.jira.plugin.system.issuetabpanels:all-tabpanel
]

Hiram Chirino resolved APLO-87.
-------------------------------

       Resolution: Fixed
    Fix Version/s: 1.0
         Assignee: Hiram Chirino

Thanks for the patch! Applied.
                
> Build fails on windows
> ----------------------
>
>                 Key: APLO-87
>                 URL: https://issues.apache.org/jira/browse/APLO-87
>             Project: ActiveMQ Apollo
>          Issue Type: Bug
>          Components: apollo-website
>    Affects Versions: 1.0-beta4
>         Environment: Windows
>            Reporter: Jason Sherman
>            Assignee: Hiram Chirino
>             Fix For: 1.0
>
>         Attachments: APLO-87.patch
>
>
> Build failed on apollo-website module.
> [INFO] ------------------------------------------------------------------------
> [INFO] Reactor Summary:
> [INFO]
> [INFO] Apache ActiveMQ Apollo Project .................... SUCCESS [1.857s]
> [INFO] apollo-boot ....................................... SUCCESS [6.614s]
> [INFO] apollo-scala ...................................... SUCCESS [0.686s]
> [INFO] apollo-util ....................................... SUCCESS [54.569s]
> [INFO] apollo-transport .................................. SUCCESS [2.153s]
> [INFO] apollo-dto ........................................ SUCCESS [10.031s]
> [INFO] apollo-selector ................................... SUCCESS [5.257s]
> [INFO] apollo-broker ..................................... SUCCESS [1:32.461s]
> [INFO] apollo-tcp ........................................ SUCCESS [2.434s]
> [INFO] apollo-web ........................................ SUCCESS [3:16.853s]
> [INFO] apollo-bdb ........................................ SUCCESS [1:20.020s]
> [INFO] apollo-jdbm2 ...................................... SUCCESS [58.828s]
> [INFO] apollo-stomp ...................................... SUCCESS [1:41.649s]
> [INFO] apollo-cli ........................................ SUCCESS [1:12.884s]
> [INFO] apollo-website .................................... FAILURE [2.995s]
> [INFO] apache-apollo ..................................... SKIPPED
> [INFO] apollo-karaf-feature .............................. SKIPPED
> [INFO] ------------------------------------------------------------------------
> [INFO] BUILD FAILURE
> [INFO] ------------------------------------------------------------------------
> [INFO] Total time: 11:30.102s
> [INFO] Finished at: Thu Oct 06 16:53:02 EDT 2011
> [INFO] Final Memory: 26M/130M
> [INFO] ------------------------------------------------------------------------
> [ERROR] Failed to execute goal org.apache.maven.plugins:maven-antrun-plugin:1.6:run (default)
on project apollo-website: An Ant BuildException has occured: taskdef A class needed by class
com.sun.tools.jxc.SchemaGenTask cannot be found: com/sun/mirror/apt/AnnotationProcessorFactory
> [ERROR] using the classloader AntClassLoader[C:\Users\Jason\.m2\repository\org\fusesource\scalate\scalate-wikitext\1.5.1\scalate-wikitext-1.5.1.jar;C:\Users\Jason\.m2\repository\org\fusesource\scalate\scalate-core\1.5.1\scalate-core-1.5.1.jar;C:\Users\Jason\.m2\repository\org\fusesource\scalate\scal
> ate-util\1.5.1\scalate-util-1.5.1.jar;C:\Users\Jason\.m2\repository\org\fusesource\wikitext\confluence-core\1.2\confluence-core-1.2.jar;C:\Users\Jason\.m2\repository\org\fusesource\wikitext\wikitext-core\1.2\wikitext-core-1.2.jar;C:\Users\Jason\.m2\repository\org\fusesource\wikitext\textile-core\1.2
> \textile-core-1.2.jar;C:\Users\Jason\.m2\repository\org\fusesource\scalate\scalate-page\1.5.1\scalate-page-1.5.1.jar;C:\Users\Jason\.m2\repository\org\yaml\snakeyaml\1.7\snakeyaml-1.7.jar;C:\Users\Jason\.m2\repository\org\fusesource\scalamd\scalamd\1.5\scalamd-1.5.jar;C:\Users\Jason\.m2\repository\o
> rg\slf4j\slf4j-log4j12\1.6.1\slf4j-log4j12-1.6.1.jar;C:\Users\Jason\.m2\repository\org\slf4j\slf4j-api\1.6.1\slf4j-api-1.6.1.jar;C:\Users\Jason\.m2\repository\log4j\log4j\1.2.16\log4j-1.2.16.jar;C:\Users\Jason\.m2\repository\org\codehaus\jackson\jackson-core-asl\1.6.1\jackson-core-asl-1.6.1.jar;C:\U
> sers\Jason\.m2\repository\org\codehaus\jackson\jackson-mapper-asl\1.6.1\jackson-mapper-asl-1.6.1.jar;C:\Users\Jason\.m2\repository\org\scala-lang\scala-library\2.9.0-1\scala-library-2.9.0-1.jar;C:\Users\Jason\.m2\repository\org\scala-lang\scala-compiler\2.9.0-1\scala-compiler-2.9.0-1.jar]:
com.sun.m
> irror.apt.AnnotationProcessorFactory
> [ERROR] -> [Help 1]
> [ERROR]
> [ERROR] To see the full stack trace of the errors, re-run Maven with the -e switch.
> [ERROR] Re-run Maven using the -X switch to enable full debug logging.
> [ERROR]
> [ERROR] For more information about the errors and possible solutions, please read the
following articles:
> [ERROR] [Help 1] http://cwiki.apache.org/confluence/display/MAVEN/MojoExecutionException
> [ERROR]
> [ERROR] After correcting the problems, you can resume the build with the command
> [ERROR]   mvn <goals> -rf :apollo-website
> C:\Development\sandbox\activemq\apollo>

--
This message is automatically generated by JIRA.
If you think it was sent incorrectly, please contact your JIRA administrators: https://issues.apache.org/jira/secure/ContactAdministrators!default.jspa
For more information on JIRA, see: http://www.atlassian.com/software/jira

        

Mime
View raw message