activemq-commits mailing list archives

Site index · List index
Message view « Date » · « Thread »
Top « Date » · « Thread »
From Apache Jenkins Server <jenk...@builds.apache.org>
Subject Build failed in Jenkins: ActiveMQ-Apollo #447
Date Wed, 14 Sep 2011 14:39:48 GMT
See <https://builds.apache.org/job/ActiveMQ-Apollo/447/>

------------------------------------------
[...truncated 3192 lines...]
[INFO] --- maven-remote-resources-plugin:1.1:process (default) @ apollo-cli ---
[INFO] 
[INFO] --- maven-resources-plugin:2.4.3:resources (default-resources) @ apollo-cli ---
[INFO] Using 'UTF-8' encoding to copy filtered resources.
[INFO] Copying 14 resources
[INFO] Copying 2 resources
[INFO] Copying 3 resources
[INFO] 
[INFO] --- maven-dependency-plugin:2.2:copy (unpack) @ apollo-cli ---
[INFO] Configured Artifact: com.sun.winsw:winsw:bin:1.8:exe
[INFO] Copying winsw-1.8-bin.exe to F:\hudson\hudson-slave\workspace\ActiveMQ-Apollo\trunk\apollo-cli\target\classes\org\apache\activemq\apollo\cli\commands\bin\apollo-broker-service.exe
[INFO] 
[INFO] --- maven-compiler-plugin:2.3.2:compile (default-compile) @ apollo-cli ---
[INFO] Nothing to compile - all classes are up to date
[INFO] 
[INFO] --- maven-scala-plugin:2.15.2:compile (default) @ apollo-cli ---
[INFO] Checking for multiple versions of scala
[INFO] includes = [**/*.scala,**/*.java,]
[INFO] excludes = []
[INFO] F:\hudson\hudson-slave\workspace\ActiveMQ-Apollo\trunk\apollo-cli\src\main\scala:-1:
info: compiling
[INFO] Compiling 13 source files to F:\hudson\hudson-slave\workspace\ActiveMQ-Apollo\trunk\apollo-cli\target\classes
at 1316011142284
[INFO] compiler plugin: BasicArtifact(org.scala-lang.plugins,continuations,2.9.0-1)
[INFO] compiler plugin: BasicArtifact(org.fusesource.jvmassert,jvmassert,1.2)
[INFO] prepare-compile in 0 s
[INFO] compile in 13 s
[INFO] 
[INFO] Using 'UTF-8' encoding to copy filtered resources.
[INFO] --- maven-resources-plugin:2.4.3:testResources (default-testResources) @ apollo-cli
---
[INFO] Copying 3 resources
[INFO] Copying 3 resources
[INFO] 
[INFO] --- maven-compiler-plugin:2.3.2:testCompile (default-testCompile) @ apollo-cli ---
[INFO] Nothing to compile - all classes are up to date
[INFO] 
[INFO] --- maven-scala-plugin:2.15.2:testCompile (default) @ apollo-cli ---
[INFO] Checking for multiple versions of scala
[INFO] includes = [**/*.scala,**/*.java,]
[INFO] excludes = []
[INFO] F:\hudson\hudson-slave\workspace\ActiveMQ-Apollo\trunk\apollo-cli\src\test\scala:-1:
info: compiling
[INFO] Compiling 1 source files to F:\hudson\hudson-slave\workspace\ActiveMQ-Apollo\trunk\apollo-cli\target\test-classes
at 1316011156290
[INFO] compiler plugin: BasicArtifact(org.scala-lang.plugins,continuations,2.9.0-1)
[INFO] compiler plugin: BasicArtifact(org.fusesource.jvmassert,jvmassert,1.2)
[INFO] prepare-compile in 0 s
[INFO] compile in 7 s
[INFO] 
[INFO] --- maven-surefire-plugin:2.4.3:test (default-test) @ apollo-cli ---
[INFO] Surefire report directory: F:\hudson\hudson-slave\workspace\ActiveMQ-Apollo\trunk\apollo-cli\target\surefire-reports

-------------------------------------------------------
 T E S T S
-------------------------------------------------------
There are no tests to run.

Results :

Tests run: 0, Failures: 0, Errors: 0, Skipped: 0

[JENKINS] Recording test results
[INFO] 
[INFO] --- maven-jar-plugin:2.3.1:jar (default-jar) @ apollo-cli ---
[INFO] Building jar: F:\hudson\hudson-slave\workspace\ActiveMQ-Apollo\trunk\apollo-cli\target\apollo-cli-1.0-SNAPSHOT.jar
[INFO] [INFO] Installing F:\hudson\hudson-slave\workspace\ActiveMQ-Apollo\trunk\apollo-cli\target\apollo-cli-1.0-SNAPSHOT.jar
to C:\Users\hudson\.m2\repository\org\apache\activemq\apollo-cli\1.0-SNAPSHOT\apollo-cli-1.0-SNAPSHOT.jar

[INFO] --- maven-install-plugin:2.3.1:install (default-install) @ apollo-cli ---
[INFO] Installing F:\hudson\hudson-slave\workspace\ActiveMQ-Apollo\trunk\apollo-cli\pom.xml
to C:\Users\hudson\.m2\repository\org\apache\activemq\apollo-cli\1.0-SNAPSHOT\apollo-cli-1.0-SNAPSHOT.pom
projectSucceeded org.apache.activemq:apollo-cli:1.0-SNAPSHOT
[JENKINS] Archiving disabled - not archiving F:\hudson\hudson-slave\workspace\ActiveMQ-Apollo\trunk\apollo-cli\pom.xml
[JENKINS] Archiving disabled - not archiving F:\hudson\hudson-slave\workspace\ActiveMQ-Apollo\trunk\apollo-cli\target\apollo-cli-1.0-SNAPSHOT.jar
[INFO]                                                                         
[INFO] ------------------------------------------------------------------------
[INFO] Building apollo-website 1.0-SNAPSHOT
[INFO] ------------------------------------------------------------------------
[INFO] 
[INFO] --- maven-clean-plugin:2.4.1:clean (default-clean) @ apollo-website ---
[INFO] 
[INFO] --- maven-enforcer-plugin:1.0:enforce (default) @ apollo-website ---
[INFO] 
[INFO] --- maven-antrun-plugin:1.6:run (default) @ apollo-website ---
[WARNING] Parameter tasks is deprecated, use target instead
[INFO] Executing tasks

main:
mojoFailed org.apache.maven.plugins:maven-antrun-plugin:1.6(default)
projectFailed org.apache.activemq:apollo-website:1.0-SNAPSHOT
[JENKINS] Archiving disabled - not archiving F:\hudson\hudson-slave\workspace\ActiveMQ-Apollo\trunk\apollo-website\pom.xml
[INFO]                                                                         
[INFO] ------------------------------------------------------------------------
[INFO] Building apache-apollo 1.0-SNAPSHOT
[INFO] ------------------------------------------------------------------------
[INFO] 
[INFO] --- maven-clean-plugin:2.4.1:clean (default-clean) @ apache-apollo ---
[INFO] 
[INFO] --- maven-enforcer-plugin:1.0:enforce (default) @ apache-apollo ---
[INFO] 
[INFO] --- maven-remote-resources-plugin:1.1:process (default) @ apache-apollo ---
[INFO] 
[INFO] --- maven-assembly-plugin:2.2.1:single (unix-bin) @ apache-apollo ---
[INFO] Reading assembly descriptor: F:\hudson\hudson-slave\workspace\ActiveMQ-Apollo\trunk\apollo-distro/src/main/descriptors/unix-bin.xml
[INFO] No files selected for line-ending conversion or filtering. Skipping: F:\hudson\hudson-slave\workspace\ActiveMQ-Apollo\trunk\apollo-distro\..
[WARNING] Cannot include project artifact: org.apache.activemq:apache-apollo:pom:1.0-SNAPSHOT;
it doesn't have an associated file or directory.
[WARNING] The following patterns were never triggered in this artifact inclusion filter:
o  'org.fusesource.hawtdb:*'

[WARNING] Cannot include project artifact: org.apache.activemq:apache-apollo:pom:1.0-SNAPSHOT;
it doesn't have an associated file or directory.
[INFO] Building tar : F:\hudson\hudson-slave\workspace\ActiveMQ-Apollo\trunk\apollo-distro\target\apache-apollo-1.0-SNAPSHOT-unix-distro.tar.gz
[INFO] 
[INFO] --- maven-assembly-plugin:2.2.1:single (windows-bin) @ apache-apollo ---[INFO] Reading
assembly descriptor: F:\hudson\hudson-slave\workspace\ActiveMQ-Apollo\trunk\apollo-distro/src/main/descriptors/windows-bin.xml

[INFO] No files selected for line-ending conversion or filtering. Skipping: F:\hudson\hudson-slave\workspace\ActiveMQ-Apollo\trunk\apollo-distro\..
[WARNING] Cannot include project artifact: org.apache.activemq:apache-apollo:pom:1.0-SNAPSHOT;
it doesn't have an associated file or directory.
[WARNING] The following patterns were never triggered in this artifact inclusion filter:
o  'org.fusesource.hawtdb:*'

[WARNING] Cannot include project artifact: org.apache.activemq:apache-apollo:pom:1.0-SNAPSHOT;
it doesn't have an associated file or directory.
[INFO] Building zip: F:\hudson\hudson-slave\workspace\ActiveMQ-Apollo\trunk\apollo-distro\target\apache-apollo-1.0-SNAPSHOT-windows-distro.zip
[INFO] 
[INFO] Installing F:\hudson\hudson-slave\workspace\ActiveMQ-Apollo\trunk\apollo-distro\pom.xml
to C:\Users\hudson\.m2\repository\org\apache\activemq\apache-apollo\1.0-SNAPSHOT\apache-apollo-1.0-SNAPSHOT.pom
[INFO] --- maven-install-plugin:2.3.1:install (default-install) @ apache-apollo ---
[INFO] Installing F:\hudson\hudson-slave\workspace\ActiveMQ-Apollo\trunk\apollo-distro\target\apache-apollo-1.0-SNAPSHOT-unix-distro.tar.gz
to C:\Users\hudson\.m2\repository\org\apache\activemq\apache-apollo\1.0-SNAPSHOT\apache-apollo-1.0-SNAPSHOT-unix-distro.tar.gz
[INFO] Installing F:\hudson\hudson-slave\workspace\ActiveMQ-Apollo\trunk\apollo-distro\target\apache-apollo-1.0-SNAPSHOT-windows-distro.zip
to C:\Users\hudson\.m2\repository\org\apache\activemq\apache-apollo\1.0-SNAPSHOT\apache-apollo-1.0-SNAPSHOT-windows-distro.zip
projectSucceeded org.apache.activemq:apache-apollo:1.0-SNAPSHOT
[JENKINS] Archiving disabled - not archiving F:\hudson\hudson-slave\workspace\ActiveMQ-Apollo\trunk\apollo-distro\pom.xml
[JENKINS] Archiving disabled - not archiving F:\hudson\hudson-slave\workspace\ActiveMQ-Apollo\trunk\apollo-distro\target\apache-apollo-1.0-SNAPSHOT-unix-distro.tar.gz
[JENKINS] Archiving disabled - not archiving F:\hudson\hudson-slave\workspace\ActiveMQ-Apollo\trunk\apollo-distro\target\apache-apollo-1.0-SNAPSHOT-windows-distro.zip
[INFO]                                                                         
[INFO] ------------------------------------------------------------------------
[INFO] Building apollo-karaf-feature 1.0-SNAPSHOT
[INFO] ------------------------------------------------------------------------
[INFO] 
[INFO] --- maven-clean-plugin:2.4.1:clean (default-clean) @ apollo-karaf-feature ---
[INFO] 
[INFO] --- maven-enforcer-plugin:1.0:enforce (default) @ apollo-karaf-feature ---
[INFO] 
[INFO] --- maven-remote-resources-plugin:1.1:process (default) @ apollo-karaf-feature ---
[INFO] 
[INFO] Using 'UTF-8' encoding to copy filtered resources.
[INFO] --- maven-resources-plugin:2.4.3:resources (filter) @ apollo-karaf-feature ---
[INFO] Copying 1 resource
[INFO] Copying 3 resources
[INFO] 
[INFO] --- build-helper-maven-plugin:1.2:attach-artifact (attach-artifacts) @ apollo-karaf-feature
---
[INFO] 
[INFO] --- maven-install-plugin:2.3.1:install (default-install) @ apollo-karaf-feature ---
[INFO] Installing F:\hudson\hudson-slave\workspace\ActiveMQ-Apollo\trunk\apollo-karaf-feature\pom.xml
to C:\Users\hudson\.m2\repository\org\apache\activemq\apollo-karaf-feature\1.0-SNAPSHOT\apollo-karaf-feature-1.0-SNAPSHOT.pom
[INFO] Installing F:\hudson\hudson-slave\workspace\ActiveMQ-Apollo\trunk\apollo-karaf-feature\target\classes\features.xml
to C:\Users\hudson\.m2\repository\org\apache\activemq\apollo-karaf-feature\1.0-SNAPSHOT\apollo-karaf-feature-1.0-SNAPSHOT-features.xml
projectSucceeded org.apache.activemq:apollo-karaf-feature:1.0-SNAPSHOT
[JENKINS] Archiving disabled - not archiving F:\hudson\hudson-slave\workspace\ActiveMQ-Apollo\trunk\apollo-karaf-feature\pom.xml
[JENKINS] Archiving disabled - not archiving F:\hudson\hudson-slave\workspace\ActiveMQ-Apollo\trunk\apollo-karaf-feature\target\classes\features.xml
sessionEnded
[INFO] ------------------------------------------------------------------------
[INFO] Reactor Summary:
[INFO] 
[INFO] Apache ActiveMQ Apollo Project .................... SUCCESS [3.152s]
[INFO] apollo-boot ....................................... SUCCESS [13.649s]
[INFO] apollo-scala ...................................... SUCCESS [2.745s]
[INFO] apollo-util ....................................... SUCCESS [45.576s]
[INFO] apollo-transport .................................. SUCCESS [2.118s]
[INFO] apollo-dto ........................................ SUCCESS [11.119s]
[INFO] apollo-selector ................................... SUCCESS [3.880s]
[INFO] apollo-broker ..................................... SUCCESS [1:13.409s]
[INFO] apollo-tcp ........................................ SUCCESS [1.848s]
[INFO] apollo-web ........................................ SUCCESS [52.259s]
[INFO] apollo-bdb ........................................ SUCCESS [37.842s]
[INFO] apollo-jdbm2 ...................................... SUCCESS [38.011s]
[INFO] apollo-stomp ...................................... SUCCESS [1:16.526s]
[INFO] apollo-cli ........................................ SUCCESS [26.374s]
[INFO] apollo-website .................................... FAILURE [1.891s]
[INFO] apache-apollo ..................................... SUCCESS [9.920s]
[INFO] apollo-karaf-feature .............................. SUCCESS [0.323s]
[INFO] ------------------------------------------------------------------------
[INFO] BUILD FAILURE
[INFO] ------------------------------------------------------------------------
[INFO] Total time: 6:42.187s
[INFO] Finished at: Wed Sep 14 15:39:36 BST 2011
[INFO] Final Memory: 200M/1287M
[INFO] ------------------------------------------------------------------------
mavenExecutionResult exceptions not empty
message : Failed to execute goal org.apache.maven.plugins:maven-antrun-plugin:1.6:run (default)
on project apollo-website: An Ant BuildException has occured: taskdef A class needed by class
com.sun.tools.jxc.SchemaGenTask cannot be found: com/sun/mirror/apt/AnnotationProcessorFactory
 using the classloader AntClassLoader[C:\Users\hudson\.m2\repository\org\fusesource\scalate\scalate-wikitext\1.5.1\scalate-wikitext-1.5.1.jar;C:\Users\hudson\.m2\repository\org\fusesource\scalate\scalate-core\1.5.1\scalate-core-1.5.1.jar;C:\Users\hudson\.m2\repository\org\fusesource\scalate\scalate-util\1.5.1\scalate-util-1.5.1.jar;C:\Users\hudson\.m2\repository\org\fusesource\wikitext\confluence-core\1.2\confluence-core-1.2.jar;C:\Users\hudson\.m2\repository\org\fusesource\wikitext\wikitext-core\1.2\wikitext-core-1.2.jar;C:\Users\hudson\.m2\repository\org\fusesource\wikitext\textile-core\1.2\textile-core-1.2.jar;C:\Users\hudson\.m2\repository\org\fusesource\scalate\scalate-page\1.5.1\scalate-page-1.5.1.jar;C:\Users\hudson\.m2\repository\org\yaml\snakeyaml\1.7\snakeyaml-1.7.jar;C:\Users\hudson\.m2\repository\org\fusesource\scalamd\scalamd\1.5\scalamd-1.5.jar;C:\Users\hudson\.m2\repository\org\slf4j\slf4j-log4j12\1.6.1\slf4j-log4j12-1.6.1.jar;C:\Users\hudson\.m2\repository\org\slf4j\slf4j-api\1.6.1\slf4j-api-1.6.1.jar;C:\Users\hudson\.m2\repository\log4j\log4j\1.2.16\log4j-1.2.16.jar;C:\Users\hudson\.m2\repository\org\codehaus\jackson\jackson-core-asl\1.6.1\jackson-core-asl-1.6.1.jar;C:\Users\hudson\.m2\repository\org\codehaus\jackson\jackson-mapper-asl\1.6.1\jackson-mapper-asl-1.6.1.jar;C:\Users\hudson\.m2\repository\org\scala-lang\scala-library\2.9.0-1\scala-library-2.9.0-1.jar;C:\Users\hudson\.m2\repository\org\scala-lang\scala-compiler\2.9.0-1\scala-compiler-2.9.0-1.jar]
cause : An Ant BuildException has occured: taskdef A class needed by class com.sun.tools.jxc.SchemaGenTask
cannot be found: com/sun/mirror/apt/AnnotationProcessorFactory
 using the classloader AntClassLoader[C:\Users\hudson\.m2\repository\org\fusesource\scalate\scalate-wikitext\1.5.1\scalate-wikitext-1.5.1.jar;C:\Users\hudson\.m2\repository\org\fusesource\scalate\scalate-core\1.5.1\scalate-core-1.5.1.jar;C:\Users\hudson\.m2\repository\org\fusesource\scalate\scalate-util\1.5.1\scalate-util-1.5.1.jar;C:\Users\hudson\.m2\repository\org\fusesource\wikitext\confluence-core\1.2\confluence-core-1.2.jar;C:\Users\hudson\.m2\repository\org\fusesource\wikitext\wikitext-core\1.2\wikitext-core-1.2.jar;C:\Users\hudson\.m2\repository\org\fusesource\wikitext\textile-core\1.2\textile-core-1.2.jar;C:\Users\hudson\.m2\repository\org\fusesource\scalate\scalate-page\1.5.1\scalate-page-1.5.1.jar;C:\Users\hudson\.m2\repository\org\yaml\snakeyaml\1.7\snakeyaml-1.7.jar;C:\Users\hudson\.m2\repository\org\fusesource\scalamd\scalamd\1.5\scalamd-1.5.jar;C:\Users\hudson\.m2\repository\org\slf4j\slf4j-log4j12\1.6.1\slf4j-log4j12-1.6.1.jar;C:\Users\hudson\.m2\repository\org\slf4j\slf4j-api\1.6.1\slf4j-api-1.6.1.jar;C:\Users\hudson\.m2\repository\log4j\log4j\1.2.16\log4j-1.2.16.jar;C:\Users\hudson\.m2\repository\org\codehaus\jackson\jackson-core-asl\1.6.1\jackson-core-asl-1.6.1.jar;C:\Users\hudson\.m2\repository\org\codehaus\jackson\jackson-mapper-asl\1.6.1\jackson-mapper-asl-1.6.1.jar;C:\Users\hudson\.m2\repository\org\scala-lang\scala-library\2.9.0-1\scala-library-2.9.0-1.jar;C:\Users\hudson\.m2\repository\org\scala-lang\scala-compiler\2.9.0-1\scala-compiler-2.9.0-1.jar]
Stack trace : 
org.apache.maven.lifecycle.LifecycleExecutionException: Failed to execute goal org.apache.maven.plugins:maven-antrun-plugin:1.6:run
(default) on project apollo-website: An Ant BuildException has occured: taskdef A class needed
by class com.sun.tools.jxc.SchemaGenTask cannot be found: com/sun/mirror/apt/AnnotationProcessorFactory
 using the classloader AntClassLoader[C:\Users\hudson\.m2\repository\org\fusesource\scalate\scalate-wikitext\1.5.1\scalate-wikitext-1.5.1.jar;C:\Users\hudson\.m2\repository\org\fusesource\scalate\scalate-core\1.5.1\scalate-core-1.5.1.jar;C:\Users\hudson\.m2\repository\org\fusesource\scalate\scalate-util\1.5.1\scalate-util-1.5.1.jar;C:\Users\hudson\.m2\repository\org\fusesource\wikitext\confluence-core\1.2\confluence-core-1.2.jar;C:\Users\hudson\.m2\repository\org\fusesource\wikitext\wikitext-core\1.2\wikitext-core-1.2.jar;C:\Users\hudson\.m2\repository\org\fusesource\wikitext\textile-core\1.2\textile-core-1.2.jar;C:\Users\hudson\.m2\repository\org\fusesource\scalate\scalate-page\1.5.1\scalate-page-1.5.1.jar;C:\Users\hudson\.m2\repository\org\yaml\snakeyaml\1.7\snakeyaml-1.7.jar;C:\Users\hudson\.m2\repository\org\fusesource\scalamd\scalamd\1.5\scalamd-1.5.jar;C:\Users\hudson\.m2\repository\org\slf4j\slf4j-log4j12\1.6.1\slf4j-log4j12-1.6.1.jar;C:\Users\hudson\.m2\repository\org\slf4j\slf4j-api\1.6.1\slf4j-api-1.6.1.jar;C:\Users\hudson\.m2\repository\log4j\log4j\1.2.16\log4j-1.2.16.jar;C:\Users\hudson\.m2\repository\org\codehaus\jackson\jackson-core-asl\1.6.1\jackson-core-asl-1.6.1.jar;C:\Users\hudson\.m2\repository\org\codehaus\jackson\jackson-mapper-asl\1.6.1\jackson-mapper-asl-1.6.1.jar;C:\Users\hudson\.m2\repository\org\scala-lang\scala-library\2.9.0-1\scala-library-2.9.0-1.jar;C:\Users\hudson\.m2\repository\org\scala-lang\scala-compiler\2.9.0-1\scala-compiler-2.9.0-1.jar]
	at org.apache.maven.lifecycle.internal.MojoExecutor.execute(MojoExecutor.java:217)
	at org.apache.maven.lifecycle.internal.MojoExecutor.execute(MojoExecutor.java:153)
	at org.apache.maven.lifecycle.internal.MojoExecutor.execute(MojoExecutor.java:145)
	at org.apache.maven.lifecycle.internal.LifecycleModuleBuilder.buildProject(LifecycleModuleBuilder.java:84)
	at org.apache.maven.lifecycle.internal.LifecycleModuleBuilder.buildProject(LifecycleModuleBuilder.java:59)
	at org.apache.maven.lifecycle.internal.LifecycleStarter.singleThreadedBuild(LifecycleStarter.java:183)
	at org.apache.maven.lifecycle.internal.LifecycleStarter.execute(LifecycleStarter.java:161)
	at org.apache.maven.DefaultMaven.doExecute(DefaultMaven.java:319)
	at org.apache.maven.DefaultMaven.execute(DefaultMaven.java:156)
	at org.jvnet.hudson.maven3.launcher.Maven3Launcher.main(Maven3Launcher.java:79)
	at sun.reflect.NativeMethodAccessorImpl.invoke0(Native Method)
	at sun.reflect.NativeMethodAccessorImpl.invoke(NativeMethodAccessorImpl.java:39)
	at sun.reflect.DelegatingMethodAccessorImpl.invoke(DelegatingMethodAccessorImpl.java:25)
	at java.lang.reflect.Method.invoke(Method.java:597)
	at org.codehaus.plexus.classworlds.launcher.Launcher.launchStandard(Launcher.java:329)
	at org.codehaus.plexus.classworlds.launcher.Launcher.launch(Launcher.java:239)
	at org.jvnet.hudson.maven3.agent.Maven3Main.launch(Maven3Main.java:158)
	at hudson.maven.Maven3Builder.call(Maven3Builder.java:121)
	at hudson.maven.Maven3Builder.call(Maven3Builder.java:73)
	at hudson.remoting.UserRequest.perform(UserRequest.java:118)
	at hudson.remoting.UserRequest.perform(UserRequest.java:48)
	at hudson.remoting.Request$2.run(Request.java:287)
	at java.util.concurrent.Executors$RunnableAdapter.call(Executors.java:441)
	at java.util.concurrent.FutureTask$Sync.innerRun(FutureTask.java:303)
	at java.util.concurrent.FutureTask.run(FutureTask.java:138)
	at java.util.concurrent.ThreadPoolExecutor$Worker.runTask(ThreadPoolExecutor.java:886)
	at java.util.concurrent.ThreadPoolExecutor$Worker.run(ThreadPoolExecutor.java:908)
	at java.lang.Thread.run(Thread.java:619)
Caused by: org.apache.maven.plugin.MojoExecutionException: An Ant BuildException has occured:
taskdef A class needed by class com.sun.tools.jxc.SchemaGenTask cannot be found: com/sun/mirror/apt/AnnotationProcessorFactory
 using the classloader AntClassLoader[C:\Users\hudson\.m2\repository\org\fusesource\scalate\scalate-wikitext\1.5.1\scalate-wikitext-1.5.1.jar;C:\Users\hudson\.m2\repository\org\fusesource\scalate\scalate-core\1.5.1\scalate-core-1.5.1.jar;C:\Users\hudson\.m2\repository\org\fusesource\scalate\scalate-util\1.5.1\scalate-util-1.5.1.jar;C:\Users\hudson\.m2\repository\org\fusesource\wikitext\confluence-core\1.2\confluence-core-1.2.jar;C:\Users\hudson\.m2\repository\org\fusesource\wikitext\wikitext-core\1.2\wikitext-core-1.2.jar;C:\Users\hudson\.m2\repository\org\fusesource\wikitext\textile-core\1.2\textile-core-1.2.jar;C:\Users\hudson\.m2\repository\org\fusesource\scalate\scalate-page\1.5.1\scalate-page-1.5.1.jar;C:\Users\hudson\.m2\repository\org\yaml\snakeyaml\1.7\snakeyaml-1.7.jar;C:\Users\hudson\.m2\repository\org\fusesource\scalamd\scalamd\1.5\scalamd-1.5.jar;C:\Users\hudson\.m2\repository\org\slf4j\slf4j-log4j12\1.6.1\slf4j-log4j12-1.6.1.jar;C:\Users\hudson\.m2\repository\org\slf4j\slf4j-api\1.6.1\slf4j-api-1.6.1.jar;C:\Users\hudson\.m2\repository\log4j\log4j\1.2.16\log4j-1.2.16.jar;C:\Users\hudson\.m2\repository\org\codehaus\jackson\jackson-core-asl\1.6.1\jackson-core-asl-1.6.1.jar;C:\Users\hudson\.m2\repository\org\codehaus\jackson\jackson-mapper-asl\1.6.1\jackson-mapper-asl-1.6.1.jar;C:\Users\hudson\.m2\repository\org\scala-lang\scala-library\2.9.0-1\scala-library-2.9.0-1.jar;C:\Users\hudson\.m2\repository\org\scala-lang\scala-compiler\2.9.0-1\scala-compiler-2.9.0-1.jar]
	at org.apache.maven.plugin.antrun.AntRunMojo.execute(AntRunMojo.java:283)
	at org.apache.maven.plugin.DefaultBuildPluginManager.executeMojo(DefaultBuildPluginManager.java:107)
	at org.apache.maven.lifecycle.internal.MojoExecutor.execute(MojoExecutor.java:209)
	... 27 more
Caused by: F:\hudson\hudson-slave\workspace\ActiveMQ-Apollo\trunk\apollo-website\target\antrun\build-main.xml:4:
taskdef A class needed by class com.sun.tools.jxc.SchemaGenTask cannot be found: com/sun/mirror/apt/AnnotationProcessorFactory
 using the classloader AntClassLoader[C:\Users\hudson\.m2\repository\org\fusesource\scalate\scalate-wikitext\1.5.1\scalate-wikitext-1.5.1.jar;C:\Users\hudson\.m2\repository\org\fusesource\scalate\scalate-core\1.5.1\scalate-core-1.5.1.jar;C:\Users\hudson\.m2\repository\org\fusesource\scalate\scalate-util\1.5.1\scalate-util-1.5.1.jar;C:\Users\hudson\.m2\repository\org\fusesource\wikitext\confluence-core\1.2\confluence-core-1.2.jar;C:\Users\hudson\.m2\repository\org\fusesource\wikitext\wikitext-core\1.2\wikitext-core-1.2.jar;C:\Users\hudson\.m2\repository\org\fusesource\wikitext\textile-core\1.2\textile-core-1.2.jar;C:\Users\hudson\.m2\repository\org\fusesource\scalate\scalate-page\1.5.1\scalate-page-1.5.1.jar;C:\Users\hudson\.m2\repository\org\yaml\snakeyaml\1.7\snakeyaml-1.7.jar;C:\Users\hudson\.m2\repository\org\fusesource\scalamd\scalamd\1.5\scalamd-1.5.jar;C:\Users\hudson\.m2\repository\org\slf4j\slf4j-log4j12\1.6.1\slf4j-log4j12-1.6.1.jar;C:\Users\hudson\.m2\repository\org\slf4j\slf4j-api\1.6.1\slf4j-api-1.6.1.jar;C:\Users\hudson\.m2\repository\log4j\log4j\1.2.16\log4j-1.2.16.jar;C:\Users\hudson\.m2\repository\org\codehaus\jackson\jackson-core-asl\1.6.1\jackson-core-asl-1.6.1.jar;C:\Users\hudson\.m2\repository\org\codehaus\jackson\jackson-mapper-asl\1.6.1\jackson-mapper-asl-1.6.1.jar;C:\Users\hudson\.m2\repository\org\scala-lang\scala-library\2.9.0-1\scala-library-2.9.0-1.jar;C:\Users\hudson\.m2\repository\org\scala-lang\scala-compiler\2.9.0-1\scala-compiler-2.9.0-1.jar]
	at org.apache.tools.ant.taskdefs.Definer.addDefinition(Definer.java:627)
	at org.apache.tools.ant.taskdefs.Definer.execute(Definer.java:239)
	at org.apache.tools.ant.UnknownElement.execute(UnknownElement.java:291)
	at sun.reflect.NativeMethodAccessorImpl.invoke0(Native Method)
	at sun.reflect.NativeMethodAccessorImpl.invoke(NativeMethodAccessorImpl.java:39)
	at sun.reflect.DelegatingMethodAccessorImpl.invoke(DelegatingMethodAccessorImpl.java:25)
	at java.lang.reflect.Method.invoke(Method.java:597)
	at org.apache.tools.ant.dispatch.DispatchUtils.execute(DispatchUtils.java:106)
	at org.apache.tools.ant.Task.perform(Task.java:348)
	at org.apache.tools.ant.Target.execute(Target.java:390)
	at org.apache.tools.ant.Target.performTasks(Target.java:411)
	at org.apache.tools.ant.Project.executeSortedTargets(Project.java:1397)
	at org.apache.tools.ant.Project.executeTarget(Project.java:1366)
	at org.apache.maven.plugin.antrun.AntRunMojo.execute(AntRunMojo.java:270)
	... 29 more
Caused by: java.lang.NoClassDefFoundError: com/sun/mirror/apt/AnnotationProcessorFactory
	at java.lang.Class.forName0(Native Method)
	at java.lang.Class.forName(Class.java:247)
	at org.apache.tools.ant.taskdefs.Definer.addDefinition(Definer.java:594)
	... 42 more
Caused by: java.lang.ClassNotFoundException: com.sun.mirror.apt.AnnotationProcessorFactory
	at org.codehaus.plexus.classworlds.strategy.SelfFirstStrategy.loadClass(SelfFirstStrategy.java:50)
	at org.codehaus.plexus.classworlds.realm.ClassRealm.loadClass(ClassRealm.java:244)
	at org.codehaus.plexus.classworlds.realm.ClassRealm.loadClass(ClassRealm.java:230)
	at java.lang.ClassLoader.loadClassInternal(ClassLoader.java:316)
	... 45 more
Sending e-mails to: commits@activemq.apache.org
Sending e-mails to: commits@activemq.apache.org
channel stopped


Mime
View raw message