activemq-commits mailing list archives

Site index · List index
Message view « Date » · « Thread »
Top « Date » · « Thread »
From Apache Jenkins Server <jenk...@builds.apache.org>
Subject Build failed in Jenkins: ActiveMQ-Apollo #443
Date Tue, 06 Sep 2011 14:08:17 GMT
See <https://builds.apache.org/job/ActiveMQ-Apollo/443/changes>

Changes:

[chirino] https://issues.apache.org/jira/browse/APLO-86 : If a temp:true header is set on
a subscribe frame, then the destination that the subscription creates will only be consumable
by the connection which creates the destination.

------------------------------------------
[...truncated 3251 lines...]
[INFO] 
[INFO] --- maven-remote-resources-plugin:1.1:process (default) @ apollo-cli ---
[INFO] [INFO] Using 'UTF-8' encoding to copy filtered resources.

[INFO] --- maven-resources-plugin:2.4.3:resources (default-resources) @ apollo-cli ---
[INFO] Copying 14 resources
[INFO] Copying 2 resources
[INFO] Copying 3 resources
[INFO] 
[INFO] --- maven-dependency-plugin:2.2:copy (unpack) @ apollo-cli ---
[INFO] Configured Artifact: com.sun.winsw:winsw:bin:1.8:exe
[INFO] Copying winsw-1.8-bin.exe to <https://builds.apache.org/job/ActiveMQ-Apollo/ws/trunk/apollo-cli/target/classes/org/apache/activemq/apollo/cli/commands/bin/apollo-broker-service.exe>
[INFO] [INFO] Nothing to compile - all classes are up to date

[INFO] --- maven-compiler-plugin:2.3.2:compile (default-compile) @ apollo-cli ---
[INFO] [INFO] Checking for multiple versions of scala
[INFO] includes = [**/*.scala,**/*.java,]
[INFO] excludes = []
[INFO] <https://builds.apache.org/job/ActiveMQ-Apollo/ws/trunk/apollo-cli/src/main/scala>:-1:
info: compiling
[INFO] Compiling 13 source files to <https://builds.apache.org/job/ActiveMQ-Apollo/ws/trunk/apollo-cli/target/classes>
at 1315318031110

[INFO] --- maven-scala-plugin:2.15.2:compile (default) @ apollo-cli ---
[INFO] compiler plugin: BasicArtifact(org.scala-lang.plugins,continuations,2.9.0-1)
[INFO] compiler plugin: BasicArtifact(org.fusesource.jvmassert,jvmassert,1.2)
[INFO] prepare-compile in 0 s
[INFO] compile in 10 s
[INFO] [INFO] Using 'UTF-8' encoding to copy filtered resources.
[INFO] Copying 3 resources

[INFO] --- maven-resources-plugin:2.4.3:testResources (default-testResources) @ apollo-cli
---
[INFO] Copying 3 resources
[INFO] [INFO] Nothing to compile - all classes are up to date

[INFO] --- maven-compiler-plugin:2.3.2:testCompile (default-testCompile) @ apollo-cli ---
[INFO] [INFO] Checking for multiple versions of scala
[INFO] includes = [**/*.scala,**/*.java,]
[INFO] excludes = []
[INFO] <https://builds.apache.org/job/ActiveMQ-Apollo/ws/trunk/apollo-cli/src/test/scala>:-1:
info: compiling
[INFO] Compiling 1 source files to <https://builds.apache.org/job/ActiveMQ-Apollo/ws/trunk/apollo-cli/target/test-classes>
at 1315318041775
[INFO] compiler plugin: BasicArtifact(org.scala-lang.plugins,continuations,2.9.0-1)
[INFO] compiler plugin: BasicArtifact(org.fusesource.jvmassert,jvmassert,1.2)

[INFO] --- maven-scala-plugin:2.15.2:testCompile (default) @ apollo-cli ---
[INFO] prepare-compile in 0 s
[INFO] compile in 6 s
[INFO] [INFO] Surefire report directory: <https://builds.apache.org/job/ActiveMQ-Apollo/ws/trunk/apollo-cli/target/surefire-reports>

[INFO] --- maven-surefire-plugin:2.4.3:test (default-test) @ apollo-cli ---

-------------------------------------------------------
 T E S T S
-------------------------------------------------------
There are no tests to run.

Results :

Tests run: 0, Failures: 0, Errors: 0, Skipped: 0

[JENKINS] Recording test results
[INFO] 
[INFO] --- maven-jar-plugin:2.3.1:jar (default-jar) @ apollo-cli ---
[INFO] Building jar: <https://builds.apache.org/job/ActiveMQ-Apollo/ws/trunk/apollo-cli/target/apollo-cli-1.0-SNAPSHOT.jar>
[INFO] [INFO] Installing <https://builds.apache.org/job/ActiveMQ-Apollo/ws/trunk/apollo-cli/target/apollo-cli-1.0-SNAPSHOT.jar>
to /home/hudson/.m2/repository/org/apache/activemq/apollo-cli/1.0-SNAPSHOT/apollo-cli-1.0-SNAPSHOT.jar

[INFO] --- maven-install-plugin:2.3.1:install (default-install) @ apollo-cli ---
[INFO] Installing <https://builds.apache.org/job/ActiveMQ-Apollo/ws/trunk/apollo-cli/pom.xml>
to /home/hudson/.m2/repository/org/apache/activemq/apollo-cli/1.0-SNAPSHOT/apollo-cli-1.0-SNAPSHOT.pom
projectSucceeded org.apache.activemq:apollo-cli:1.0-SNAPSHOT
[JENKINS] Archiving disabled - not archiving <https://builds.apache.org/job/ActiveMQ-Apollo/ws/trunk/apollo-cli/pom.xml>
[JENKINS] Archiving disabled - not archiving <https://builds.apache.org/job/ActiveMQ-Apollo/ws/trunk/apollo-cli/target/apollo-cli-1.0-SNAPSHOT.jar>
[INFO]                                                                         
[INFO] ------------------------------------------------------------------------
[INFO] Building apollo-website 1.0-SNAPSHOT
[INFO] ------------------------------------------------------------------------
[INFO] 
[INFO] --- maven-clean-plugin:2.4.1:clean (default-clean) @ apollo-website ---
[INFO] 
[INFO] --- maven-enforcer-plugin:1.0:enforce (default) @ apollo-website ---
[INFO] 
[INFO] --- maven-antrun-plugin:1.6:run (default) @ apollo-website ---
[WARNING] Parameter tasks is deprecated, use target instead
[INFO] Executing tasks

main:
mojoFailed org.apache.maven.plugins:maven-antrun-plugin:1.6(default)
projectFailed org.apache.activemq:apollo-website:1.0-SNAPSHOT
[JENKINS] Archiving disabled - not archiving <https://builds.apache.org/job/ActiveMQ-Apollo/ws/trunk/apollo-website/pom.xml>
[INFO]                                                                         
[INFO] ------------------------------------------------------------------------
[INFO] Building apache-apollo 1.0-SNAPSHOT
[INFO] ------------------------------------------------------------------------
[INFO] 
[INFO] --- maven-clean-plugin:2.4.1:clean (default-clean) @ apache-apollo ---
[INFO] 
[INFO] --- maven-enforcer-plugin:1.0:enforce (default) @ apache-apollo ---
[INFO] 
[INFO] --- maven-remote-resources-plugin:1.1:process (default) @ apache-apollo ---
[INFO] 
[INFO] --- maven-assembly-plugin:2.2.1:single (unix-bin) @ apache-apollo ---
[INFO] Reading assembly descriptor: <https://builds.apache.org/job/ActiveMQ-Apollo/ws/trunk/apollo-distro/src/main/descriptors/unix-bin.xml>
[INFO] No files selected for line-ending conversion or filtering. Skipping: <https://builds.apache.org/job/ActiveMQ-Apollo/ws/trunk/apollo-distro/..>
[WARNING] Cannot include project artifact: org.apache.activemq:apache-apollo:pom:1.0-SNAPSHOT;
it doesn't have an associated file or directory.
[WARNING] The following patterns were never triggered in this artifact inclusion filter:
o  'org.fusesource.hawtdb:*'

[WARNING] Cannot include project artifact: org.apache.activemq:apache-apollo:pom:1.0-SNAPSHOT;
it doesn't have an associated file or directory.
[INFO] Building tar : <https://builds.apache.org/job/ActiveMQ-Apollo/ws/trunk/apollo-distro/target/apache-apollo-1.0-SNAPSHOT-unix-distro.tar.gz>
[INFO] Reading assembly descriptor: <https://builds.apache.org/job/ActiveMQ-Apollo/ws/trunk/apollo-distro/src/main/descriptors/windows-bin.xml>
[INFO] 
[INFO] --- maven-assembly-plugin:2.2.1:single (windows-bin) @ apache-apollo ---
[INFO] No files selected for line-ending conversion or filtering. Skipping: <https://builds.apache.org/job/ActiveMQ-Apollo/ws/trunk/apollo-distro/..>
[WARNING] Cannot include project artifact: org.apache.activemq:apache-apollo:pom:1.0-SNAPSHOT;
it doesn't have an associated file or directory.
[WARNING] The following patterns were never triggered in this artifact inclusion filter:
o  'org.fusesource.hawtdb:*'

[WARNING] Cannot include project artifact: org.apache.activemq:apache-apollo:pom:1.0-SNAPSHOT;
it doesn't have an associated file or directory.
[INFO] Building zip: <https://builds.apache.org/job/ActiveMQ-Apollo/ws/trunk/apollo-distro/target/apache-apollo-1.0-SNAPSHOT-windows-distro.zip>
[INFO] Installing <https://builds.apache.org/job/ActiveMQ-Apollo/ws/trunk/apollo-distro/pom.xml>
to /home/hudson/.m2/repository/org/apache/activemq/apache-apollo/1.0-SNAPSHOT/apache-apollo-1.0-SNAPSHOT.pom
[INFO] [INFO] Installing <https://builds.apache.org/job/ActiveMQ-Apollo/ws/trunk/apollo-distro/target/apache-apollo-1.0-SNAPSHOT-unix-distro.tar.gz>
to /home/hudson/.m2/repository/org/apache/activemq/apache-apollo/1.0-SNAPSHOT/apache-apollo-1.0-SNAPSHOT-unix-distro.tar.gz

[INFO] --- maven-install-plugin:2.3.1:install (default-install) @ apache-apollo ---
[INFO] Installing <https://builds.apache.org/job/ActiveMQ-Apollo/ws/trunk/apollo-distro/target/apache-apollo-1.0-SNAPSHOT-windows-distro.zip>
to /home/hudson/.m2/repository/org/apache/activemq/apache-apollo/1.0-SNAPSHOT/apache-apollo-1.0-SNAPSHOT-windows-distro.zip
projectSucceeded org.apache.activemq:apache-apollo:1.0-SNAPSHOT
[JENKINS] Archiving disabled - not archiving <https://builds.apache.org/job/ActiveMQ-Apollo/ws/trunk/apollo-distro/pom.xml>
[JENKINS] Archiving disabled - not archiving <https://builds.apache.org/job/ActiveMQ-Apollo/ws/trunk/apollo-distro/target/apache-apollo-1.0-SNAPSHOT-unix-distro.tar.gz>
[JENKINS] Archiving disabled - not archiving <https://builds.apache.org/job/ActiveMQ-Apollo/ws/trunk/apollo-distro/target/apache-apollo-1.0-SNAPSHOT-windows-distro.zip>
[INFO]                                                                         
[INFO] ------------------------------------------------------------------------
[INFO] Building apollo-karaf-feature 1.0-SNAPSHOT
[INFO] ------------------------------------------------------------------------
[INFO] 
[INFO] --- maven-clean-plugin:2.4.1:clean (default-clean) @ apollo-karaf-feature ---
[INFO] 
[INFO] --- maven-enforcer-plugin:1.0:enforce (default) @ apollo-karaf-feature ---
[INFO] 
[INFO] --- maven-remote-resources-plugin:1.1:process (default) @ apollo-karaf-feature ---
[INFO] [INFO] Using 'UTF-8' encoding to copy filtered resources.
[INFO] Copying 1 resource
[INFO] Copying 3 resources

[INFO] --- maven-resources-plugin:2.4.3:resources (filter) @ apollo-karaf-feature ---
[INFO] 
[INFO] --- build-helper-maven-plugin:1.2:attach-artifact (attach-artifacts) @ apollo-karaf-feature
---
[INFO] [INFO] Installing <https://builds.apache.org/job/ActiveMQ-Apollo/ws/trunk/apollo-karaf-feature/pom.xml>
to /home/hudson/.m2/repository/org/apache/activemq/apollo-karaf-feature/1.0-SNAPSHOT/apollo-karaf-feature-1.0-SNAPSHOT.pom

[INFO] --- maven-install-plugin:2.3.1:install (default-install) @ apollo-karaf-feature ---
[INFO] Installing <https://builds.apache.org/job/ActiveMQ-Apollo/ws/trunk/apollo-karaf-feature/target/classes/features.xml>
to /home/hudson/.m2/repository/org/apache/activemq/apollo-karaf-feature/1.0-SNAPSHOT/apollo-karaf-feature-1.0-SNAPSHOT-features.xml
projectSucceeded org.apache.activemq:apollo-karaf-feature:1.0-SNAPSHOT
[JENKINS] Archiving disabled - not archiving <https://builds.apache.org/job/ActiveMQ-Apollo/ws/trunk/apollo-karaf-feature/pom.xml>
[JENKINS] Archiving disabled - not archiving <https://builds.apache.org/job/ActiveMQ-Apollo/ws/trunk/apollo-karaf-feature/target/classes/features.xml>
sessionEnded
[INFO] ------------------------------------------------------------------------
[INFO] Reactor Summary:
[INFO] 
[INFO] Apache ActiveMQ Apollo Project .................... SUCCESS [8.717s]
[INFO] apollo-boot ....................................... SUCCESS [5.590s]
[INFO] apollo-scala ...................................... SUCCESS [2.000s]
[INFO] apollo-util ....................................... SUCCESS [1:02.225s]
[INFO] apollo-transport .................................. SUCCESS [2.704s]
[INFO] apollo-dto ........................................ SUCCESS [7.125s]
[INFO] apollo-selector ................................... SUCCESS [4.404s]
[INFO] apollo-broker ..................................... SUCCESS [48.696s]
[INFO] apollo-tcp ........................................ SUCCESS [2.324s]
[INFO] apollo-web ........................................ SUCCESS [42.759s]
[INFO] apollo-bdb ........................................ SUCCESS [32.332s]
[INFO] apollo-jdbm2 ...................................... SUCCESS [35.133s]
[INFO] apollo-stomp ...................................... SUCCESS [58.738s]
[INFO] apollo-cli ........................................ SUCCESS [20.990s]
[INFO] apollo-website .................................... FAILURE [0.942s]
[INFO] apache-apollo ..................................... SUCCESS [40.766s]
[INFO] apollo-karaf-feature .............................. SUCCESS [0.788s]
[INFO] ------------------------------------------------------------------------
[INFO] BUILD FAILURE
[INFO] ------------------------------------------------------------------------
[INFO] Total time: 6:29.425s
[INFO] Finished at: Tue Sep 06 14:08:15 UTC 2011
[INFO] Final Memory: 119M/1097M
[INFO] ------------------------------------------------------------------------
mavenExecutionResult exceptions not empty
message : Failed to execute goal org.apache.maven.plugins:maven-antrun-plugin:1.6:run (default)
on project apollo-website: An Ant BuildException has occured: taskdef A class needed by class
com.sun.tools.jxc.SchemaGenTask cannot be found: com/sun/mirror/apt/AnnotationProcessorFactory
 using the classloader AntClassLoader[/home/hudson/.m2/repository/org/fusesource/scalate/scalate-wikitext/1.5.1/scalate-wikitext-1.5.1.jar:/home/hudson/.m2/repository/org/fusesource/scalate/scalate-core/1.5.1/scalate-core-1.5.1.jar:/home/hudson/.m2/repository/org/fusesource/scalate/scalate-util/1.5.1/scalate-util-1.5.1.jar:/home/hudson/.m2/repository/org/fusesource/wikitext/confluence-core/1.2/confluence-core-1.2.jar:/home/hudson/.m2/repository/org/fusesource/wikitext/wikitext-core/1.2/wikitext-core-1.2.jar:/home/hudson/.m2/repository/org/fusesource/wikitext/textile-core/1.2/textile-core-1.2.jar:/home/hudson/.m2/repository/org/fusesource/scalate/scalate-page/1.5.1/scalate-page-1.5.1.jar:/home/hudson/.m2/repository/org/yaml/snakeyaml/1.7/snakeyaml-1.7.jar:/home/hudson/.m2/repository/org/fusesource/scalamd/scalamd/1.5/scalamd-1.5.jar:/home/hudson/.m2/repository/org/slf4j/slf4j-log4j12/1.6.1/slf4j-log4j12-1.6.1.jar:/home/hudson/.m2/repository/org/slf4j/slf4j-api/1.6.1/slf4j-api-1.6.1.jar:/home/hudson/.m2/repository/log4j/log4j/1.2.16/log4j-1.2.16.jar:/home/hudson/.m2/repository/org/codehaus/jackson/jackson-core-asl/1.6.1/jackson-core-asl-1.6.1.jar:/home/hudson/.m2/repository/org/codehaus/jackson/jackson-mapper-asl/1.6.1/jackson-mapper-asl-1.6.1.jar:/home/hudson/.m2/repository/org/scala-lang/scala-library/2.9.0-1/scala-library-2.9.0-1.jar:/home/hudson/.m2/repository/org/scala-lang/scala-compiler/2.9.0-1/scala-compiler-2.9.0-1.jar]
cause : An Ant BuildException has occured: taskdef A class needed by class com.sun.tools.jxc.SchemaGenTask
cannot be found: com/sun/mirror/apt/AnnotationProcessorFactory
 using the classloader AntClassLoader[/home/hudson/.m2/repository/org/fusesource/scalate/scalate-wikitext/1.5.1/scalate-wikitext-1.5.1.jar:/home/hudson/.m2/repository/org/fusesource/scalate/scalate-core/1.5.1/scalate-core-1.5.1.jar:/home/hudson/.m2/repository/org/fusesource/scalate/scalate-util/1.5.1/scalate-util-1.5.1.jar:/home/hudson/.m2/repository/org/fusesource/wikitext/confluence-core/1.2/confluence-core-1.2.jar:/home/hudson/.m2/repository/org/fusesource/wikitext/wikitext-core/1.2/wikitext-core-1.2.jar:/home/hudson/.m2/repository/org/fusesource/wikitext/textile-core/1.2/textile-core-1.2.jar:/home/hudson/.m2/repository/org/fusesource/scalate/scalate-page/1.5.1/scalate-page-1.5.1.jar:/home/hudson/.m2/repository/org/yaml/snakeyaml/1.7/snakeyaml-1.7.jar:/home/hudson/.m2/repository/org/fusesource/scalamd/scalamd/1.5/scalamd-1.5.jar:/home/hudson/.m2/repository/org/slf4j/slf4j-log4j12/1.6.1/slf4j-log4j12-1.6.1.jar:/home/hudson/.m2/repository/org/slf4j/slf4j-api/1.6.1/slf4j-api-1.6.1.jar:/home/hudson/.m2/repository/log4j/log4j/1.2.16/log4j-1.2.16.jar:/home/hudson/.m2/repository/org/codehaus/jackson/jackson-core-asl/1.6.1/jackson-core-asl-1.6.1.jar:/home/hudson/.m2/repository/org/codehaus/jackson/jackson-mapper-asl/1.6.1/jackson-mapper-asl-1.6.1.jar:/home/hudson/.m2/repository/org/scala-lang/scala-library/2.9.0-1/scala-library-2.9.0-1.jar:/home/hudson/.m2/repository/org/scala-lang/scala-compiler/2.9.0-1/scala-compiler-2.9.0-1.jar]
Stack trace : 
org.apache.maven.lifecycle.LifecycleExecutionException: Failed to execute goal org.apache.maven.plugins:maven-antrun-plugin:1.6:run
(default) on project apollo-website: An Ant BuildException has occured: taskdef A class needed
by class com.sun.tools.jxc.SchemaGenTask cannot be found: com/sun/mirror/apt/AnnotationProcessorFactory
 using the classloader AntClassLoader[/home/hudson/.m2/repository/org/fusesource/scalate/scalate-wikitext/1.5.1/scalate-wikitext-1.5.1.jar:/home/hudson/.m2/repository/org/fusesource/scalate/scalate-core/1.5.1/scalate-core-1.5.1.jar:/home/hudson/.m2/repository/org/fusesource/scalate/scalate-util/1.5.1/scalate-util-1.5.1.jar:/home/hudson/.m2/repository/org/fusesource/wikitext/confluence-core/1.2/confluence-core-1.2.jar:/home/hudson/.m2/repository/org/fusesource/wikitext/wikitext-core/1.2/wikitext-core-1.2.jar:/home/hudson/.m2/repository/org/fusesource/wikitext/textile-core/1.2/textile-core-1.2.jar:/home/hudson/.m2/repository/org/fusesource/scalate/scalate-page/1.5.1/scalate-page-1.5.1.jar:/home/hudson/.m2/repository/org/yaml/snakeyaml/1.7/snakeyaml-1.7.jar:/home/hudson/.m2/repository/org/fusesource/scalamd/scalamd/1.5/scalamd-1.5.jar:/home/hudson/.m2/repository/org/slf4j/slf4j-log4j12/1.6.1/slf4j-log4j12-1.6.1.jar:/home/hudson/.m2/repository/org/slf4j/slf4j-api/1.6.1/slf4j-api-1.6.1.jar:/home/hudson/.m2/repository/log4j/log4j/1.2.16/log4j-1.2.16.jar:/home/hudson/.m2/repository/org/codehaus/jackson/jackson-core-asl/1.6.1/jackson-core-asl-1.6.1.jar:/home/hudson/.m2/repository/org/codehaus/jackson/jackson-mapper-asl/1.6.1/jackson-mapper-asl-1.6.1.jar:/home/hudson/.m2/repository/org/scala-lang/scala-library/2.9.0-1/scala-library-2.9.0-1.jar:/home/hudson/.m2/repository/org/scala-lang/scala-compiler/2.9.0-1/scala-compiler-2.9.0-1.jar]
	at org.apache.maven.lifecycle.internal.MojoExecutor.execute(MojoExecutor.java:217)
	at org.apache.maven.lifecycle.internal.MojoExecutor.execute(MojoExecutor.java:153)
	at org.apache.maven.lifecycle.internal.MojoExecutor.execute(MojoExecutor.java:145)
	at org.apache.maven.lifecycle.internal.LifecycleModuleBuilder.buildProject(LifecycleModuleBuilder.java:84)
	at org.apache.maven.lifecycle.internal.LifecycleModuleBuilder.buildProject(LifecycleModuleBuilder.java:59)
	at org.apache.maven.lifecycle.internal.LifecycleStarter.singleThreadedBuild(LifecycleStarter.java:183)
	at org.apache.maven.lifecycle.internal.LifecycleStarter.execute(LifecycleStarter.java:161)
	at org.apache.maven.DefaultMaven.doExecute(DefaultMaven.java:319)
	at org.apache.maven.DefaultMaven.execute(DefaultMaven.java:156)
	at org.jvnet.hudson.maven3.launcher.Maven3Launcher.main(Maven3Launcher.java:79)
	at sun.reflect.NativeMethodAccessorImpl.invoke0(Native Method)
	at sun.reflect.NativeMethodAccessorImpl.invoke(NativeMethodAccessorImpl.java:39)
	at sun.reflect.DelegatingMethodAccessorImpl.invoke(DelegatingMethodAccessorImpl.java:25)
	at java.lang.reflect.Method.invoke(Method.java:597)
	at org.codehaus.plexus.classworlds.launcher.Launcher.launchStandard(Launcher.java:329)
	at org.codehaus.plexus.classworlds.launcher.Launcher.launch(Launcher.java:239)
	at org.jvnet.hudson.maven3.agent.Maven3Main.launch(Maven3Main.java:158)
	at hudson.maven.Maven3Builder.call(Maven3Builder.java:121)
	at hudson.maven.Maven3Builder.call(Maven3Builder.java:73)
	at hudson.remoting.UserRequest.perform(UserRequest.java:118)
	at hudson.remoting.UserRequest.perform(UserRequest.java:48)
	at hudson.remoting.Request$2.run(Request.java:287)
	at java.util.concurrent.Executors$RunnableAdapter.call(Executors.java:441)
	at java.util.concurrent.FutureTask$Sync.innerRun(FutureTask.java:303)
	at java.util.concurrent.FutureTask.run(FutureTask.java:138)
	at java.util.concurrent.ThreadPoolExecutor$Worker.runTask(ThreadPoolExecutor.java:886)
	at java.util.concurrent.ThreadPoolExecutor$Worker.run(ThreadPoolExecutor.java:908)
	at java.lang.Thread.run(Thread.java:619)
Caused by: org.apache.maven.plugin.MojoExecutionException: An Ant BuildException has occured:
taskdef A class needed by class com.sun.tools.jxc.SchemaGenTask cannot be found: com/sun/mirror/apt/AnnotationProcessorFactory
 using the classloader AntClassLoader[/home/hudson/.m2/repository/org/fusesource/scalate/scalate-wikitext/1.5.1/scalate-wikitext-1.5.1.jar:/home/hudson/.m2/repository/org/fusesource/scalate/scalate-core/1.5.1/scalate-core-1.5.1.jar:/home/hudson/.m2/repository/org/fusesource/scalate/scalate-util/1.5.1/scalate-util-1.5.1.jar:/home/hudson/.m2/repository/org/fusesource/wikitext/confluence-core/1.2/confluence-core-1.2.jar:/home/hudson/.m2/repository/org/fusesource/wikitext/wikitext-core/1.2/wikitext-core-1.2.jar:/home/hudson/.m2/repository/org/fusesource/wikitext/textile-core/1.2/textile-core-1.2.jar:/home/hudson/.m2/repository/org/fusesource/scalate/scalate-page/1.5.1/scalate-page-1.5.1.jar:/home/hudson/.m2/repository/org/yaml/snakeyaml/1.7/snakeyaml-1.7.jar:/home/hudson/.m2/repository/org/fusesource/scalamd/scalamd/1.5/scalamd-1.5.jar:/home/hudson/.m2/repository/org/slf4j/slf4j-log4j12/1.6.1/slf4j-log4j12-1.6.1.jar:/home/hudson/.m2/repository/org/slf4j/slf4j-api/1.6.1/slf4j-api-1.6.1.jar:/home/hudson/.m2/repository/log4j/log4j/1.2.16/log4j-1.2.16.jar:/home/hudson/.m2/repository/org/codehaus/jackson/jackson-core-asl/1.6.1/jackson-core-asl-1.6.1.jar:/home/hudson/.m2/repository/org/codehaus/jackson/jackson-mapper-asl/1.6.1/jackson-mapper-asl-1.6.1.jar:/home/hudson/.m2/repository/org/scala-lang/scala-library/2.9.0-1/scala-library-2.9.0-1.jar:/home/hudson/.m2/repository/org/scala-lang/scala-compiler/2.9.0-1/scala-compiler-2.9.0-1.jar]
	at org.apache.maven.plugin.antrun.AntRunMojo.execute(AntRunMojo.java:283)
	at org.apache.maven.plugin.DefaultBuildPluginManager.executeMojo(DefaultBuildPluginManager.java:107)
	at org.apache.maven.lifecycle.internal.MojoExecutor.execute(MojoExecutor.java:209)
	... 27 more
Caused by: <https://builds.apache.org/job/ActiveMQ-Apollo/ws/trunk/apollo-website/target/antrun/build-main.xml>:4:
taskdef A class needed by class com.sun.tools.jxc.SchemaGenTask cannot be found: com/sun/mirror/apt/AnnotationProcessorFactory
 using the classloader AntClassLoader[/home/hudson/.m2/repository/org/fusesource/scalate/scalate-wikitext/1.5.1/scalate-wikitext-1.5.1.jar:/home/hudson/.m2/repository/org/fusesource/scalate/scalate-core/1.5.1/scalate-core-1.5.1.jar:/home/hudson/.m2/repository/org/fusesource/scalate/scalate-util/1.5.1/scalate-util-1.5.1.jar:/home/hudson/.m2/repository/org/fusesource/wikitext/confluence-core/1.2/confluence-core-1.2.jar:/home/hudson/.m2/repository/org/fusesource/wikitext/wikitext-core/1.2/wikitext-core-1.2.jar:/home/hudson/.m2/repository/org/fusesource/wikitext/textile-core/1.2/textile-core-1.2.jar:/home/hudson/.m2/repository/org/fusesource/scalate/scalate-page/1.5.1/scalate-page-1.5.1.jar:/home/hudson/.m2/repository/org/yaml/snakeyaml/1.7/snakeyaml-1.7.jar:/home/hudson/.m2/repository/org/fusesource/scalamd/scalamd/1.5/scalamd-1.5.jar:/home/hudson/.m2/repository/org/slf4j/slf4j-log4j12/1.6.1/slf4j-log4j12-1.6.1.jar:/home/hudson/.m2/repository/org/slf4j/slf4j-api/1.6.1/slf4j-api-1.6.1.jar:/home/hudson/.m2/repository/log4j/log4j/1.2.16/log4j-1.2.16.jar:/home/hudson/.m2/repository/org/codehaus/jackson/jackson-core-asl/1.6.1/jackson-core-asl-1.6.1.jar:/home/hudson/.m2/repository/org/codehaus/jackson/jackson-mapper-asl/1.6.1/jackson-mapper-asl-1.6.1.jar:/home/hudson/.m2/repository/org/scala-lang/scala-library/2.9.0-1/scala-library-2.9.0-1.jar:/home/hudson/.m2/repository/org/scala-lang/scala-compiler/2.9.0-1/scala-compiler-2.9.0-1.jar]
	at org.apache.tools.ant.taskdefs.Definer.addDefinition(Definer.java:627)
	at org.apache.tools.ant.taskdefs.Definer.execute(Definer.java:239)
	at org.apache.tools.ant.UnknownElement.execute(UnknownElement.java:291)
	at sun.reflect.NativeMethodAccessorImpl.invoke0(Native Method)
	at sun.reflect.NativeMethodAccessorImpl.invoke(NativeMethodAccessorImpl.java:39)
	at sun.reflect.DelegatingMethodAccessorImpl.invoke(DelegatingMethodAccessorImpl.java:25)
	at java.lang.reflect.Method.invoke(Method.java:597)
	at org.apache.tools.ant.dispatch.DispatchUtils.execute(DispatchUtils.java:106)
	at org.apache.tools.ant.Task.perform(Task.java:348)
	at org.apache.tools.ant.Target.execute(Target.java:390)
	at org.apache.tools.ant.Target.performTasks(Target.java:411)
	at org.apache.tools.ant.Project.executeSortedTargets(Project.java:1397)
	at org.apache.tools.ant.Project.executeTarget(Project.java:1366)
	at org.apache.maven.plugin.antrun.AntRunMojo.execute(AntRunMojo.java:270)
	... 29 more
Caused by: java.lang.NoClassDefFoundError: com/sun/mirror/apt/AnnotationProcessorFactory
	at java.lang.Class.forName0(Native Method)
	at java.lang.Class.forName(Class.java:247)
	at org.apache.tools.ant.taskdefs.Definer.addDefinition(Definer.java:594)
	... 42 more
Caused by: java.lang.ClassNotFoundException: com.sun.mirror.apt.AnnotationProcessorFactory
	at org.codehaus.plexus.classworlds.strategy.SelfFirstStrategy.loadClass(SelfFirstStrategy.java:50)
	at org.codehaus.plexus.classworlds.realm.ClassRealm.loadClass(ClassRealm.java:244)
	at org.codehaus.plexus.classworlds.realm.ClassRealm.loadClass(ClassRealm.java:230)
	... 45 more
Sending e-mails to: commits@activemq.apache.org
channel stopped
IRC notifier plugin: Sending notification to: #activemq


Mime
View raw message