activemq-commits mailing list archives

Site index · List index
Message view « Date » · « Thread »
Top « Date » · « Thread »
From Apache Jenkins Server <jenk...@builds.apache.org>
Subject Build failed in Jenkins: ActiveMQ-Apollo-Deploy #160
Date Thu, 08 Sep 2011 03:23:13 GMT
See <https://builds.apache.org/job/ActiveMQ-Apollo-Deploy/160/changes>

Changes:

[chirino] If the destination path is empty then it means that we are just re-connecting to
an existing durable subscription.

[chirino] Durable sub authorization was broken.

------------------------------------------
[...truncated 6092 lines...]
Downloading: http://download.java.net/maven/2/org/apache/maven/shared/maven-common-artifact-filters/1.0-alpha-1/maven-common-artifact-filters-1.0-alpha-1.pom
Downloading: http://repo1.maven.org/maven2/org/apache/maven/shared/maven-common-artifact-filters/1.0-alpha-1/maven-common-artifact-filters-1.0-alpha-1.pom
Downloaded: http://repo1.maven.org/maven2/org/apache/maven/shared/maven-common-artifact-filters/1.0-alpha-1/maven-common-artifact-filters-1.0-alpha-1.pom
(2 KB at 5.9 KB/sec)
Downloading: http://repo.fusesource.com/nexus/content/groups/public/org/apache/maven/shared/maven-shared-components/6/maven-shared-components-6.pom
Downloading: http://scala-tools.org/repo-releases/org/apache/maven/shared/maven-shared-components/6/maven-shared-components-6.pom
Downloading: http://download.java.net/maven/2/org/apache/maven/shared/maven-shared-components/6/maven-shared-components-6.pom
Downloading: http://repo1.maven.org/maven2/org/apache/maven/shared/maven-shared-components/6/maven-shared-components-6.pom
Downloaded: http://repo1.maven.org/maven2/org/apache/maven/shared/maven-shared-components/6/maven-shared-components-6.pom
(4 KB at 9.1 KB/sec)
Downloading: http://repo.fusesource.com/nexus/content/groups/public/org/apache/maven/doxia/doxia-sink-api/1.1/doxia-sink-api-1.1.jar
Downloading: http://repo.fusesource.com/nexus/content/groups/public/org/apache/maven/shared/maven-common-artifact-filters/1.3/maven-common-artifact-filters-1.3.jar
Downloading: http://repo.fusesource.com/nexus/content/groups/public/org/codehaus/plexus/plexus-archiver/1.1/plexus-archiver-1.1.jar
Downloading: http://repo.fusesource.com/nexus/content/groups/public/org/apache/maven/shared/maven-shared-io/1.1/maven-shared-io-1.1.jar
Downloading: http://repo.fusesource.com/nexus/content/groups/public/org/apache/maven/shared/maven-filtering/1.0/maven-filtering-1.0.jar
Downloading: http://repo.fusesource.com/nexus/content/groups/public/org/codehaus/plexus/plexus-io/1.0.1/plexus-io-1.0.1.jar
Downloading: http://repo.fusesource.com/nexus/content/groups/public/org/apache/maven/shared/maven-repository-builder/1.0-alpha-2/maven-repository-builder-1.0-alpha-2.jar
Downloading: http://scala-tools.org/repo-releases/org/apache/maven/doxia/doxia-sink-api/1.1/doxia-sink-api-1.1.jar
Downloading: http://scala-tools.org/repo-releases/org/apache/maven/shared/maven-common-artifact-filters/1.3/maven-common-artifact-filters-1.3.jar
Downloading: http://scala-tools.org/repo-releases/org/codehaus/plexus/plexus-archiver/1.1/plexus-archiver-1.1.jar
Downloading: http://scala-tools.org/repo-releases/org/apache/maven/shared/maven-shared-io/1.1/maven-shared-io-1.1.jar
Downloading: http://scala-tools.org/repo-releases/org/apache/maven/shared/maven-filtering/1.0/maven-filtering-1.0.jar
Downloading: http://scala-tools.org/repo-releases/org/codehaus/plexus/plexus-io/1.0.1/plexus-io-1.0.1.jar
Downloading: http://scala-tools.org/repo-releases/org/apache/maven/shared/maven-repository-builder/1.0-alpha-2/maven-repository-builder-1.0-alpha-2.jar
Downloading: http://download.java.net/maven/2/org/apache/maven/doxia/doxia-sink-api/1.1/doxia-sink-api-1.1.jar
Downloading: http://download.java.net/maven/2/org/apache/maven/shared/maven-common-artifact-filters/1.3/maven-common-artifact-filters-1.3.jar
Downloading: http://download.java.net/maven/2/org/codehaus/plexus/plexus-archiver/1.1/plexus-archiver-1.1.jar
Downloading: http://download.java.net/maven/2/org/apache/maven/shared/maven-shared-io/1.1/maven-shared-io-1.1.jar
Downloading: http://download.java.net/maven/2/org/apache/maven/shared/maven-filtering/1.0/maven-filtering-1.0.jar
Downloading: http://download.java.net/maven/2/org/codehaus/plexus/plexus-io/1.0.1/plexus-io-1.0.1.jar
Downloading: http://download.java.net/maven/2/org/apache/maven/shared/maven-repository-builder/1.0-alpha-2/maven-repository-builder-1.0-alpha-2.jar
Downloading: http://repo1.maven.org/maven2/org/apache/maven/doxia/doxia-sink-api/1.1/doxia-sink-api-1.1.jar
Downloading: http://repo1.maven.org/maven2/org/apache/maven/shared/maven-common-artifact-filters/1.3/maven-common-artifact-filters-1.3.jar
Downloading: http://repo1.maven.org/maven2/org/codehaus/plexus/plexus-archiver/1.1/plexus-archiver-1.1.jar
Downloading: http://repo1.maven.org/maven2/org/apache/maven/shared/maven-filtering/1.0/maven-filtering-1.0.jar
Downloading: http://repo1.maven.org/maven2/org/apache/maven/shared/maven-shared-io/1.1/maven-shared-io-1.1.jar
Downloaded: http://repo1.maven.org/maven2/org/apache/maven/doxia/doxia-sink-api/1.1/doxia-sink-api-1.1.jar
(13 KB at 9.6 KB/sec)
Downloading: http://repo1.maven.org/maven2/org/codehaus/plexus/plexus-io/1.0.1/plexus-io-1.0.1.jar
Downloaded: http://repo1.maven.org/maven2/org/apache/maven/shared/maven-filtering/1.0/maven-filtering-1.0.jar
(42 KB at 27.1 KB/sec)
Downloading: http://repo1.maven.org/maven2/org/apache/maven/shared/maven-repository-builder/1.0-alpha-2/maven-repository-builder-1.0-alpha-2.jar
Downloaded: http://repo1.maven.org/maven2/org/codehaus/plexus/plexus-archiver/1.1/plexus-archiver-1.1.jar
(178 KB at 98.0 KB/sec)
Downloaded: http://repo1.maven.org/maven2/org/apache/maven/shared/maven-common-artifact-filters/1.3/maven-common-artifact-filters-1.3.jar
(31 KB at 14.8 KB/sec)
Downloaded: http://repo1.maven.org/maven2/org/apache/maven/shared/maven-shared-io/1.1/maven-shared-io-1.1.jar
(39 KB at 16.8 KB/sec)
Downloaded: http://repo1.maven.org/maven2/org/codehaus/plexus/plexus-io/1.0.1/plexus-io-1.0.1.jar
(50 KB at 28.4 KB/sec)
Downloaded: http://repo1.maven.org/maven2/org/apache/maven/shared/maven-repository-builder/1.0-alpha-2/maven-repository-builder-1.0-alpha-2.jar
(23 KB at 12.8 KB/sec)
[INFO] Reading assembly descriptor: <https://builds.apache.org/job/ActiveMQ-Apollo-Deploy/ws/trunk/apollo-distro/src/main/descriptors/unix-bin.xml>
[INFO] No files selected for line-ending conversion or filtering. Skipping: <https://builds.apache.org/job/ActiveMQ-Apollo-Deploy/ws/trunk/apollo-distro/..>
[WARNING] Cannot include project artifact: org.apache.activemq:apache-apollo:pom:1.0-SNAPSHOT;
it doesn't have an associated file or directory.
[WARNING] The following patterns were never triggered in this artifact inclusion filter:
o  'org.fusesource.hawtdb:*'

[WARNING] Cannot include project artifact: org.apache.activemq:apache-apollo:pom:1.0-SNAPSHOT;
it doesn't have an associated file or directory.
[INFO] Building tar : <https://builds.apache.org/job/ActiveMQ-Apollo-Deploy/ws/trunk/apollo-distro/target/apache-apollo-1.0-SNAPSHOT-unix-distro.tar.gz>
[INFO] Reading assembly descriptor: <https://builds.apache.org/job/ActiveMQ-Apollo-Deploy/ws/trunk/apollo-distro/src/main/descriptors/windows-bin.xml>
[INFO] 
[INFO] --- maven-assembly-plugin:2.2.1:single (windows-bin) @ apache-apollo ---
[INFO] No files selected for line-ending conversion or filtering. Skipping: <https://builds.apache.org/job/ActiveMQ-Apollo-Deploy/ws/trunk/apollo-distro/..>
[WARNING] Cannot include project artifact: org.apache.activemq:apache-apollo:pom:1.0-SNAPSHOT;
it doesn't have an associated file or directory.
[WARNING] The following patterns were never triggered in this artifact inclusion filter:
o  'org.fusesource.hawtdb:*'

[WARNING] Cannot include project artifact: org.apache.activemq:apache-apollo:pom:1.0-SNAPSHOT;
it doesn't have an associated file or directory.
[INFO] Building zip: <https://builds.apache.org/job/ActiveMQ-Apollo-Deploy/ws/trunk/apollo-distro/target/apache-apollo-1.0-SNAPSHOT-windows-distro.zip>
[INFO] [INFO] Installing <https://builds.apache.org/job/ActiveMQ-Apollo-Deploy/ws/trunk/apollo-distro/pom.xml>
to <https://builds.apache.org/job/ActiveMQ-Apollo-Deploy/ws/.repository/org/apache/activemq/apache-apollo/1.0-SNAPSHOT/apache-apollo-1.0-SNAPSHOT.pom>
[INFO] Installing <https://builds.apache.org/job/ActiveMQ-Apollo-Deploy/ws/trunk/apollo-distro/target/apache-apollo-1.0-SNAPSHOT-unix-distro.tar.gz>
to <https://builds.apache.org/job/ActiveMQ-Apollo-Deploy/ws/.repository/org/apache/activemq/apache-apollo/1.0-SNAPSHOT/apache-apollo-1.0-SNAPSHOT-unix-distro.tar.gz>

[INFO] [INFO] Installing <https://builds.apache.org/job/ActiveMQ-Apollo-Deploy/ws/trunk/apollo-distro/target/apache-apollo-1.0-SNAPSHOT-windows-distro.zip>
to <https://builds.apache.org/job/ActiveMQ-Apollo-Deploy/ws/.repository/org/apache/activemq/apache-apollo/1.0-SNAPSHOT/apache-apollo-1.0-SNAPSHOT-windows-distro.zip>
--- maven-install-plugin:2.3.1:install (default-install) @ apache-apollo ---
[INFO] Downloading: https://repository.apache.org/content/repositories/snapshots/org/apache/activemq/apache-apollo/1.0-SNAPSHOT/maven-metadata.xml

[INFO] --- maven-deploy-plugin:2.5:deploy (default-deploy) @ apache-apollo ---
Downloaded: https://repository.apache.org/content/repositories/snapshots/org/apache/activemq/apache-apollo/1.0-SNAPSHOT/maven-metadata.xml
(2 KB at 3.8 KB/sec)
Uploading: https://repository.apache.org/content/repositories/snapshots/org/apache/activemq/apache-apollo/1.0-SNAPSHOT/apache-apollo-1.0-20110908.032253-202.pom
Uploaded: https://repository.apache.org/content/repositories/snapshots/org/apache/activemq/apache-apollo/1.0-SNAPSHOT/apache-apollo-1.0-20110908.032253-202.pom
(6 KB at 16.7 KB/sec)
Downloading: https://repository.apache.org/content/repositories/snapshots/org/apache/activemq/apache-apollo/maven-metadata.xml
Downloaded: https://repository.apache.org/content/repositories/snapshots/org/apache/activemq/apache-apollo/maven-metadata.xml
(290 B at 2.4 KB/sec)
Uploading: https://repository.apache.org/content/repositories/snapshots/org/apache/activemq/apache-apollo/1.0-SNAPSHOT/maven-metadata.xml
Uploaded: https://repository.apache.org/content/repositories/snapshots/org/apache/activemq/apache-apollo/1.0-SNAPSHOT/maven-metadata.xml
(2 KB at 6.0 KB/sec)
Uploading: https://repository.apache.org/content/repositories/snapshots/org/apache/activemq/apache-apollo/maven-metadata.xml
Uploaded: https://repository.apache.org/content/repositories/snapshots/org/apache/activemq/apache-apollo/maven-metadata.xml
(290 B at 1.8 KB/sec)
Uploading: https://repository.apache.org/content/repositories/snapshots/org/apache/activemq/apache-apollo/1.0-SNAPSHOT/apache-apollo-1.0-20110908.032253-202-unix-distro.tar.gz
Uploaded: https://repository.apache.org/content/repositories/snapshots/org/apache/activemq/apache-apollo/1.0-SNAPSHOT/apache-apollo-1.0-20110908.032253-202-unix-distro.tar.gz
(17006 KB at 6912.7 KB/sec)
Uploading: https://repository.apache.org/content/repositories/snapshots/org/apache/activemq/apache-apollo/1.0-SNAPSHOT/maven-metadata.xml
Uploaded: https://repository.apache.org/content/repositories/snapshots/org/apache/activemq/apache-apollo/1.0-SNAPSHOT/maven-metadata.xml
(2 KB at 7.8 KB/sec)
Uploading: https://repository.apache.org/content/repositories/snapshots/org/apache/activemq/apache-apollo/1.0-SNAPSHOT/apache-apollo-1.0-20110908.032253-202-windows-distro.zip
Uploaded: https://repository.apache.org/content/repositories/snapshots/org/apache/activemq/apache-apollo/1.0-SNAPSHOT/apache-apollo-1.0-20110908.032253-202-windows-distro.zip
(17042 KB at 4823.6 KB/sec)
Uploading: https://repository.apache.org/content/repositories/snapshots/org/apache/activemq/apache-apollo/1.0-SNAPSHOT/maven-metadata.xml
Uploaded: https://repository.apache.org/content/repositories/snapshots/org/apache/activemq/apache-apollo/1.0-SNAPSHOT/maven-metadata.xml
(2 KB at 6.8 KB/sec)
projectSucceeded org.apache.activemq:apache-apollo:1.0-SNAPSHOT
[JENKINS] Archiving disabled - not archiving <https://builds.apache.org/job/ActiveMQ-Apollo-Deploy/ws/trunk/apollo-distro/pom.xml>
[JENKINS] Archiving disabled - not archiving <https://builds.apache.org/job/ActiveMQ-Apollo-Deploy/ws/trunk/apollo-distro/target/apache-apollo-1.0-SNAPSHOT-unix-distro.tar.gz>
[JENKINS] Archiving disabled - not archiving <https://builds.apache.org/job/ActiveMQ-Apollo-Deploy/ws/trunk/apollo-distro/target/apache-apollo-1.0-SNAPSHOT-windows-distro.zip>
[INFO] Downloading: http://repo.fusesource.com/nexus/content/groups/public/org/codehaus/mojo/build-helper-maven-plugin/1.2/build-helper-maven-plugin-1.2.pom
                                                                        
[INFO] ------------------------------------------------------------------------
[INFO] Building apollo-karaf-feature 1.0-SNAPSHOT
[INFO] ------------------------------------------------------------------------
Downloading: http://scala-tools.org/repo-releases/org/codehaus/mojo/build-helper-maven-plugin/1.2/build-helper-maven-plugin-1.2.pom
Downloading: http://download.java.net/maven/2/org/codehaus/mojo/build-helper-maven-plugin/1.2/build-helper-maven-plugin-1.2.pom
Downloading: http://repo1.maven.org/maven2/org/codehaus/mojo/build-helper-maven-plugin/1.2/build-helper-maven-plugin-1.2.pom
Downloaded: http://repo1.maven.org/maven2/org/codehaus/mojo/build-helper-maven-plugin/1.2/build-helper-maven-plugin-1.2.pom
(3 KB at 7.8 KB/sec)
Downloading: http://repo.fusesource.com/nexus/content/groups/public/org/codehaus/mojo/build-helper-maven-plugin/1.2/build-helper-maven-plugin-1.2.jar
Downloading: http://scala-tools.org/repo-releases/org/codehaus/mojo/build-helper-maven-plugin/1.2/build-helper-maven-plugin-1.2.jar
Downloading: http://download.java.net/maven/2/org/codehaus/mojo/build-helper-maven-plugin/1.2/build-helper-maven-plugin-1.2.jar
Downloading: http://repo1.maven.org/maven2/org/codehaus/mojo/build-helper-maven-plugin/1.2/build-helper-maven-plugin-1.2.jar
Downloaded: http://repo1.maven.org/maven2/org/codehaus/mojo/build-helper-maven-plugin/1.2/build-helper-maven-plugin-1.2.jar
(11 KB at 33.3 KB/sec)
[INFO] 
[INFO] --- maven-clean-plugin:2.4.1:clean (default-clean) @ apollo-karaf-feature ---
[INFO] 
[INFO] --- maven-enforcer-plugin:1.0:enforce (default) @ apollo-karaf-feature ---
[INFO] 
[INFO] --- maven-remote-resources-plugin:1.1:process (default) @ apollo-karaf-feature ---
[INFO] [INFO] Using 'UTF-8' encoding to copy filtered resources.
[INFO] Copying 1 resource
[INFO] Copying 3 resources

[INFO] --- maven-resources-plugin:2.4.3:resources (filter) @ apollo-karaf-feature ---
[INFO] Downloading: http://repo.fusesource.com/nexus/content/groups/public/org/apache/maven/maven-project/2.0.2/maven-project-2.0.2.pom

[INFO] --- build-helper-maven-plugin:1.2:attach-artifact (attach-artifacts) @ apollo-karaf-feature
---
Downloaded: http://repo.fusesource.com/nexus/content/groups/public/org/apache/maven/maven-project/2.0.2/maven-project-2.0.2.pom
(2 KB at 1.3 KB/sec)
Downloading: http://repo.fusesource.com/nexus/content/groups/public/org/apache/maven/maven-profile/2.0.2/maven-profile-2.0.2.pom
Downloaded: http://repo.fusesource.com/nexus/content/groups/public/org/apache/maven/maven-profile/2.0.2/maven-profile-2.0.2.pom
(2 KB at 1.0 KB/sec)
Downloading: http://repo.fusesource.com/nexus/content/groups/public/org/apache/maven/maven-model/2.0.2/maven-model-2.0.2.pom
Downloaded: http://repo.fusesource.com/nexus/content/groups/public/org/apache/maven/maven-model/2.0.2/maven-model-2.0.2.pom
(3 KB at 3.9 KB/sec)
Downloading: http://repo.fusesource.com/nexus/content/groups/public/org/codehaus/plexus/plexus-utils/1.1/plexus-utils-1.1.jar
Downloaded: http://repo.fusesource.com/nexus/content/groups/public/org/codehaus/plexus/plexus-utils/1.1/plexus-utils-1.1.jar
(165 KB at 120.2 KB/sec)
[INFO] [INFO] Installing <https://builds.apache.org/job/ActiveMQ-Apollo-Deploy/ws/trunk/apollo-karaf-feature/pom.xml>
to <https://builds.apache.org/job/ActiveMQ-Apollo-Deploy/ws/.repository/org/apache/activemq/apollo-karaf-feature/1.0-SNAPSHOT/apollo-karaf-feature-1.0-SNAPSHOT.pom>
[INFO] Installing <https://builds.apache.org/job/ActiveMQ-Apollo-Deploy/ws/trunk/apollo-karaf-feature/target/classes/features.xml>
to <https://builds.apache.org/job/ActiveMQ-Apollo-Deploy/ws/.repository/org/apache/activemq/apollo-karaf-feature/1.0-SNAPSHOT/apollo-karaf-feature-1.0-SNAPSHOT-features.xml>

[INFO] --- maven-install-plugin:2.3.1:install (default-install) @ apollo-karaf-feature ---
[INFO] Downloading: https://repository.apache.org/content/repositories/snapshots/org/apache/activemq/apollo-karaf-feature/1.0-SNAPSHOT/maven-metadata.xml

[INFO] --- maven-deploy-plugin:2.5:deploy (default-deploy) @ apollo-karaf-feature ---
Downloaded: https://repository.apache.org/content/repositories/snapshots/org/apache/activemq/apollo-karaf-feature/1.0-SNAPSHOT/maven-metadata.xml
(831 B at 2.4 KB/sec)
Uploading: https://repository.apache.org/content/repositories/snapshots/org/apache/activemq/apollo-karaf-feature/1.0-SNAPSHOT/apollo-karaf-feature-1.0-20110908.032309-117.pom
Uploaded: https://repository.apache.org/content/repositories/snapshots/org/apache/activemq/apollo-karaf-feature/1.0-SNAPSHOT/apollo-karaf-feature-1.0-20110908.032309-117.pom
(3 KB at 15.8 KB/sec)
Downloading: https://repository.apache.org/content/repositories/snapshots/org/apache/activemq/apollo-karaf-feature/maven-metadata.xml
Downloaded: https://repository.apache.org/content/repositories/snapshots/org/apache/activemq/apollo-karaf-feature/maven-metadata.xml
(297 B at 1.5 KB/sec)
Uploading: https://repository.apache.org/content/repositories/snapshots/org/apache/activemq/apollo-karaf-feature/1.0-SNAPSHOT/maven-metadata.xml
Uploaded: https://repository.apache.org/content/repositories/snapshots/org/apache/activemq/apollo-karaf-feature/1.0-SNAPSHOT/maven-metadata.xml
(831 B at 2.8 KB/sec)
Uploading: https://repository.apache.org/content/repositories/snapshots/org/apache/activemq/apollo-karaf-feature/maven-metadata.xml
Uploaded: https://repository.apache.org/content/repositories/snapshots/org/apache/activemq/apollo-karaf-feature/maven-metadata.xml
(297 B at 1.2 KB/sec)
Uploading: https://repository.apache.org/content/repositories/snapshots/org/apache/activemq/apollo-karaf-feature/1.0-SNAPSHOT/apollo-karaf-feature-1.0-20110908.032309-117-features.xml
Uploaded: https://repository.apache.org/content/repositories/snapshots/org/apache/activemq/apollo-karaf-feature/1.0-SNAPSHOT/apollo-karaf-feature-1.0-20110908.032309-117-features.xml
(4 KB at 23.2 KB/sec)
Uploading: https://repository.apache.org/content/repositories/snapshots/org/apache/activemq/apollo-karaf-feature/1.0-SNAPSHOT/maven-metadata.xml
Uploaded: https://repository.apache.org/content/repositories/snapshots/org/apache/activemq/apollo-karaf-feature/1.0-SNAPSHOT/maven-metadata.xml
(831 B at 5.7 KB/sec)
projectSucceeded org.apache.activemq:apollo-karaf-feature:1.0-SNAPSHOT
[JENKINS] Archiving disabled - not archiving <https://builds.apache.org/job/ActiveMQ-Apollo-Deploy/ws/trunk/apollo-karaf-feature/pom.xml>
[JENKINS] Archiving disabled - not archiving <https://builds.apache.org/job/ActiveMQ-Apollo-Deploy/ws/trunk/apollo-karaf-feature/target/classes/features.xml>
sessionEnded
[INFO] ------------------------------------------------------------------------
[INFO] Reactor Summary:
[INFO] 
[INFO] Apache ActiveMQ Apollo Project .................... SUCCESS [3:32.945s]
[INFO] apollo-boot ....................................... SUCCESS [50.704s]
[INFO] apollo-scala ...................................... SUCCESS [1:39.678s]
[INFO] apollo-util ....................................... SUCCESS [1:05.172s]
[INFO] apollo-transport .................................. SUCCESS [4.278s]
[INFO] apollo-dto ........................................ SUCCESS [41.462s]
[INFO] apollo-selector ................................... SUCCESS [59.848s]
[INFO] apollo-broker ..................................... SUCCESS [1:18.567s]
[INFO] apollo-tcp ........................................ SUCCESS [3.864s]
[INFO] apollo-web ........................................ SUCCESS [2:57.859s]
[INFO] apollo-bdb ........................................ SUCCESS [34.328s]
[INFO] apollo-jdbm2 ...................................... SUCCESS [26.947s]
[INFO] apollo-stomp ...................................... SUCCESS [42.988s]
[INFO] apollo-cli ........................................ SUCCESS [2:09.393s]
[INFO] apollo-website .................................... FAILURE [3.734s]
[INFO] apache-apollo ..................................... SUCCESS [1:03.135s]
[INFO] apollo-karaf-feature .............................. SUCCESS [9.887s]
[INFO] ------------------------------------------------------------------------
[INFO] BUILD FAILURE
[INFO] ------------------------------------------------------------------------
[INFO] Total time: 18:34.893s
[INFO] Finished at: Thu Sep 08 03:23:11 UTC 2011
[INFO] [WARNING] The requested profile "deploy" could not be activated because it does not
exist.
Final Memory: 147M/1163M
[INFO] ------------------------------------------------------------------------
mavenExecutionResult exceptions not empty
message : Failed to execute goal org.apache.maven.plugins:maven-antrun-plugin:1.6:run (default)
on project apollo-website: An Ant BuildException has occured: taskdef A class needed by class
com.sun.tools.jxc.SchemaGenTask cannot be found: com/sun/mirror/apt/AnnotationProcessorFactory
 using the classloader AntClassLoader[<https://builds.apache.org/job/ActiveMQ-Apollo-Deploy/ws/.repository/org/fusesource/scalate/scalate-wikitext/1.5.1/scalate-wikitext-1.5.1.jar>:<https://builds.apache.org/job/ActiveMQ-Apollo-Deploy/ws/.repository/org/fusesource/scalate/scalate-core/1.5.1/scalate-core-1.5.1.jar>:<https://builds.apache.org/job/ActiveMQ-Apollo-Deploy/ws/.repository/org/fusesource/scalate/scalate-util/1.5.1/scalate-util-1.5.1.jar>:<https://builds.apache.org/job/ActiveMQ-Apollo-Deploy/ws/.repository/org/fusesource/wikitext/confluence-core/1.2/confluence-core-1.2.jar>:<https://builds.apache.org/job/ActiveMQ-Apollo-Deploy/ws/.repository/org/fusesource/wikitext/wikitext-core/1.2/wikitext-core-1.2.jar>:<https://builds.apache.org/job/ActiveMQ-Apollo-Deploy/ws/.repository/org/fusesource/wikitext/textile-core/1.2/textile-core-1.2.jar>:<https://builds.apache.org/job/ActiveMQ-Apollo-Deploy/ws/.repository/org/fusesource/scalate/scalate-page/1.5.1/scalate-page-1.5.1.jar>:<https://builds.apache.org/job/ActiveMQ-Apollo-Deploy/ws/.repository/org/yaml/snakeyaml/1.7/snakeyaml-1.7.jar>:<https://builds.apache.org/job/ActiveMQ-Apollo-Deploy/ws/.repository/org/fusesource/scalamd/scalamd/1.5/scalamd-1.5.jar>:<https://builds.apache.org/job/ActiveMQ-Apollo-Deploy/ws/.repository/org/slf4j/slf4j-log4j12/1.6.1/slf4j-log4j12-1.6.1.jar>:<https://builds.apache.org/job/ActiveMQ-Apollo-Deploy/ws/.repository/org/slf4j/slf4j-api/1.6.1/slf4j-api-1.6.1.jar>:<https://builds.apache.org/job/ActiveMQ-Apollo-Deploy/ws/.repository/log4j/log4j/1.2.16/log4j-1.2.16.jar>:<https://builds.apache.org/job/ActiveMQ-Apollo-Deploy/ws/.repository/org/codehaus/jackson/jackson-core-asl/1.6.1/jackson-core-asl-1.6.1.jar>:<https://builds.apache.org/job/ActiveMQ-Apollo-Deploy/ws/.repository/org/codehaus/jackson/jackson-mapper-asl/1.6.1/jackson-mapper-asl-1.6.1.jar>:<https://builds.apache.org/job/ActiveMQ-Apollo-Deploy/ws/.repository/org/scala-lang/scala-library/2.9.0-1/scala-library-2.9.0-1.jar>:<https://builds.apache.org/job/ActiveMQ-Apollo-Deploy/ws/.repository/org/scala-lang/scala-compiler/2.9.0-1/scala-compiler-2.9.0-1.jar]>
cause : An Ant BuildException has occured: taskdef A class needed by class com.sun.tools.jxc.SchemaGenTask
cannot be found: com/sun/mirror/apt/AnnotationProcessorFactory
 using the classloader AntClassLoader[<https://builds.apache.org/job/ActiveMQ-Apollo-Deploy/ws/.repository/org/fusesource/scalate/scalate-wikitext/1.5.1/scalate-wikitext-1.5.1.jar>:<https://builds.apache.org/job/ActiveMQ-Apollo-Deploy/ws/.repository/org/fusesource/scalate/scalate-core/1.5.1/scalate-core-1.5.1.jar>:<https://builds.apache.org/job/ActiveMQ-Apollo-Deploy/ws/.repository/org/fusesource/scalate/scalate-util/1.5.1/scalate-util-1.5.1.jar>:<https://builds.apache.org/job/ActiveMQ-Apollo-Deploy/ws/.repository/org/fusesource/wikitext/confluence-core/1.2/confluence-core-1.2.jar>:<https://builds.apache.org/job/ActiveMQ-Apollo-Deploy/ws/.repository/org/fusesource/wikitext/wikitext-core/1.2/wikitext-core-1.2.jar>:<https://builds.apache.org/job/ActiveMQ-Apollo-Deploy/ws/.repository/org/fusesource/wikitext/textile-core/1.2/textile-core-1.2.jar>:<https://builds.apache.org/job/ActiveMQ-Apollo-Deploy/ws/.repository/org/fusesource/scalate/scalate-page/1.5.1/scalate-page-1.5.1.jar>:<https://builds.apache.org/job/ActiveMQ-Apollo-Deploy/ws/.repository/org/yaml/snakeyaml/1.7/snakeyaml-1.7.jar>:<https://builds.apache.org/job/ActiveMQ-Apollo-Deploy/ws/.repository/org/fusesource/scalamd/scalamd/1.5/scalamd-1.5.jar>:<https://builds.apache.org/job/ActiveMQ-Apollo-Deploy/ws/.repository/org/slf4j/slf4j-log4j12/1.6.1/slf4j-log4j12-1.6.1.jar>:<https://builds.apache.org/job/ActiveMQ-Apollo-Deploy/ws/.repository/org/slf4j/slf4j-api/1.6.1/slf4j-api-1.6.1.jar>:<https://builds.apache.org/job/ActiveMQ-Apollo-Deploy/ws/.repository/log4j/log4j/1.2.16/log4j-1.2.16.jar>:<https://builds.apache.org/job/ActiveMQ-Apollo-Deploy/ws/.repository/org/codehaus/jackson/jackson-core-asl/1.6.1/jackson-core-asl-1.6.1.jar>:<https://builds.apache.org/job/ActiveMQ-Apollo-Deploy/ws/.repository/org/codehaus/jackson/jackson-mapper-asl/1.6.1/jackson-mapper-asl-1.6.1.jar>:<https://builds.apache.org/job/ActiveMQ-Apollo-Deploy/ws/.repository/org/scala-lang/scala-library/2.9.0-1/scala-library-2.9.0-1.jar>:<https://builds.apache.org/job/ActiveMQ-Apollo-Deploy/ws/.repository/org/scala-lang/scala-compiler/2.9.0-1/scala-compiler-2.9.0-1.jar]>
Stack trace : 
org.apache.maven.lifecycle.LifecycleExecutionException: Failed to execute goal org.apache.maven.plugins:maven-antrun-plugin:1.6:run
(default) on project apollo-website: An Ant BuildException has occured: taskdef A class needed
by class com.sun.tools.jxc.SchemaGenTask cannot be found: com/sun/mirror/apt/AnnotationProcessorFactory
 using the classloader AntClassLoader[<https://builds.apache.org/job/ActiveMQ-Apollo-Deploy/ws/.repository/org/fusesource/scalate/scalate-wikitext/1.5.1/scalate-wikitext-1.5.1.jar>:<https://builds.apache.org/job/ActiveMQ-Apollo-Deploy/ws/.repository/org/fusesource/scalate/scalate-core/1.5.1/scalate-core-1.5.1.jar>:<https://builds.apache.org/job/ActiveMQ-Apollo-Deploy/ws/.repository/org/fusesource/scalate/scalate-util/1.5.1/scalate-util-1.5.1.jar>:<https://builds.apache.org/job/ActiveMQ-Apollo-Deploy/ws/.repository/org/fusesource/wikitext/confluence-core/1.2/confluence-core-1.2.jar>:<https://builds.apache.org/job/ActiveMQ-Apollo-Deploy/ws/.repository/org/fusesource/wikitext/wikitext-core/1.2/wikitext-core-1.2.jar>:<https://builds.apache.org/job/ActiveMQ-Apollo-Deploy/ws/.repository/org/fusesource/wikitext/textile-core/1.2/textile-core-1.2.jar>:<https://builds.apache.org/job/ActiveMQ-Apollo-Deploy/ws/.repository/org/fusesource/scalate/scalate-page/1.5.1/scalate-page-1.5.1.jar>:<https://builds.apache.org/job/ActiveMQ-Apollo-Deploy/ws/.repository/org/yaml/snakeyaml/1.7/snakeyaml-1.7.jar>:<https://builds.apache.org/job/ActiveMQ-Apollo-Deploy/ws/.repository/org/fusesource/scalamd/scalamd/1.5/scalamd-1.5.jar>:<https://builds.apache.org/job/ActiveMQ-Apollo-Deploy/ws/.repository/org/slf4j/slf4j-log4j12/1.6.1/slf4j-log4j12-1.6.1.jar>:<https://builds.apache.org/job/ActiveMQ-Apollo-Deploy/ws/.repository/org/slf4j/slf4j-api/1.6.1/slf4j-api-1.6.1.jar>:<https://builds.apache.org/job/ActiveMQ-Apollo-Deploy/ws/.repository/log4j/log4j/1.2.16/log4j-1.2.16.jar>:<https://builds.apache.org/job/ActiveMQ-Apollo-Deploy/ws/.repository/org/codehaus/jackson/jackson-core-asl/1.6.1/jackson-core-asl-1.6.1.jar>:<https://builds.apache.org/job/ActiveMQ-Apollo-Deploy/ws/.repository/org/codehaus/jackson/jackson-mapper-asl/1.6.1/jackson-mapper-asl-1.6.1.jar>:<https://builds.apache.org/job/ActiveMQ-Apollo-Deploy/ws/.repository/org/scala-lang/scala-library/2.9.0-1/scala-library-2.9.0-1.jar>:<https://builds.apache.org/job/ActiveMQ-Apollo-Deploy/ws/.repository/org/scala-lang/scala-compiler/2.9.0-1/scala-compiler-2.9.0-1.jar]>
	at org.apache.maven.lifecycle.internal.MojoExecutor.execute(MojoExecutor.java:217)
	at org.apache.maven.lifecycle.internal.MojoExecutor.execute(MojoExecutor.java:153)
	at org.apache.maven.lifecycle.internal.MojoExecutor.execute(MojoExecutor.java:145)
	at org.apache.maven.lifecycle.internal.LifecycleModuleBuilder.buildProject(LifecycleModuleBuilder.java:84)
	at org.apache.maven.lifecycle.internal.LifecycleModuleBuilder.buildProject(LifecycleModuleBuilder.java:59)
	at org.apache.maven.lifecycle.internal.LifecycleStarter.singleThreadedBuild(LifecycleStarter.java:183)
	at org.apache.maven.lifecycle.internal.LifecycleStarter.execute(LifecycleStarter.java:161)
	at org.apache.maven.DefaultMaven.doExecute(DefaultMaven.java:319)
	at org.apache.maven.DefaultMaven.execute(DefaultMaven.java:156)
	at org.jvnet.hudson.maven3.launcher.Maven3Launcher.main(Maven3Launcher.java:79)
	at sun.reflect.NativeMethodAccessorImpl.invoke0(Native Method)
	at sun.reflect.NativeMethodAccessorImpl.invoke(NativeMethodAccessorImpl.java:39)
	at sun.reflect.DelegatingMethodAccessorImpl.invoke(DelegatingMethodAccessorImpl.java:25)
	at java.lang.reflect.Method.invoke(Method.java:597)
	at org.codehaus.plexus.classworlds.launcher.Launcher.launchStandard(Launcher.java:329)
	at org.codehaus.plexus.classworlds.launcher.Launcher.launch(Launcher.java:239)
	at org.jvnet.hudson.maven3.agent.Maven3Main.launch(Maven3Main.java:158)
	at hudson.maven.Maven3Builder.call(Maven3Builder.java:121)
	at hudson.maven.Maven3Builder.call(Maven3Builder.java:73)
	at hudson.remoting.UserRequest.perform(UserRequest.java:118)
	at hudson.remoting.UserRequest.perform(UserRequest.java:48)
	at hudson.remoting.Request$2.run(Request.java:287)
	at java.util.concurrent.Executors$RunnableAdapter.call(Executors.java:441)
	at java.util.concurrent.FutureTask$Sync.innerRun(FutureTask.java:303)
	at java.util.concurrent.FutureTask.run(FutureTask.java:138)
	at java.util.concurrent.ThreadPoolExecutor$Worker.runTask(ThreadPoolExecutor.java:886)
	at java.util.concurrent.ThreadPoolExecutor$Worker.run(ThreadPoolExecutor.java:908)
	at java.lang.Thread.run(Thread.java:619)
Caused by: org.apache.maven.plugin.MojoExecutionException: An Ant BuildException has occured:
taskdef A class needed by class com.sun.tools.jxc.SchemaGenTask cannot be found: com/sun/mirror/apt/AnnotationProcessorFactory
 using the classloader AntClassLoader[<https://builds.apache.org/job/ActiveMQ-Apollo-Deploy/ws/.repository/org/fusesource/scalate/scalate-wikitext/1.5.1/scalate-wikitext-1.5.1.jar>:<https://builds.apache.org/job/ActiveMQ-Apollo-Deploy/ws/.repository/org/fusesource/scalate/scalate-core/1.5.1/scalate-core-1.5.1.jar>:<https://builds.apache.org/job/ActiveMQ-Apollo-Deploy/ws/.repository/org/fusesource/scalate/scalate-util/1.5.1/scalate-util-1.5.1.jar>:<https://builds.apache.org/job/ActiveMQ-Apollo-Deploy/ws/.repository/org/fusesource/wikitext/confluence-core/1.2/confluence-core-1.2.jar>:<https://builds.apache.org/job/ActiveMQ-Apollo-Deploy/ws/.repository/org/fusesource/wikitext/wikitext-core/1.2/wikitext-core-1.2.jar>:<https://builds.apache.org/job/ActiveMQ-Apollo-Deploy/ws/.repository/org/fusesource/wikitext/textile-core/1.2/textile-core-1.2.jar>:<https://builds.apache.org/job/ActiveMQ-Apollo-Deploy/ws/.repository/org/fusesource/scalate/scalate-page/1.5.1/scalate-page-1.5.1.jar>:<https://builds.apache.org/job/ActiveMQ-Apollo-Deploy/ws/.repository/org/yaml/snakeyaml/1.7/snakeyaml-1.7.jar>:<https://builds.apache.org/job/ActiveMQ-Apollo-Deploy/ws/.repository/org/fusesource/scalamd/scalamd/1.5/scalamd-1.5.jar>:<https://builds.apache.org/job/ActiveMQ-Apollo-Deploy/ws/.repository/org/slf4j/slf4j-log4j12/1.6.1/slf4j-log4j12-1.6.1.jar>:<https://builds.apache.org/job/ActiveMQ-Apollo-Deploy/ws/.repository/org/slf4j/slf4j-api/1.6.1/slf4j-api-1.6.1.jar>:<https://builds.apache.org/job/ActiveMQ-Apollo-Deploy/ws/.repository/log4j/log4j/1.2.16/log4j-1.2.16.jar>:<https://builds.apache.org/job/ActiveMQ-Apollo-Deploy/ws/.repository/org/codehaus/jackson/jackson-core-asl/1.6.1/jackson-core-asl-1.6.1.jar>:<https://builds.apache.org/job/ActiveMQ-Apollo-Deploy/ws/.repository/org/codehaus/jackson/jackson-mapper-asl/1.6.1/jackson-mapper-asl-1.6.1.jar>:<https://builds.apache.org/job/ActiveMQ-Apollo-Deploy/ws/.repository/org/scala-lang/scala-library/2.9.0-1/scala-library-2.9.0-1.jar>:<https://builds.apache.org/job/ActiveMQ-Apollo-Deploy/ws/.repository/org/scala-lang/scala-compiler/2.9.0-1/scala-compiler-2.9.0-1.jar]>
	at org.apache.maven.plugin.antrun.AntRunMojo.execute(AntRunMojo.java:283)
	at org.apache.maven.plugin.DefaultBuildPluginManager.executeMojo(DefaultBuildPluginManager.java:107)
	at org.apache.maven.lifecycle.internal.MojoExecutor.execute(MojoExecutor.java:209)
	... 27 more
Caused by: <https://builds.apache.org/job/ActiveMQ-Apollo-Deploy/ws/trunk/apollo-website/target/antrun/build-main.xml>:4:
taskdef A class needed by class com.sun.tools.jxc.SchemaGenTask cannot be found: com/sun/mirror/apt/AnnotationProcessorFactory
 using the classloader AntClassLoader[<https://builds.apache.org/job/ActiveMQ-Apollo-Deploy/ws/.repository/org/fusesource/scalate/scalate-wikitext/1.5.1/scalate-wikitext-1.5.1.jar>:<https://builds.apache.org/job/ActiveMQ-Apollo-Deploy/ws/.repository/org/fusesource/scalate/scalate-core/1.5.1/scalate-core-1.5.1.jar>:<https://builds.apache.org/job/ActiveMQ-Apollo-Deploy/ws/.repository/org/fusesource/scalate/scalate-util/1.5.1/scalate-util-1.5.1.jar>:<https://builds.apache.org/job/ActiveMQ-Apollo-Deploy/ws/.repository/org/fusesource/wikitext/confluence-core/1.2/confluence-core-1.2.jar>:<https://builds.apache.org/job/ActiveMQ-Apollo-Deploy/ws/.repository/org/fusesource/wikitext/wikitext-core/1.2/wikitext-core-1.2.jar>:<https://builds.apache.org/job/ActiveMQ-Apollo-Deploy/ws/.repository/org/fusesource/wikitext/textile-core/1.2/textile-core-1.2.jar>:<https://builds.apache.org/job/ActiveMQ-Apollo-Deploy/ws/.repository/org/fusesource/scalate/scalate-page/1.5.1/scalate-page-1.5.1.jar>:<https://builds.apache.org/job/ActiveMQ-Apollo-Deploy/ws/.repository/org/yaml/snakeyaml/1.7/snakeyaml-1.7.jar>:<https://builds.apache.org/job/ActiveMQ-Apollo-Deploy/ws/.repository/org/fusesource/scalamd/scalamd/1.5/scalamd-1.5.jar>:<https://builds.apache.org/job/ActiveMQ-Apollo-Deploy/ws/.repository/org/slf4j/slf4j-log4j12/1.6.1/slf4j-log4j12-1.6.1.jar>:<https://builds.apache.org/job/ActiveMQ-Apollo-Deploy/ws/.repository/org/slf4j/slf4j-api/1.6.1/slf4j-api-1.6.1.jar>:<https://builds.apache.org/job/ActiveMQ-Apollo-Deploy/ws/.repository/log4j/log4j/1.2.16/log4j-1.2.16.jar>:<https://builds.apache.org/job/ActiveMQ-Apollo-Deploy/ws/.repository/org/codehaus/jackson/jackson-core-asl/1.6.1/jackson-core-asl-1.6.1.jar>:<https://builds.apache.org/job/ActiveMQ-Apollo-Deploy/ws/.repository/org/codehaus/jackson/jackson-mapper-asl/1.6.1/jackson-mapper-asl-1.6.1.jar>:<https://builds.apache.org/job/ActiveMQ-Apollo-Deploy/ws/.repository/org/scala-lang/scala-library/2.9.0-1/scala-library-2.9.0-1.jar>:<https://builds.apache.org/job/ActiveMQ-Apollo-Deploy/ws/.repository/org/scala-lang/scala-compiler/2.9.0-1/scala-compiler-2.9.0-1.jar]>
	at org.apache.tools.ant.taskdefs.Definer.addDefinition(Definer.java:627)
	at org.apache.tools.ant.taskdefs.Definer.execute(Definer.java:239)
	at org.apache.tools.ant.UnknownElement.execute(UnknownElement.java:291)
	at sun.reflect.NativeMethodAccessorImpl.invoke0(Native Method)
	at sun.reflect.NativeMethodAccessorImpl.invoke(NativeMethodAccessorImpl.java:39)
	at sun.reflect.DelegatingMethodAccessorImpl.invoke(DelegatingMethodAccessorImpl.java:25)
	at java.lang.reflect.Method.invoke(Method.java:597)
	at org.apache.tools.ant.dispatch.DispatchUtils.execute(DispatchUtils.java:106)
	at org.apache.tools.ant.Task.perform(Task.java:348)
	at org.apache.tools.ant.Target.execute(Target.java:390)
	at org.apache.tools.ant.Target.performTasks(Target.java:411)
	at org.apache.tools.ant.Project.executeSortedTargets(Project.java:1397)
	at org.apache.tools.ant.Project.executeTarget(Project.java:1366)
	at org.apache.maven.plugin.antrun.AntRunMojo.execute(AntRunMojo.java:270)
	... 29 more
Caused by: java.lang.NoClassDefFoundError: com/sun/mirror/apt/AnnotationProcessorFactory
	at java.lang.Class.forName0(Native Method)
	at java.lang.Class.forName(Class.java:247)
	at org.apache.tools.ant.taskdefs.Definer.addDefinition(Definer.java:594)
	... 42 more
Caused by: java.lang.ClassNotFoundException: com.sun.mirror.apt.AnnotationProcessorFactory
	at org.codehaus.plexus.classworlds.strategy.SelfFirstStrategy.loadClass(SelfFirstStrategy.java:50)
	at org.codehaus.plexus.classworlds.realm.ClassRealm.loadClass(ClassRealm.java:244)
	at org.codehaus.plexus.classworlds.realm.ClassRealm.loadClass(ClassRealm.java:230)
	... 45 more
Sending e-mails to: commits@activemq.apache.org
channel stopped
IRC notifier plugin: Sending notification to: #activemq


Mime
View raw message