activemq-commits mailing list archives

Site index · List index
Message view « Date » · « Thread »
Top « Date » · « Thread »
From Apache Jenkins Server <jenk...@builds.apache.org>
Subject Build failed in Jenkins: ActiveMQ-Apollo-Deploy #131
Date Mon, 18 Jul 2011 03:15:21 GMT
See <https://builds.apache.org/job/ActiveMQ-Apollo-Deploy/131/changes>

Changes:

[chirino] Fixing compile error and test case failure.

[chirino] Switch to hawtbuf 1.6 for safer methods for moving the head position in Buffer.

[chirino] Switch to hawtdispatch 1.4 for it's support of ordered dispatch sources.
Improve the LoggingTracker so it's less noisy.

[chirino] Fixes issue where broker was not shutting down when it received a CTRL-C.

[chirino] Implementing toString to aid in debugging.

[chirino] Optimized the stomp codec flush call a bit.

[chirino] Fixes bug where when we attempted to yield to other connections for processing we
did not get called back to resume draining.

[chirino] Added a getWriteBufferSize and getReadBufferSize methods to the ProtocolCodedc interface.

------------------------------------------
[...truncated 5634 lines...]
Downloading: http://download.java.net/maven/2/org/apache/ws/commons/ws-commons-util/1.0.1/ws-commons-util-1.0.1.jar
Downloading: http://repo1.maven.org/maven2/org/slf4j/slf4j-api/1.6.1/slf4j-api-1.6.1.jar
Downloading: http://repo1.maven.org/maven2/org/yaml/snakeyaml/1.7/snakeyaml-1.7.jar
Downloading: http://repo1.maven.org/maven2/org/slf4j/slf4j-nop/1.6.1/slf4j-nop-1.6.1.jar
Downloading: http://repo1.maven.org/maven2/org/apache/maven/maven-plugin-tools-api/2.1/maven-plugin-tools-api-2.1.jar
Downloading: http://repo1.maven.org/maven2/junit/junit/4.8.2/junit-4.8.2.jar
Downloaded: http://repo1.maven.org/maven2/org/yaml/snakeyaml/1.7/snakeyaml-1.7.jar (0 B at
0.0 KB/sec)
Downloading: http://repo1.maven.org/maven2/jline/jline/0.9.94/jline-0.9.94.jar
Downloaded: http://repo1.maven.org/maven2/org/slf4j/slf4j-api/1.6.1/slf4j-api-1.6.1.jar (0
B at 0.0 KB/sec)
Downloading: http://repo1.maven.org/maven2/commons-lang/commons-lang/2.6/commons-lang-2.6.jar
Downloaded: http://repo1.maven.org/maven2/junit/junit/4.8.2/junit-4.8.2.jar (0 B at 0.0 KB/sec)
Downloading: http://repo1.maven.org/maven2/org/apache/maven/wagon/wagon-file/1.0-beta-7/wagon-file-1.0-beta-7.jar
Downloaded: http://repo1.maven.org/maven2/org/slf4j/slf4j-nop/1.6.1/slf4j-nop-1.6.1.jar (5
KB at 2.7 KB/sec)
Downloading: http://repo1.maven.org/maven2/org/apache/maven/wagon/wagon-ssh/1.0-beta-7/wagon-ssh-1.0-beta-7.jar
Downloaded: http://repo1.maven.org/maven2/org/apache/maven/maven-plugin-tools-api/2.1/maven-plugin-tools-api-2.1.jar
(29 KB at 10.2 KB/sec)
Downloading: http://repo1.maven.org/maven2/com/jcraft/jsch/0.1.38/jsch-0.1.38.jar
Downloaded: http://repo1.maven.org/maven2/jline/jline/0.9.94/jline-0.9.94.jar (86 KB at 34.1
KB/sec)
Downloading: http://repo1.maven.org/maven2/org/apache/maven/wagon/wagon-ssh-common/1.0-beta-7/wagon-ssh-common-1.0-beta-7.jar
Downloaded: http://repo1.maven.org/maven2/org/apache/maven/wagon/wagon-file/1.0-beta-7/wagon-file-1.0-beta-7.jar
(11 KB at 4.8 KB/sec)
Downloading: http://repo1.maven.org/maven2/org/codehaus/plexus/plexus-interactivity-api/1.0-alpha-6/plexus-interactivity-api-1.0-alpha-6.jar
Downloaded: http://repo1.maven.org/maven2/commons-lang/commons-lang/2.6/commons-lang-2.6.jar
(278 KB at 101.0 KB/sec)
Downloading: http://repo1.maven.org/maven2/org/apache/maven/wagon/wagon-http-lightweight/1.0-beta-7/wagon-http-lightweight-1.0-beta-7.jar
Downloaded: http://repo1.maven.org/maven2/org/apache/maven/wagon/wagon-ssh/1.0-beta-7/wagon-ssh-1.0-beta-7.jar
(28 KB at 11.1 KB/sec)
Downloading: http://repo1.maven.org/maven2/org/apache/maven/wagon/wagon-http-shared/1.0-beta-7/wagon-http-shared-1.0-beta-7.jar
Downloaded: http://repo1.maven.org/maven2/com/jcraft/jsch/0.1.38/jsch-0.1.38.jar (174 KB at
64.0 KB/sec)
Downloading: http://repo1.maven.org/maven2/nekohtml/xercesMinimal/1.9.6.2/xercesMinimal-1.9.6.2.jar
Downloaded: http://repo1.maven.org/maven2/org/apache/maven/wagon/wagon-ssh-common/1.0-beta-7/wagon-ssh-common-1.0-beta-7.jar
(27 KB at 10.4 KB/sec)
Downloading: http://repo1.maven.org/maven2/nekohtml/nekohtml/1.9.6.2/nekohtml-1.9.6.2.jar
Downloaded: http://repo1.maven.org/maven2/org/codehaus/plexus/plexus-interactivity-api/1.0-alpha-6/plexus-interactivity-api-1.0-alpha-6.jar
(12 KB at 4.6 KB/sec)
Downloading: http://repo1.maven.org/maven2/commons-logging/commons-logging/1.1.1/commons-logging-1.1.1.jar
Downloaded: http://repo1.maven.org/maven2/org/apache/maven/wagon/wagon-http-lightweight/1.0-beta-7/wagon-http-lightweight-1.0-beta-7.jar
(15 KB at 5.8 KB/sec)
Downloading: http://repo1.maven.org/maven2/org/codehaus/plexus/plexus-utils/2.0.2/plexus-utils-2.0.2.jar
Downloaded: http://repo1.maven.org/maven2/org/apache/maven/wagon/wagon-http-shared/1.0-beta-7/wagon-http-shared-1.0-beta-7.jar
(25 KB at 11.1 KB/sec)
Downloading: http://repo1.maven.org/maven2/org/codehaus/swizzle/swizzle-confluence/1.4/swizzle-confluence-1.4.jar
Downloaded: http://repo1.maven.org/maven2/nekohtml/xercesMinimal/1.9.6.2/xercesMinimal-1.9.6.2.jar
(39 KB at 15.5 KB/sec)
Downloading: http://repo1.maven.org/maven2/xmlrpc/xmlrpc-client/3.0/xmlrpc-client-3.0.jar
Downloaded: http://repo1.maven.org/maven2/nekohtml/nekohtml/1.9.6.2/nekohtml-1.9.6.2.jar (110
KB at 43.7 KB/sec)
Downloading: http://repo1.maven.org/maven2/org/apache/xmlrpc/xmlrpc-common/3.0/xmlrpc-common-3.0.jar
Downloaded: http://repo1.maven.org/maven2/commons-logging/commons-logging/1.1.1/commons-logging-1.1.1.jar
(60 KB at 23.8 KB/sec)
Downloading: http://repo1.maven.org/maven2/org/apache/ws/commons/ws-commons-util/1.0.1/ws-commons-util-1.0.1.jar
Downloaded: http://repo1.maven.org/maven2/org/codehaus/plexus/plexus-utils/2.0.2/plexus-utils-2.0.2.jar
(218 KB at 87.1 KB/sec)
Downloaded: http://repo1.maven.org/maven2/org/codehaus/swizzle/swizzle-confluence/1.4/swizzle-confluence-1.4.jar
(29 KB at 11.4 KB/sec)
Downloaded: http://repo1.maven.org/maven2/xmlrpc/xmlrpc-client/3.0/xmlrpc-client-3.0.jar (43
KB at 21.2 KB/sec)
Downloaded: http://repo1.maven.org/maven2/org/apache/xmlrpc/xmlrpc-common/3.0/xmlrpc-common-3.0.jar
(96 KB at 48.1 KB/sec)
Downloaded: http://repo1.maven.org/maven2/org/apache/ws/commons/ws-commons-util/1.0.1/ws-commons-util-1.0.1.jar
(35 KB at 17.0 KB/sec)
Processing Configuration for child elements
Processing child [project]
Processing child [scalateWorkDir]
Processing child [webappDirectory]
Processing child [targetDirectory]
Processing child [testClassPathElements]
[INFO] Generating static website from Scalate Templates and wiki files...
[INFO] template properties: null
Using dir: <https://builds.apache.org/job/ActiveMQ-Apollo-Deploy/ws/trunk/apollo-website/src/blog>
at request path: /blog
[INFO]     processing <https://builds.apache.org/job/ActiveMQ-Apollo-Deploy/ws/trunk/apollo-website/src/blog/index.page>
with uri: /blog/index.page => 
Using dir: <https://builds.apache.org/job/ActiveMQ-Apollo-Deploy/ws/trunk/apollo-website/src/blog>
at request path: /blog
[INFO]     processing <https://builds.apache.org/job/ActiveMQ-Apollo-Deploy/ws/trunk/apollo-website/src/blog/index.rss.feed>
with uri: /blog/index.rss.feed => 
[INFO]     processing <https://builds.apache.org/job/ActiveMQ-Apollo-Deploy/ws/trunk/apollo-website/src/blog/releases/release-1-0-beta1.page>
with uri: /blog/releases/release-1-0-beta1.page => 
[INFO]     processing <https://builds.apache.org/job/ActiveMQ-Apollo-Deploy/ws/trunk/apollo-website/src/blog/releases/release-1-0-beta2.page>
with uri: /blog/releases/release-1-0-beta2.page => 
[INFO]     processing <https://builds.apache.org/job/ActiveMQ-Apollo-Deploy/ws/trunk/apollo-website/src/blog/releases/release-1-0-beta3.page>
with uri: /blog/releases/release-1-0-beta3.page => 
[INFO]     processing <https://builds.apache.org/job/ActiveMQ-Apollo-Deploy/ws/trunk/apollo-website/src/blog/releases/release-1-0-beta4.page>
with uri: /blog/releases/release-1-0-beta4.page => 
[INFO]     processing <https://builds.apache.org/job/ActiveMQ-Apollo-Deploy/ws/trunk/apollo-website/src/community/building.page>
with uri: /community/building.page => 
[INFO]     processing <https://builds.apache.org/job/ActiveMQ-Apollo-Deploy/ws/trunk/apollo-website/src/community/contributing.page>
with uri: /community/contributing.page => 
[INFO]     processing <https://builds.apache.org/job/ActiveMQ-Apollo-Deploy/ws/trunk/apollo-website/src/community/developers.page>
with uri: /community/developers.page => 
[INFO]     processing <https://builds.apache.org/job/ActiveMQ-Apollo-Deploy/ws/trunk/apollo-website/src/community/faq.page>
with uri: /community/faq.page => 
[INFO]     processing <https://builds.apache.org/job/ActiveMQ-Apollo-Deploy/ws/trunk/apollo-website/src/community/index.page>
with uri: /community/index.page => 
[INFO]     processing <https://builds.apache.org/job/ActiveMQ-Apollo-Deploy/ws/trunk/apollo-website/src/community/release-guide.page>
with uri: /community/release-guide.page => 
[INFO]     processing <https://builds.apache.org/job/ActiveMQ-Apollo-Deploy/ws/trunk/apollo-website/src/community/site.page>
with uri: /community/site.page => 
[INFO]     processing <https://builds.apache.org/job/ActiveMQ-Apollo-Deploy/ws/trunk/apollo-website/src/community/source.page>
with uri: /community/source.page => 
[INFO]     processing <https://builds.apache.org/job/ActiveMQ-Apollo-Deploy/ws/trunk/apollo-website/src/community/support.page>
with uri: /community/support.page => 
[INFO]     processing <https://builds.apache.org/job/ActiveMQ-Apollo-Deploy/ws/trunk/apollo-website/src/documentation/architecture.md>
with uri: /documentation/architecture.md => 
[INFO]     processing <https://builds.apache.org/job/ActiveMQ-Apollo-Deploy/ws/trunk/apollo-website/src/documentation/getting-started.md>
with uri: /documentation/getting-started.md => 
[INFO]     processing <https://builds.apache.org/job/ActiveMQ-Apollo-Deploy/ws/trunk/apollo-website/src/documentation/index.page>
with uri: /documentation/index.page => 
[INFO]     processing <https://builds.apache.org/job/ActiveMQ-Apollo-Deploy/ws/trunk/apollo-website/src/documentation/management-api.md>
with uri: /documentation/management-api.md => 
[INFO]     processing <https://builds.apache.org/job/ActiveMQ-Apollo-Deploy/ws/trunk/apollo-website/src/documentation/module-organization.page>
with uri: /documentation/module-organization.page => 
[INFO]     processing <https://builds.apache.org/job/ActiveMQ-Apollo-Deploy/ws/trunk/apollo-website/src/documentation/performance-scaling.md>
with uri: /documentation/performance-scaling.md => 
[INFO]     processing <https://builds.apache.org/job/ActiveMQ-Apollo-Deploy/ws/trunk/apollo-website/src/documentation/user-manual.md>
with uri: /documentation/user-manual.md => 
[INFO]     processing <https://builds.apache.org/job/ActiveMQ-Apollo-Deploy/ws/trunk/apollo-website/src/documentation/verification.md>
with uri: /documentation/verification.md => 
[INFO]     processing <https://builds.apache.org/job/ActiveMQ-Apollo-Deploy/ws/trunk/apollo-website/src/download.page>
with uri: /download.page => 
[INFO]     processing <https://builds.apache.org/job/ActiveMQ-Apollo-Deploy/ws/trunk/apollo-website/src/index.page>
with uri: /index.page => 
[INFO]     processing <https://builds.apache.org/job/ActiveMQ-Apollo-Deploy/ws/trunk/apollo-website/src/privacy-policy.page>
with uri: /privacy-policy.page => 
[INFO]     processing <https://builds.apache.org/job/ActiveMQ-Apollo-Deploy/ws/trunk/apollo-website/src/versions/index.page>
with uri: /versions/index.page => 
[INFO] 
[INFO] Installing <https://builds.apache.org/job/ActiveMQ-Apollo-Deploy/ws/trunk/apollo-website/pom.xml>
to <https://builds.apache.org/job/ActiveMQ-Apollo-Deploy/ws/.repository/org/apache/activemq/apollo-website/1.0-SNAPSHOT/apollo-website-1.0-SNAPSHOT.pom>
[INFO] --- maven-install-plugin:2.3.1:install (default-install) @ apollo-website ---
[INFO] 
[INFO] Downloading: https://repository.apache.org/content/repositories/snapshots/org/apache/activemq/apollo-website/1.0-SNAPSHOT/maven-metadata.xml
--- maven-deploy-plugin:2.5:deploy (default-deploy) @ apollo-website ---
Downloaded: https://repository.apache.org/content/repositories/snapshots/org/apache/activemq/apollo-website/1.0-SNAPSHOT/maven-metadata.xml
(610 B at 0.6 KB/sec)
Uploading: https://repository.apache.org/content/repositories/snapshots/org/apache/activemq/apollo-website/1.0-SNAPSHOT/apollo-website-1.0-20110718.031507-183.pom
Uploaded: https://repository.apache.org/content/repositories/snapshots/org/apache/activemq/apollo-website/1.0-SNAPSHOT/apollo-website-1.0-20110718.031507-183.pom
(13 KB at 51.0 KB/sec)
Downloading: https://repository.apache.org/content/repositories/snapshots/org/apache/activemq/apollo-website/maven-metadata.xml
Downloaded: https://repository.apache.org/content/repositories/snapshots/org/apache/activemq/apollo-website/maven-metadata.xml
(291 B at 2.1 KB/sec)
Uploading: https://repository.apache.org/content/repositories/snapshots/org/apache/activemq/apollo-website/1.0-SNAPSHOT/maven-metadata.xml
Uploaded: https://repository.apache.org/content/repositories/snapshots/org/apache/activemq/apollo-website/1.0-SNAPSHOT/maven-metadata.xml
(610 B at 9.6 KB/sec)
Uploading: https://repository.apache.org/content/repositories/snapshots/org/apache/activemq/apollo-website/maven-metadata.xml
Uploaded: https://repository.apache.org/content/repositories/snapshots/org/apache/activemq/apollo-website/maven-metadata.xml
(291 B at 4.1 KB/sec)
projectSucceeded org.apache.activemq:apollo-website:1.0-SNAPSHOT
[JENKINS] Archiving disabled - not archiving <https://builds.apache.org/job/ActiveMQ-Apollo-Deploy/ws/trunk/apollo-website/pom.xml>
projectSkipped org.apache.activemq:apache-apollo:1.0-SNAPSHOT
[INFO]                                                                         
[INFO] ------------------------------------------------------------------------
[INFO] Skipping apache-apollo
[INFO] This project has been banned from the build due to previous failures.
[INFO] ------------------------------------------------------------------------
[INFO] Downloading: http://repo.fusesource.com/nexus/content/groups/public/org/codehaus/mojo/build-helper-maven-plugin/1.2/build-helper-maven-plugin-1.2.pom
                                                                        
[INFO] ------------------------------------------------------------------------
[INFO] Building apollo-karaf-feature 1.0-SNAPSHOT
[INFO] ------------------------------------------------------------------------
Downloading: http://scala-tools.org/repo-releases/org/codehaus/mojo/build-helper-maven-plugin/1.2/build-helper-maven-plugin-1.2.pom
Downloading: http://download.java.net/maven/2/org/codehaus/mojo/build-helper-maven-plugin/1.2/build-helper-maven-plugin-1.2.pom
Downloading: http://repo1.maven.org/maven2/org/codehaus/mojo/build-helper-maven-plugin/1.2/build-helper-maven-plugin-1.2.pom
Downloaded: http://repo1.maven.org/maven2/org/codehaus/mojo/build-helper-maven-plugin/1.2/build-helper-maven-plugin-1.2.pom
(3 KB at 6.1 KB/sec)
Downloading: http://repo.fusesource.com/nexus/content/groups/public/org/codehaus/mojo/build-helper-maven-plugin/1.2/build-helper-maven-plugin-1.2.jar
Downloading: http://scala-tools.org/repo-releases/org/codehaus/mojo/build-helper-maven-plugin/1.2/build-helper-maven-plugin-1.2.jar
Downloading: http://download.java.net/maven/2/org/codehaus/mojo/build-helper-maven-plugin/1.2/build-helper-maven-plugin-1.2.jar
Downloading: http://repo1.maven.org/maven2/org/codehaus/mojo/build-helper-maven-plugin/1.2/build-helper-maven-plugin-1.2.jar
Downloaded: http://repo1.maven.org/maven2/org/codehaus/mojo/build-helper-maven-plugin/1.2/build-helper-maven-plugin-1.2.jar
(11 KB at 30.1 KB/sec)
[INFO] 
[INFO] --- maven-clean-plugin:2.4.1:clean (default-clean) @ apollo-karaf-feature ---
[INFO] 
[INFO] --- maven-enforcer-plugin:1.0:enforce (default) @ apollo-karaf-feature ---
[INFO] 
[INFO] --- maven-remote-resources-plugin:1.1:process (default) @ apollo-karaf-feature ---
[INFO] [INFO] Using 'UTF-8' encoding to copy filtered resources.
[INFO] Copying 1 resource

[INFO] --- maven-resources-plugin:2.4.3:resources (filter) @ apollo-karaf-feature ---
[INFO] Copying 3 resources
[INFO] 
Downloading: http://repo.fusesource.com/nexus/content/groups/public/org/apache/maven/maven-project/2.0.2/maven-project-2.0.2.pom
[INFO] --- build-helper-maven-plugin:1.2:attach-artifact (attach-artifacts) @ apollo-karaf-feature
---
Downloaded: http://repo.fusesource.com/nexus/content/groups/public/org/apache/maven/maven-project/2.0.2/maven-project-2.0.2.pom
(2 KB at 1.2 KB/sec)
Downloading: http://repo.fusesource.com/nexus/content/groups/public/org/apache/maven/maven/2.0.2/maven-2.0.2.pom
Downloaded: http://repo.fusesource.com/nexus/content/groups/public/org/apache/maven/maven/2.0.2/maven-2.0.2.pom
(13 KB at 10.9 KB/sec)
Downloading: http://repo.fusesource.com/nexus/content/groups/public/org/apache/maven/maven-profile/2.0.2/maven-profile-2.0.2.pom
Downloaded: http://repo.fusesource.com/nexus/content/groups/public/org/apache/maven/maven-profile/2.0.2/maven-profile-2.0.2.pom
(2 KB at 1.1 KB/sec)
Downloading: http://repo.fusesource.com/nexus/content/groups/public/org/apache/maven/maven-model/2.0.2/maven-model-2.0.2.pom
Downloaded: http://repo.fusesource.com/nexus/content/groups/public/org/apache/maven/maven-model/2.0.2/maven-model-2.0.2.pom
(3 KB at 2.0 KB/sec)
Downloading: http://repo.fusesource.com/nexus/content/groups/public/org/apache/maven/maven-artifact-manager/2.0.2/maven-artifact-manager-2.0.2.pom
Downloaded: http://repo.fusesource.com/nexus/content/groups/public/org/apache/maven/maven-artifact-manager/2.0.2/maven-artifact-manager-2.0.2.pom
(2 KB at 1.5 KB/sec)
Downloading: http://repo.fusesource.com/nexus/content/groups/public/org/apache/maven/maven-repository-metadata/2.0.2/maven-repository-metadata-2.0.2.pom
Downloaded: http://repo.fusesource.com/nexus/content/groups/public/org/apache/maven/maven-repository-metadata/2.0.2/maven-repository-metadata-2.0.2.pom
(2 KB at 1.1 KB/sec)
Downloading: http://repo.fusesource.com/nexus/content/groups/public/org/apache/maven/maven-artifact/2.0.2/maven-artifact-2.0.2.pom
Downloaded: http://repo.fusesource.com/nexus/content/groups/public/org/apache/maven/maven-artifact/2.0.2/maven-artifact-2.0.2.pom
(765 B at 0.6 KB/sec)
[INFO] [INFO] Installing <https://builds.apache.org/job/ActiveMQ-Apollo-Deploy/ws/trunk/apollo-karaf-feature/pom.xml>
to <https://builds.apache.org/job/ActiveMQ-Apollo-Deploy/ws/.repository/org/apache/activemq/apollo-karaf-feature/1.0-SNAPSHOT/apollo-karaf-feature-1.0-SNAPSHOT.pom>

[INFO] --- maven-install-plugin:2.3.1:install (default-install) @ apollo-karaf-feature ---[INFO]
Installing <https://builds.apache.org/job/ActiveMQ-Apollo-Deploy/ws/trunk/apollo-karaf-feature/target/classes/features.xml>
to <https://builds.apache.org/job/ActiveMQ-Apollo-Deploy/ws/.repository/org/apache/activemq/apollo-karaf-feature/1.0-SNAPSHOT/apollo-karaf-feature-1.0-SNAPSHOT-features.xml>

[INFO] Downloading: https://repository.apache.org/content/repositories/snapshots/org/apache/activemq/apollo-karaf-feature/1.0-SNAPSHOT/maven-metadata.xml

[INFO] --- maven-deploy-plugin:2.5:deploy (default-deploy) @ apollo-karaf-feature ---
Downloaded: https://repository.apache.org/content/repositories/snapshots/org/apache/activemq/apollo-karaf-feature/1.0-SNAPSHOT/maven-metadata.xml
(828 B at 1.4 KB/sec)
Uploading: https://repository.apache.org/content/repositories/snapshots/org/apache/activemq/apollo-karaf-feature/1.0-SNAPSHOT/apollo-karaf-feature-1.0-20110718.031519-62.pom
Uploaded: https://repository.apache.org/content/repositories/snapshots/org/apache/activemq/apollo-karaf-feature/1.0-SNAPSHOT/apollo-karaf-feature-1.0-20110718.031519-62.pom
(3 KB at 39.5 KB/sec)
Downloading: https://repository.apache.org/content/repositories/snapshots/org/apache/activemq/apollo-karaf-feature/maven-metadata.xml
Downloaded: https://repository.apache.org/content/repositories/snapshots/org/apache/activemq/apollo-karaf-feature/maven-metadata.xml
(297 B at 4.1 KB/sec)
Uploading: https://repository.apache.org/content/repositories/snapshots/org/apache/activemq/apollo-karaf-feature/1.0-SNAPSHOT/maven-metadata.xml
Uploaded: https://repository.apache.org/content/repositories/snapshots/org/apache/activemq/apollo-karaf-feature/1.0-SNAPSHOT/maven-metadata.xml
(828 B at 13.0 KB/sec)
Uploading: https://repository.apache.org/content/repositories/snapshots/org/apache/activemq/apollo-karaf-feature/maven-metadata.xml
Uploaded: https://repository.apache.org/content/repositories/snapshots/org/apache/activemq/apollo-karaf-feature/maven-metadata.xml
(297 B at 4.1 KB/sec)
Uploading: https://repository.apache.org/content/repositories/snapshots/org/apache/activemq/apollo-karaf-feature/1.0-SNAPSHOT/apollo-karaf-feature-1.0-20110718.031519-62-features.xml
Uploaded: https://repository.apache.org/content/repositories/snapshots/org/apache/activemq/apollo-karaf-feature/1.0-SNAPSHOT/apollo-karaf-feature-1.0-20110718.031519-62-features.xml
(4 KB at 71.2 KB/sec)
Uploading: https://repository.apache.org/content/repositories/snapshots/org/apache/activemq/apollo-karaf-feature/1.0-SNAPSHOT/maven-metadata.xml
Uploaded: https://repository.apache.org/content/repositories/snapshots/org/apache/activemq/apollo-karaf-feature/1.0-SNAPSHOT/maven-metadata.xml
(828 B at 13.3 KB/sec)
projectSucceeded org.apache.activemq:apollo-karaf-feature:1.0-SNAPSHOT
[JENKINS] Archiving disabled - not archiving <https://builds.apache.org/job/ActiveMQ-Apollo-Deploy/ws/trunk/apollo-karaf-feature/pom.xml>
[JENKINS] Archiving disabled - not archiving <https://builds.apache.org/job/ActiveMQ-Apollo-Deploy/ws/trunk/apollo-karaf-feature/target/classes/features.xml>
sessionEnded
[INFO] ------------------------------------------------------------------------
[INFO] Reactor Summary:
[INFO] 
[INFO] Apache ActiveMQ Apollo Project .................... SUCCESS [3:03.389s]
[INFO] apollo-boot ....................................... SUCCESS [51.809s]
[INFO] apollo-scala ...................................... SUCCESS [1:35.339s]
[INFO] apollo-util ....................................... SUCCESS [1:17.754s]
[INFO] apollo-transport .................................. SUCCESS [2.558s]
[INFO] apollo-dto ........................................ SUCCESS [39.939s]
[INFO] apollo-selector ................................... SUCCESS [1:03.383s]
[INFO] apollo-broker ..................................... FAILURE [47.309s]
[INFO] apollo-tcp ........................................ SUCCESS [3.129s]
[INFO] apollo-web ........................................ SKIPPED
[INFO] apollo-bdb ........................................ SKIPPED
[INFO] apollo-jdbm2 ...................................... SKIPPED
[INFO] apollo-stomp ...................................... SKIPPED
[INFO] apollo-cli ........................................ SKIPPED
[INFO] apollo-website .................................... SUCCESS [2:52.982s]
[INFO] apache-apollo ..................................... SKIPPED
[INFO] apollo-karaf-feature .............................. SUCCESS [12.233s]
[INFO] ------------------------------------------------------------------------
[INFO] BUILD FAILURE
[INFO] ------------------------------------------------------------------------
[INFO] Total time: 14:01.986s
[INFO] Finished at: Sun Jul 17 20:15:20 PDT 2011
[WARNING] The requested profile "deploy" could not be activated because it does not exist.
[INFO] Final Memory: 77M/1132M
[INFO] ------------------------------------------------------------------------
maven builder waiting
mavenExecutionResult exceptions not empty
message : Failed to execute goal org.scala-tools:maven-scala-plugin:2.15.2:compile (default)
on project apollo-broker: wrap: org.apache.commons.exec.ExecuteException: Process exited with
an error: 1(Exit value: 1)
cause : wrap: org.apache.commons.exec.ExecuteException: Process exited with an error: 1(Exit
value: 1)
Stack trace : 
org.apache.maven.lifecycle.LifecycleExecutionException: Failed to execute goal org.scala-tools:maven-scala-plugin:2.15.2:compile
(default) on project apollo-broker: wrap: org.apache.commons.exec.ExecuteException: Process
exited with an error: 1(Exit value: 1)
	at org.apache.maven.lifecycle.internal.MojoExecutor.execute(MojoExecutor.java:217)
	at org.apache.maven.lifecycle.internal.MojoExecutor.execute(MojoExecutor.java:153)
	at org.apache.maven.lifecycle.internal.MojoExecutor.execute(MojoExecutor.java:145)
	at org.apache.maven.lifecycle.internal.LifecycleModuleBuilder.buildProject(LifecycleModuleBuilder.java:84)
	at org.apache.maven.lifecycle.internal.LifecycleModuleBuilder.buildProject(LifecycleModuleBuilder.java:59)
	at org.apache.maven.lifecycle.internal.LifecycleStarter.singleThreadedBuild(LifecycleStarter.java:183)
	at org.apache.maven.lifecycle.internal.LifecycleStarter.execute(LifecycleStarter.java:161)
	at org.apache.maven.DefaultMaven.doExecute(DefaultMaven.java:319)
	at org.apache.maven.DefaultMaven.execute(DefaultMaven.java:156)
	at org.jvnet.hudson.maven3.launcher.Maven3Launcher.main(Maven3Launcher.java:79)
	at sun.reflect.NativeMethodAccessorImpl.invoke0(Native Method)
	at sun.reflect.NativeMethodAccessorImpl.invoke(NativeMethodAccessorImpl.java:39)
	at sun.reflect.DelegatingMethodAccessorImpl.invoke(DelegatingMethodAccessorImpl.java:25)
	at java.lang.reflect.Method.invoke(Method.java:597)
	at org.codehaus.plexus.classworlds.launcher.Launcher.launchStandard(Launcher.java:329)
	at org.codehaus.plexus.classworlds.launcher.Launcher.launch(Launcher.java:239)
	at org.jvnet.hudson.maven3.agent.Maven3Main.launch(Maven3Main.java:158)
	at hudson.maven.Maven3Builder.call(Maven3Builder.java:128)
	at hudson.maven.Maven3Builder.call(Maven3Builder.java:75)
	at hudson.remoting.UserRequest.perform(UserRequest.java:118)
	at hudson.remoting.UserRequest.perform(UserRequest.java:48)
	at hudson.remoting.Request$2.run(Request.java:270)
	at java.util.concurrent.Executors$RunnableAdapter.call(Executors.java:441)
	at java.util.concurrent.FutureTask$Sync.innerRun(FutureTask.java:303)
	at java.util.concurrent.FutureTask.run(FutureTask.java:138)
	at java.util.concurrent.ThreadPoolExecutor$Worker.runTask(ThreadPoolExecutor.java:886)
	at java.util.concurrent.ThreadPoolExecutor$Worker.run(ThreadPoolExecutor.java:908)
	at java.lang.Thread.run(Thread.java:680)
Caused by: org.apache.maven.plugin.MojoExecutionException: wrap: org.apache.commons.exec.ExecuteException:
Process exited with an error: 1(Exit value: 1)
	at org_scala_tools_maven.ScalaMojoSupport.execute(ScalaMojoSupport.java:350)
	at org.apache.maven.plugin.DefaultBuildPluginManager.executeMojo(DefaultBuildPluginManager.java:107)
	at org.apache.maven.lifecycle.internal.MojoExecutor.execute(MojoExecutor.java:209)
	... 27 more
Caused by: org.apache.commons.exec.ExecuteException: Process exited with an error: 1(Exit
value: 1)
	at org.apache.commons.exec.DefaultExecutor.executeInternal(DefaultExecutor.java:346)
	at org.apache.commons.exec.DefaultExecutor.execute(DefaultExecutor.java:149)
	at org.apache.commons.exec.DefaultExecutor.execute(DefaultExecutor.java:136)
	at org_scala_tools_maven_executions.JavaMainCallerByFork.run(JavaMainCallerByFork.java:80)
	at org_scala_tools_maven.ScalaCompilerSupport.compile(ScalaCompilerSupport.java:124)
	at org_scala_tools_maven.ScalaCompilerSupport.doExecute(ScalaCompilerSupport.java:80)
	at org_scala_tools_maven.ScalaMojoSupport.execute(ScalaMojoSupport.java:342)
	... 29 more
Sending e-mails to: commits@activemq.apache.org
channel stopped
IRC notifier plugin: Sending notification to: #activemq


Mime
View raw message