activemq-commits mailing list archives

Site index · List index
Message view « Date » · « Thread »
Top « Date » · « Thread »
From Apache Jenkins Server <jenk...@builds.apache.org>
Subject Build failed in Jenkins: ActiveMQ-Apollo » apollo-util #362
Date Wed, 29 Jun 2011 19:46:55 GMT
See <https://builds.apache.org/job/ActiveMQ-Apollo/org.apache.activemq$apollo-util/362/changes>

Changes:

[chirino] Fixes https://issues.apache.org/jira/browse/APLO-55 : Added an option to enable
strict validation against the XSD schema.

------------------------------------------
[JENKINS] Archiving disabled - not archiving /Users/hudson/hudson-slave/workspace/ActiveMQ-Apollo/trunk/apollo-scala/pom.xml
[INFO]                                                                         
[INFO] ------------------------------------------------------------------------
[INFO] Building apollo-util 1.0-SNAPSHOT
[INFO] ------------------------------------------------------------------------
[INFO] 
[INFO] --- maven-clean-plugin:2.4.1:clean (default-clean) @ apollo-util ---
[INFO] 
[INFO] --- maven-enforcer-plugin:1.0:enforce (default) @ apollo-util ---
[INFO] 
[INFO] --- maven-remote-resources-plugin:1.1:process (default) @ apollo-util ---
[INFO] [INFO] Using 'UTF-8' encoding to copy filtered resources.
[INFO] skip non existing resourceDirectory <https://builds.apache.org/job/ActiveMQ-Apollo/org.apache.activemq$apollo-util/ws/target/schema>

[INFO] --- maven-resources-plugin:2.4.3:resources (default-resources) @ apollo-util ---
[INFO] Copying 0 resource
[INFO] Copying 3 resources
[INFO] 
[INFO] --- maven-compiler-plugin:2.3.2:compile (default-compile) @ apollo-util ---
[INFO] Compiling 56 source files to <https://builds.apache.org/job/ActiveMQ-Apollo/org.apache.activemq$apollo-util/ws/target/classes>
[INFO] 
[INFO] --- maven-scala-plugin:2.15.2:compile (default) @ apollo-util ---[INFO] Checking for
multiple versions of scala

[INFO] includes = [**/*.scala,**/*.java,]
[INFO] excludes = []
[INFO] <https://builds.apache.org/job/ActiveMQ-Apollo/org.apache.activemq$apollo-util/ws/src/main/scala>:-1:
info: compiling
[INFO] Compiling 84 source files to <https://builds.apache.org/job/ActiveMQ-Apollo/org.apache.activemq$apollo-util/ws/target/classes>
at 1309376774934
[INFO] compiler plugin: BasicArtifact(org.scala-lang.plugins,continuations,2.9.0-1)
[INFO] compiler plugin: BasicArtifact(org.fusesource.jvmassert,jvmassert,1.2)
[ERROR] <https://builds.apache.org/job/ActiveMQ-Apollo/org.apache.activemq$apollo-util/ws/src/main/scala/org/apache/activemq/apollo/util/BaseService.scala>:111:
error: recursive value start_task needs type
[INFO]           pending_actions += start_task
[INFO]                              ^
[ERROR] <https://builds.apache.org/job/ActiveMQ-Apollo/org.apache.activemq$apollo-util/ws/src/main/scala/org/apache/activemq/apollo/util/BaseService.scala>:154:
error: recursive value stop_task needs type
[INFO]           pending_actions += stop_task
[INFO]                              ^
[ERROR] two errors found
mojoFailed org.scala-tools:maven-scala-plugin:2.15.2(default)
projectFailed org.apache.activemq:apollo-util:1.0-SNAPSHOT


Mime
View raw message