activemq-commits mailing list archives

Site index · List index
Message view « Date » · « Thread »
Top « Date » · « Thread »
From Apache Jenkins Server <jenk...@builds.apache.org>
Subject Build failed in Jenkins: ActiveMQ-Apollo #362
Date Wed, 29 Jun 2011 19:46:56 GMT
See <https://builds.apache.org/job/ActiveMQ-Apollo/362/changes>

Changes:

[chirino] Fixes https://issues.apache.org/jira/browse/APLO-55 : Added an option to enable
strict validation against the XSD schema.

------------------------------------------
[...truncated 2500 lines...]
    <https://builds.apache.org/job/ActiveMQ-Apollo/ws/trunk/apollo-dto/src/main/java/org/apache/activemq/apollo/dto/AddUserHeaderDTO.java>
    <https://builds.apache.org/job/ActiveMQ-Apollo/ws/trunk/apollo-dto/src/main/java/org/apache/activemq/apollo/dto/AggregateQueueMetricsDTO.java>
    <https://builds.apache.org/job/ActiveMQ-Apollo/ws/trunk/apollo-dto/src/main/java/org/apache/activemq/apollo/dto/AuthenticationDTO.java>
    <https://builds.apache.org/job/ActiveMQ-Apollo/ws/trunk/apollo-dto/src/main/java/org/apache/activemq/apollo/dto/BrokerAclDTO.java>
    <https://builds.apache.org/job/ActiveMQ-Apollo/ws/trunk/apollo-dto/src/main/java/org/apache/activemq/apollo/dto/BrokerDTO.java>
    <https://builds.apache.org/job/ActiveMQ-Apollo/ws/trunk/apollo-dto/src/main/java/org/apache/activemq/apollo/dto/BrokerStatusDTO.java>
    <https://builds.apache.org/job/ActiveMQ-Apollo/ws/trunk/apollo-dto/src/main/java/org/apache/activemq/apollo/dto/ConnectionStatusDTO.java>
    <https://builds.apache.org/job/ActiveMQ-Apollo/ws/trunk/apollo-dto/src/main/java/org/apache/activemq/apollo/dto/ConnectorAclDTO.java>
    <https://builds.apache.org/job/ActiveMQ-Apollo/ws/trunk/apollo-dto/src/main/java/org/apache/activemq/apollo/dto/ConnectorDTO.java>
    <https://builds.apache.org/job/ActiveMQ-Apollo/ws/trunk/apollo-dto/src/main/java/org/apache/activemq/apollo/dto/ConnectorStatusDTO.java>
    <https://builds.apache.org/job/ActiveMQ-Apollo/ws/trunk/apollo-dto/src/main/java/org/apache/activemq/apollo/dto/DataPageDTO.java>
    <https://builds.apache.org/job/ActiveMQ-Apollo/ws/trunk/apollo-dto/src/main/java/org/apache/activemq/apollo/dto/DestinationDTO.java>
    <https://builds.apache.org/job/ActiveMQ-Apollo/ws/trunk/apollo-dto/src/main/java/org/apache/activemq/apollo/dto/DurableSubscriptionDTO.java>
    <https://builds.apache.org/job/ActiveMQ-Apollo/ws/trunk/apollo-dto/src/main/java/org/apache/activemq/apollo/dto/DurableSubscriptionDestinationDTO.java>
    <https://builds.apache.org/job/ActiveMQ-Apollo/ws/trunk/apollo-dto/src/main/java/org/apache/activemq/apollo/dto/EntryStatusDTO.java>
    <https://builds.apache.org/job/ActiveMQ-Apollo/ws/trunk/apollo-dto/src/main/java/org/apache/activemq/apollo/dto/IntMetricDTO.java>
    <https://builds.apache.org/job/ActiveMQ-Apollo/ws/trunk/apollo-dto/src/main/java/org/apache/activemq/apollo/dto/JvmMetricsDTO.java>
    <https://builds.apache.org/job/ActiveMQ-Apollo/ws/trunk/apollo-dto/src/main/java/org/apache/activemq/apollo/dto/KeyStorageDTO.java>
    <https://builds.apache.org/job/ActiveMQ-Apollo/ws/trunk/apollo-dto/src/main/java/org/apache/activemq/apollo/dto/LinkDTO.java>
    <https://builds.apache.org/job/ActiveMQ-Apollo/ws/trunk/apollo-dto/src/main/java/org/apache/activemq/apollo/dto/LogCategoryDTO.java>
    <https://builds.apache.org/job/ActiveMQ-Apollo/ws/trunk/apollo-dto/src/main/java/org/apache/activemq/apollo/dto/LongIdDTO.java>
    <https://builds.apache.org/job/ActiveMQ-Apollo/ws/trunk/apollo-dto/src/main/java/org/apache/activemq/apollo/dto/LongIdLabeledDTO.java>
    <https://builds.apache.org/job/ActiveMQ-Apollo/ws/trunk/apollo-dto/src/main/java/org/apache/activemq/apollo/dto/LongIdListDTO.java>
    <https://builds.apache.org/job/ActiveMQ-Apollo/ws/trunk/apollo-dto/src/main/java/org/apache/activemq/apollo/dto/MemoryMetricsDTO.java>
    <https://builds.apache.org/job/ActiveMQ-Apollo/ws/trunk/apollo-dto/src/main/java/org/apache/activemq/apollo/dto/NullStoreDTO.java>
    <https://builds.apache.org/job/ActiveMQ-Apollo/ws/trunk/apollo-dto/src/main/java/org/apache/activemq/apollo/dto/PrincipalDTO.java>
    <https://builds.apache.org/job/ActiveMQ-Apollo/ws/trunk/apollo-dto/src/main/java/org/apache/activemq/apollo/dto/ProtocolDTO.java>
    <https://builds.apache.org/job/ActiveMQ-Apollo/ws/trunk/apollo-dto/src/main/java/org/apache/activemq/apollo/dto/QueueAclDTO.java>
    <https://builds.apache.org/job/ActiveMQ-Apollo/ws/trunk/apollo-dto/src/main/java/org/apache/activemq/apollo/dto/QueueConsumerStatusDTO.java>
    <https://builds.apache.org/job/ActiveMQ-Apollo/ws/trunk/apollo-dto/src/main/java/org/apache/activemq/apollo/dto/QueueDTO.java>
    <https://builds.apache.org/job/ActiveMQ-Apollo/ws/trunk/apollo-dto/src/main/java/org/apache/activemq/apollo/dto/QueueDestinationDTO.java>
    <https://builds.apache.org/job/ActiveMQ-Apollo/ws/trunk/apollo-dto/src/main/java/org/apache/activemq/apollo/dto/QueueMetricsDTO.java>
    <https://builds.apache.org/job/ActiveMQ-Apollo/ws/trunk/apollo-dto/src/main/java/org/apache/activemq/apollo/dto/QueueStatusDTO.java>
    <https://builds.apache.org/job/ActiveMQ-Apollo/ws/trunk/apollo-dto/src/main/java/org/apache/activemq/apollo/dto/RouterDTO.java>
    <https://builds.apache.org/job/ActiveMQ-Apollo/ws/trunk/apollo-dto/src/main/java/org/apache/activemq/apollo/dto/ServiceDTO.java>
    <https://builds.apache.org/job/ActiveMQ-Apollo/ws/trunk/apollo-dto/src/main/java/org/apache/activemq/apollo/dto/ServiceStatusDTO.java>
    <https://builds.apache.org/job/ActiveMQ-Apollo/ws/trunk/apollo-dto/src/main/java/org/apache/activemq/apollo/dto/SimpleStoreStatusDTO.java>
    <https://builds.apache.org/job/ActiveMQ-Apollo/ws/trunk/apollo-dto/src/main/java/org/apache/activemq/apollo/dto/StoreDTO.java>
    <https://builds.apache.org/job/ActiveMQ-Apollo/ws/trunk/apollo-dto/src/main/java/org/apache/activemq/apollo/dto/StoreStatusDTO.java>
    <https://builds.apache.org/job/ActiveMQ-Apollo/ws/trunk/apollo-dto/src/main/java/org/apache/activemq/apollo/dto/StringIdDTO.java>
    <https://builds.apache.org/job/ActiveMQ-Apollo/ws/trunk/apollo-dto/src/main/java/org/apache/activemq/apollo/dto/StringIdLabeledDTO.java>
    <https://builds.apache.org/job/ActiveMQ-Apollo/ws/trunk/apollo-dto/src/main/java/org/apache/activemq/apollo/dto/StringIdListDTO.java>
    <https://builds.apache.org/job/ActiveMQ-Apollo/ws/trunk/apollo-dto/src/main/java/org/apache/activemq/apollo/dto/StringListDTO.java>
    <https://builds.apache.org/job/ActiveMQ-Apollo/ws/trunk/apollo-dto/src/main/java/org/apache/activemq/apollo/dto/TimeMetricDTO.java>
    <https://builds.apache.org/job/ActiveMQ-Apollo/ws/trunk/apollo-dto/src/main/java/org/apache/activemq/apollo/dto/TopicAclDTO.java>
    <https://builds.apache.org/job/ActiveMQ-Apollo/ws/trunk/apollo-dto/src/main/java/org/apache/activemq/apollo/dto/TopicDTO.java>
    <https://builds.apache.org/job/ActiveMQ-Apollo/ws/trunk/apollo-dto/src/main/java/org/apache/activemq/apollo/dto/TopicDestinationDTO.java>
    <https://builds.apache.org/job/ActiveMQ-Apollo/ws/trunk/apollo-dto/src/main/java/org/apache/activemq/apollo/dto/TopicStatusDTO.java>
    <https://builds.apache.org/job/ActiveMQ-Apollo/ws/trunk/apollo-dto/src/main/java/org/apache/activemq/apollo/dto/ValueDTO.java>
    <https://builds.apache.org/job/ActiveMQ-Apollo/ws/trunk/apollo-dto/src/main/java/org/apache/activemq/apollo/dto/VirtualHostAclDTO.java>
    <https://builds.apache.org/job/ActiveMQ-Apollo/ws/trunk/apollo-dto/src/main/java/org/apache/activemq/apollo/dto/VirtualHostDTO.java>
    <https://builds.apache.org/job/ActiveMQ-Apollo/ws/trunk/apollo-dto/src/main/java/org/apache/activemq/apollo/dto/VirtualHostStatusDTO.java>
    <https://builds.apache.org/job/ActiveMQ-Apollo/ws/trunk/apollo-dto/src/main/java/org/apache/activemq/apollo/dto/WebAdminDTO.java>
    <https://builds.apache.org/job/ActiveMQ-Apollo/ws/trunk/apollo-dto/src/main/java/org/apache/activemq/apollo/dto/package-info.java>
    <https://builds.apache.org/job/ActiveMQ-Apollo/ws/trunk/apollo-jdbm2/src/main/scala/org/apache/activemq/apollo/broker/store/jdbm2/dto/JDBM2StoreDTO.java>
    <https://builds.apache.org/job/ActiveMQ-Apollo/ws/trunk/apollo-jdbm2/src/main/scala/org/apache/activemq/apollo/broker/store/jdbm2/dto/JDBM2StoreStatusDTO.java>
    <https://builds.apache.org/job/ActiveMQ-Apollo/ws/trunk/apollo-jdbm2/src/main/scala/org/apache/activemq/apollo/broker/store/jdbm2/dto/package-info.java>
    <https://builds.apache.org/job/ActiveMQ-Apollo/ws/trunk/apollo-stomp/src/main/scala/org/apache/activemq/apollo/stomp/dto/StompConnectionStatusDTO.java>
    <https://builds.apache.org/job/ActiveMQ-Apollo/ws/trunk/apollo-stomp/src/main/scala/org/apache/activemq/apollo/stomp/dto/StompDTO.java>
    <https://builds.apache.org/job/ActiveMQ-Apollo/ws/trunk/apollo-stomp/src/main/scala/org/apache/activemq/apollo/stomp/dto/package-info.java>

Note: Writing <https://builds.apache.org/job/ActiveMQ-Apollo/ws/trunk/apollo-website/target/sitegen/documentation/schema/apollo.xsd>
[INFO] 
[INFO] --- maven-remote-resources-plugin:1.1:process (default) @ apollo-website ---
[INFO] 
[INFO] [INFO] Checking for multiple versions of scala
--- maven-scala-plugin:2.15.2:compile (default) @ apollo-website ---
[INFO] includes = [**/*.scala,**/*.java,]
[INFO] excludes = []
[INFO] Nothing to compile - all classes are up to date
[INFO] [WARNING] Parameter tasks is deprecated, use target instead

[INFO] --- maven-antrun-plugin:1.6:run (default) @ apollo-website ---
[INFO] Executing tasks

main:
[INFO] Executed tasks
[INFO] 
[INFO] [INFO] Checking for multiple versions of scala
--- maven-scala-plugin:2.15.2:testCompile (default) @ apollo-website ---
[INFO] includes = [**/*.scala,**/*.java,]
[INFO] excludes = []
[WARNING] No source files found.
mojo forkStarted org.apache.maven.plugins:maven-source-plugin:2.1.2(attach-sources)
forkedProjectStarted org.apache.activemq:apollo-website1.0-SNAPSHOT
[INFO] 
[INFO] --- maven-enforcer-plugin:1.0:enforce (default) @ apollo-website ---
forkedProjectSucceeded org.apache.activemq:apollo-website1.0-SNAPSHOT
[JENKINS] Archiving disabled - not archiving <https://builds.apache.org/job/ActiveMQ-Apollo/ws/trunk/apollo-website/pom.xml>
mojo forkSucceeded org.apache.maven.plugins:maven-source-plugin:2.1.2(attach-sources)
ignoring exception during new ExecutedMojo null
[INFO] 
[INFO] --- maven-source-plugin:2.1.2:jar (attach-sources) @ apollo-website ---
forkedProjectSucceeded org.apache.activemq:apollo-website1.0-SNAPSHOT
[JENKINS] Archiving disabled - not archiving <https://builds.apache.org/job/ActiveMQ-Apollo/ws/trunk/apollo-website/pom.xml>
mojo forkSucceeded org.fusesource.scalate:maven-scalate-plugin:1.5.0(sitegen)
ignoring exception during new ExecutedMojo null
[INFO] 
[INFO] --- maven-scalate-plugin:1.5.0:sitegen (sitegen) @ apollo-website ---
Processing Configuration for child elements
Processing child [project]
Processing child [scalateWorkDir]
Processing child [webappDirectory]
Processing child [targetDirectory]
Processing child [testClassPathElements]
[INFO] Generating static website from Scalate Templates and wiki files...
[INFO] template properties: null
Using dir: <https://builds.apache.org/job/ActiveMQ-Apollo/ws/trunk/apollo-website/src/blog>
at request path: /blog
[INFO]     processing <https://builds.apache.org/job/ActiveMQ-Apollo/ws/trunk/apollo-website/src/blog/index.page>
with uri: /blog/index.page => 
Using dir: <https://builds.apache.org/job/ActiveMQ-Apollo/ws/trunk/apollo-website/src/blog>
at request path: /blog
[INFO]     processing <https://builds.apache.org/job/ActiveMQ-Apollo/ws/trunk/apollo-website/src/blog/index.rss.feed>
with uri: /blog/index.rss.feed => 
[INFO]     processing <https://builds.apache.org/job/ActiveMQ-Apollo/ws/trunk/apollo-website/src/blog/releases/release-1-0-beta1.page>
with uri: /blog/releases/release-1-0-beta1.page => 
[INFO]     processing <https://builds.apache.org/job/ActiveMQ-Apollo/ws/trunk/apollo-website/src/blog/releases/release-1-0-beta2.page>
with uri: /blog/releases/release-1-0-beta2.page => 
[INFO]     processing <https://builds.apache.org/job/ActiveMQ-Apollo/ws/trunk/apollo-website/src/blog/releases/release-1-0-beta3.page>
with uri: /blog/releases/release-1-0-beta3.page => 
[INFO]     processing <https://builds.apache.org/job/ActiveMQ-Apollo/ws/trunk/apollo-website/src/community/building.page>
with uri: /community/building.page => 
[INFO]     processing <https://builds.apache.org/job/ActiveMQ-Apollo/ws/trunk/apollo-website/src/community/contributing.page>
with uri: /community/contributing.page => 
[INFO]     processing <https://builds.apache.org/job/ActiveMQ-Apollo/ws/trunk/apollo-website/src/community/developers.page>
with uri: /community/developers.page => 
[INFO]     processing <https://builds.apache.org/job/ActiveMQ-Apollo/ws/trunk/apollo-website/src/community/faq.page>
with uri: /community/faq.page => 
[INFO]     processing <https://builds.apache.org/job/ActiveMQ-Apollo/ws/trunk/apollo-website/src/community/index.page>
with uri: /community/index.page => 
[INFO]     processing <https://builds.apache.org/job/ActiveMQ-Apollo/ws/trunk/apollo-website/src/community/release-guide.page>
with uri: /community/release-guide.page => 
[INFO]     processing <https://builds.apache.org/job/ActiveMQ-Apollo/ws/trunk/apollo-website/src/community/site.page>
with uri: /community/site.page => 
[INFO]     processing <https://builds.apache.org/job/ActiveMQ-Apollo/ws/trunk/apollo-website/src/community/source.page>
with uri: /community/source.page => 
[INFO]     processing <https://builds.apache.org/job/ActiveMQ-Apollo/ws/trunk/apollo-website/src/community/support.page>
with uri: /community/support.page => 
[INFO]     processing <https://builds.apache.org/job/ActiveMQ-Apollo/ws/trunk/apollo-website/src/documentation/architecture.md>
with uri: /documentation/architecture.md => 
[INFO]     processing <https://builds.apache.org/job/ActiveMQ-Apollo/ws/trunk/apollo-website/src/documentation/getting-started.md>
with uri: /documentation/getting-started.md => 
[INFO]     processing <https://builds.apache.org/job/ActiveMQ-Apollo/ws/trunk/apollo-website/src/documentation/index.page>
with uri: /documentation/index.page => 
[INFO]     processing <https://builds.apache.org/job/ActiveMQ-Apollo/ws/trunk/apollo-website/src/documentation/management-api.md>
with uri: /documentation/management-api.md => 
[INFO]     processing <https://builds.apache.org/job/ActiveMQ-Apollo/ws/trunk/apollo-website/src/documentation/module-organization.page>
with uri: /documentation/module-organization.page => 
[INFO]     processing <https://builds.apache.org/job/ActiveMQ-Apollo/ws/trunk/apollo-website/src/documentation/performance-scaling.md>
with uri: /documentation/performance-scaling.md => 
[INFO]     processing <https://builds.apache.org/job/ActiveMQ-Apollo/ws/trunk/apollo-website/src/documentation/user-manual.md>
with uri: /documentation/user-manual.md => 
[INFO]     processing <https://builds.apache.org/job/ActiveMQ-Apollo/ws/trunk/apollo-website/src/documentation/verification.md>
with uri: /documentation/verification.md => 
[INFO]     processing <https://builds.apache.org/job/ActiveMQ-Apollo/ws/trunk/apollo-website/src/download.page>
with uri: /download.page => 
[INFO]     processing <https://builds.apache.org/job/ActiveMQ-Apollo/ws/trunk/apollo-website/src/index.page>
with uri: /index.page => 
[INFO]     processing <https://builds.apache.org/job/ActiveMQ-Apollo/ws/trunk/apollo-website/src/privacy-policy.page>
with uri: /privacy-policy.page => 
[INFO]     processing <https://builds.apache.org/job/ActiveMQ-Apollo/ws/trunk/apollo-website/src/versions/index.page>
with uri: /versions/index.page => 
[INFO] [INFO] Installing <https://builds.apache.org/job/ActiveMQ-Apollo/ws/trunk/apollo-website/pom.xml>
to /Users/hudson/.m2/repository/org/apache/activemq/apollo-website/1.0-SNAPSHOT/apollo-website-1.0-SNAPSHOT.pom

[INFO] --- maven-install-plugin:2.3.1:install (default-install) @ apollo-website ---
projectSucceeded org.apache.activemq:apollo-website:1.0-SNAPSHOT
[JENKINS] Archiving disabled - not archiving <https://builds.apache.org/job/ActiveMQ-Apollo/ws/trunk/apollo-website/pom.xml>
projectSkipped org.apache.activemq:apache-apollo:1.0-SNAPSHOT
[INFO]                                                                         
[INFO] ------------------------------------------------------------------------
[INFO] Skipping apache-apollo
[INFO] This project has been banned from the build due to previous failures.
[INFO] ------------------------------------------------------------------------
[INFO]                                                                         
[INFO] ------------------------------------------------------------------------
[INFO] Building apollo-karaf-feature 1.0-SNAPSHOT
[INFO] ------------------------------------------------------------------------
[INFO] 
[INFO] --- maven-clean-plugin:2.4.1:clean (default-clean) @ apollo-karaf-feature ---
[INFO] 
[INFO] --- maven-enforcer-plugin:1.0:enforce (default) @ apollo-karaf-feature ---
[INFO] 
[INFO] --- maven-remote-resources-plugin:1.1:process (default) @ apollo-karaf-feature ---
[INFO] 
[INFO] Using 'UTF-8' encoding to copy filtered resources.
[INFO] Copying 1 resource
[INFO] --- maven-resources-plugin:2.4.3:resources (filter) @ apollo-karaf-feature ---
[INFO] Copying 3 resources
[INFO] 
[INFO] --- build-helper-maven-plugin:1.2:attach-artifact (attach-artifacts) @ apollo-karaf-feature
---
[INFO] [INFO] Installing <https://builds.apache.org/job/ActiveMQ-Apollo/ws/trunk/apollo-karaf-feature/pom.xml>
to /Users/hudson/.m2/repository/org/apache/activemq/apollo-karaf-feature/1.0-SNAPSHOT/apollo-karaf-feature-1.0-SNAPSHOT.pom

[INFO] [INFO] Installing <https://builds.apache.org/job/ActiveMQ-Apollo/ws/trunk/apollo-karaf-feature/target/classes/features.xml>
to /Users/hudson/.m2/repository/org/apache/activemq/apollo-karaf-feature/1.0-SNAPSHOT/apollo-karaf-feature-1.0-SNAPSHOT-features.xml
--- maven-install-plugin:2.3.1:install (default-install) @ apollo-karaf-feature ---
projectSucceeded org.apache.activemq:apollo-karaf-feature:1.0-SNAPSHOT
[JENKINS] Archiving disabled - not archiving <https://builds.apache.org/job/ActiveMQ-Apollo/ws/trunk/apollo-karaf-feature/pom.xml>
[JENKINS] Archiving disabled - not archiving <https://builds.apache.org/job/ActiveMQ-Apollo/ws/trunk/apollo-karaf-feature/target/classes/features.xml>
sessionEnded
[INFO] ------------------------------------------------------------------------
[INFO] Reactor Summary:
[INFO] 
[INFO] Apache ActiveMQ Apollo Project .................... SUCCESS [1.300s]
[INFO] apollo-boot ....................................... SUCCESS [1.783s]
[INFO] apollo-scala ...................................... SUCCESS [0.493s]
[INFO] apollo-util ....................................... FAILURE [10.896s]
[INFO] apollo-transport .................................. SKIPPED
[INFO] apollo-dto ........................................ SKIPPED
[INFO] apollo-selector ................................... SKIPPED
[INFO] apollo-broker ..................................... SKIPPED
[INFO] apollo-tcp ........................................ SKIPPED
[INFO] apollo-web ........................................ SKIPPED
[INFO] apollo-bdb ........................................ SKIPPED
[INFO] apollo-jdbm2 ...................................... SKIPPED
[INFO] apollo-stomp ...................................... SKIPPED
[INFO] apollo-cli ........................................ SKIPPED
[INFO] apollo-website .................................... SUCCESS [30.011s]
[INFO] apache-apollo ..................................... SKIPPED
[INFO] apollo-karaf-feature .............................. SUCCESS [0.136s]
[INFO] ------------------------------------------------------------------------
[INFO] BUILD FAILURE
[INFO] ------------------------------------------------------------------------
[INFO] Total time: 45.588s
[INFO] Finished at: Wed Jun 29 12:46:54 PDT 2011
[INFO] Final Memory: 67M/1132M
[INFO] ------------------------------------------------------------------------
maven builder waiting
mavenExecutionResult exceptions not empty
message : Failed to execute goal org.scala-tools:maven-scala-plugin:2.15.2:compile (default)
on project apollo-util: wrap: org.apache.commons.exec.ExecuteException: Process exited with
an error: 1(Exit value: 1)
cause : wrap: org.apache.commons.exec.ExecuteException: Process exited with an error: 1(Exit
value: 1)
Stack trace : 
org.apache.maven.lifecycle.LifecycleExecutionException: Failed to execute goal org.scala-tools:maven-scala-plugin:2.15.2:compile
(default) on project apollo-util: wrap: org.apache.commons.exec.ExecuteException: Process
exited with an error: 1(Exit value: 1)
	at org.apache.maven.lifecycle.internal.MojoExecutor.execute(MojoExecutor.java:217)
	at org.apache.maven.lifecycle.internal.MojoExecutor.execute(MojoExecutor.java:153)
	at org.apache.maven.lifecycle.internal.MojoExecutor.execute(MojoExecutor.java:145)
	at org.apache.maven.lifecycle.internal.LifecycleModuleBuilder.buildProject(LifecycleModuleBuilder.java:84)
	at org.apache.maven.lifecycle.internal.LifecycleModuleBuilder.buildProject(LifecycleModuleBuilder.java:59)
	at org.apache.maven.lifecycle.internal.LifecycleStarter.singleThreadedBuild(LifecycleStarter.java:183)
	at org.apache.maven.lifecycle.internal.LifecycleStarter.execute(LifecycleStarter.java:161)
	at org.apache.maven.DefaultMaven.doExecute(DefaultMaven.java:319)
	at org.apache.maven.DefaultMaven.execute(DefaultMaven.java:156)
	at org.jvnet.hudson.maven3.launcher.Maven3Launcher.main(Maven3Launcher.java:79)
	at sun.reflect.NativeMethodAccessorImpl.invoke0(Native Method)
	at sun.reflect.NativeMethodAccessorImpl.invoke(NativeMethodAccessorImpl.java:39)
	at sun.reflect.DelegatingMethodAccessorImpl.invoke(DelegatingMethodAccessorImpl.java:25)
	at java.lang.reflect.Method.invoke(Method.java:597)
	at org.codehaus.plexus.classworlds.launcher.Launcher.launchStandard(Launcher.java:329)
	at org.codehaus.plexus.classworlds.launcher.Launcher.launch(Launcher.java:239)
	at org.jvnet.hudson.maven3.agent.Maven3Main.launch(Maven3Main.java:158)
	at hudson.maven.Maven3Builder.call(Maven3Builder.java:128)
	at hudson.maven.Maven3Builder.call(Maven3Builder.java:75)
	at hudson.remoting.UserRequest.perform(UserRequest.java:118)
	at hudson.remoting.UserRequest.perform(UserRequest.java:48)
	at hudson.remoting.Request$2.run(Request.java:270)
	at java.util.concurrent.Executors$RunnableAdapter.call(Executors.java:441)
	at java.util.concurrent.FutureTask$Sync.innerRun(FutureTask.java:303)
	at java.util.concurrent.FutureTask.run(FutureTask.java:138)
	at java.util.concurrent.ThreadPoolExecutor$Worker.runTask(ThreadPoolExecutor.java:886)
	at java.util.concurrent.ThreadPoolExecutor$Worker.run(ThreadPoolExecutor.java:908)
	at java.lang.Thread.run(Thread.java:680)
Caused by: org.apache.maven.plugin.MojoExecutionException: wrap: org.apache.commons.exec.ExecuteException:
Process exited with an error: 1(Exit value: 1)
	at org_scala_tools_maven.ScalaMojoSupport.execute(ScalaMojoSupport.java:350)
	at org.apache.maven.plugin.DefaultBuildPluginManager.executeMojo(DefaultBuildPluginManager.java:107)
	at org.apache.maven.lifecycle.internal.MojoExecutor.execute(MojoExecutor.java:209)
	... 27 more
Caused by: org.apache.commons.exec.ExecuteException: Process exited with an error: 1(Exit
value: 1)
	at org.apache.commons.exec.DefaultExecutor.executeInternal(DefaultExecutor.java:346)
	at org.apache.commons.exec.DefaultExecutor.execute(DefaultExecutor.java:149)
	at org.apache.commons.exec.DefaultExecutor.execute(DefaultExecutor.java:136)
	at org_scala_tools_maven_executions.JavaMainCallerByFork.run(JavaMainCallerByFork.java:80)
	at org_scala_tools_maven.ScalaCompilerSupport.compile(ScalaCompilerSupport.java:124)
	at org_scala_tools_maven.ScalaCompilerSupport.doExecute(ScalaCompilerSupport.java:80)
	at org_scala_tools_maven.ScalaMojoSupport.execute(ScalaMojoSupport.java:342)
	... 29 more
Sending e-mails to: commits@activemq.apache.org
channel stopped
IRC notifier plugin: Sending notification to: #activemq


Mime
View raw message