activemq-commits mailing list archives

Site index · List index
Message view « Date » · « Thread »
Top « Date » · « Thread »
From continuum <contin...@stan.gbuild.org>
Subject [continuum] BUILD FAILURE: ActiveMQ :: Web
Date Wed, 21 Jun 2006 17:08:18 GMT
Online report : http://ci.gbuild.org/continuum/servlet/continuum/target/ProjectBuild.vm/view/ProjectBuild/id/153/buildId/5386
Build statistics:
  State: Failed
  Previous State: Ok
  Started at: Wed, 21 Jun 2006 10:07:49 -0700
  Finished at: Wed, 21 Jun 2006 10:08:17 -0700
  Total time: 28s
  Build Trigger: Schedule
  Exit code: 1
  Building machine hostname: stan.gbuild.org
  Operating system : Linux(unknown)
  Java version : 1.4.2_08(Sun Microsystems Inc.)

Changes
                            src/main/java/org/apache/activemq/web/MessageListenerServlet.java
            src/main/resources/org/apache/activemq/web/_amq.js
        
****************************************************************************
Output:
****************************************************************************
[INFO] Scanning for projects...
[INFO] ----------------------------------------------------------------------------
[INFO] Building ActiveMQ :: Web
[INFO]    task-segment: [clean, install]
[INFO] ----------------------------------------------------------------------------
[INFO] [clean:clean]
[INFO] Deleting directory /home/continuum/continuum-1.0.2/apps/continuum/work/153/target
[INFO] Deleting directory /home/continuum/continuum-1.0.2/apps/continuum/work/153/target/classes
[INFO] Deleting directory /home/continuum/continuum-1.0.2/apps/continuum/work/153/target/test-classes
[INFO] artifact org.apache.maven.plugins:maven-resources-plugin: checking for updates from
central
[INFO] artifact org.apache.maven.plugins:maven-resources-plugin: checking for updates from
mortbay-repo
[INFO] artifact org.apache.maven.plugins:maven-resources-plugin: checking for updates from
apache-snapshots
[INFO] artifact org.apache.maven.plugins:maven-jar-plugin: checking for updates from central
[INFO] artifact org.apache.maven.plugins:maven-jar-plugin: checking for updates from mortbay-repo
[INFO] artifact org.apache.maven.plugins:maven-jar-plugin: checking for updates from apache-snapshots
[INFO] snapshot org.apache.maven.plugins:maven-jar-plugin:2.1-SNAPSHOT: checking for updates
from central
[INFO] snapshot org.apache.maven.plugins:maven-jar-plugin:2.1-SNAPSHOT: checking for updates
from mortbay-repo
[INFO] snapshot org.apache.maven.plugins:maven-jar-plugin:2.1-SNAPSHOT: checking for updates
from apache-snapshots
[INFO] [resources:resources]
[INFO] Using default encoding to copy filtered resources.
[INFO] snapshot incubator-activemq:activemq-core:4.1-SNAPSHOT: checking for updates from central
[INFO] snapshot incubator-activemq:activemq-core:4.1-SNAPSHOT: checking for updates from mortbay-repo
[INFO] snapshot incubator-activemq:activemq-core:4.1-SNAPSHOT: checking for updates from apache.snapshots
Downloading: http://svn.apache.org/maven-snapshot-repository/incubator-activemq/activemq-core/4.1-SNAPSHOT/activemq-core-4.1-20060621.074924-2.pom
9K downloaded
[INFO] snapshot incubator-activemq:activeio-core:3.0-SNAPSHOT: checking for updates from central
[INFO] snapshot incubator-activemq:activeio-core:3.0-SNAPSHOT: checking for updates from mortbay-repo
[INFO] snapshot incubator-activemq:activeio-core:3.0-SNAPSHOT: checking for updates from apache.snapshots
Downloading: http://svn.apache.org/maven-snapshot-repository/incubator-activemq/activeio-core/3.0-SNAPSHOT/activeio-core-3.0-20060621.074924-4.pom
2K downloaded
[INFO] snapshot incubator-activemq:activeio:3.0-SNAPSHOT: checking for updates from central
[INFO] snapshot incubator-activemq:activeio:3.0-SNAPSHOT: checking for updates from mortbay-repo
[INFO] snapshot incubator-activemq:activeio:3.0-SNAPSHOT: checking for updates from apache.snapshots
Downloading: http://svn.apache.org/maven-snapshot-repository/incubator-activemq/activeio/3.0-SNAPSHOT/activeio-3.0-20060621.074924-6.pom
844b downloaded
[INFO] snapshot org.apache.geronimo.specs:specs:1.1-SNAPSHOT: checking for updates from central
[INFO] snapshot org.apache.geronimo.specs:specs:1.1-SNAPSHOT: checking for updates from mortbay-repo
[INFO] snapshot org.apache.geronimo.specs:specs:1.1-SNAPSHOT: checking for updates from apache.snapshots
Downloading: http://svn.apache.org/maven-snapshot-repository/incubator-activemq/activeio-core/3.0-SNAPSHOT/activeio-core-3.0-20060621.074924-4.jar
226K downloaded
Downloading: http://svn.apache.org/maven-snapshot-repository/incubator-activemq/activemq-core/4.1-SNAPSHOT/activemq-core-4.1-20060621.074924-2.jar
1367K downloaded
[INFO] snapshot org.codehaus.plexus:plexus-compiler-javac:1.6-SNAPSHOT: checking for updates
from central
[INFO] snapshot org.codehaus.plexus:plexus-compiler-javac:1.6-SNAPSHOT: checking for updates
from mortbay-repo
[INFO] snapshot org.codehaus.plexus:plexus-compiler-javac:1.6-SNAPSHOT: checking for updates
from apache-snapshots
[INFO] snapshot org.codehaus.plexus:plexus-compiler-javac:1.6-SNAPSHOT: checking for updates
from snapshots
[INFO] snapshot org.codehaus.plexus:plexus-compiler-javac:1.6-SNAPSHOT: checking for updates
from apache.snapshots
[INFO] snapshot org.codehaus.plexus:plexus-compilers:1.6-SNAPSHOT: checking for updates from
central
[INFO] snapshot org.codehaus.plexus:plexus-compilers:1.6-SNAPSHOT: checking for updates from
mortbay-repo
[INFO] snapshot org.codehaus.plexus:plexus-compilers:1.6-SNAPSHOT: checking for updates from
apache-snapshots
[INFO] snapshot org.codehaus.plexus:plexus-compilers:1.6-SNAPSHOT: checking for updates from
snapshots
[INFO] snapshot org.codehaus.plexus:plexus-compilers:1.6-SNAPSHOT: checking for updates from
apache.snapshots
[INFO] snapshot org.codehaus.plexus:plexus-compiler:1.6-SNAPSHOT: checking for updates from
central
[INFO] snapshot org.codehaus.plexus:plexus-compiler:1.6-SNAPSHOT: checking for updates from
mortbay-repo
[INFO] snapshot org.codehaus.plexus:plexus-compiler:1.6-SNAPSHOT: checking for updates from
apache-snapshots
[INFO] snapshot org.codehaus.plexus:plexus-compiler:1.6-SNAPSHOT: checking for updates from
snapshots
[INFO] snapshot org.codehaus.plexus:plexus-compiler:1.6-SNAPSHOT: checking for updates from
apache.snapshots
[INFO] snapshot org.codehaus.plexus:plexus-compiler-api:1.6-SNAPSHOT: checking for updates
from central
[INFO] snapshot org.codehaus.plexus:plexus-compiler-api:1.6-SNAPSHOT: checking for updates
from mortbay-repo
[INFO] snapshot org.codehaus.plexus:plexus-compiler-api:1.6-SNAPSHOT: checking for updates
from apache-snapshots
[INFO] snapshot org.codehaus.plexus:plexus-compiler-api:1.6-SNAPSHOT: checking for updates
from snapshots
[INFO] snapshot org.codehaus.plexus:plexus-compiler-api:1.6-SNAPSHOT: checking for updates
from apache.snapshots
[INFO] snapshot org.codehaus.plexus:plexus-compiler-manager:1.6-SNAPSHOT: checking for updates
from central
[INFO] snapshot org.codehaus.plexus:plexus-compiler-manager:1.6-SNAPSHOT: checking for updates
from mortbay-repo
[INFO] snapshot org.codehaus.plexus:plexus-compiler-manager:1.6-SNAPSHOT: checking for updates
from apache-snapshots
[INFO] snapshot org.codehaus.plexus:plexus-compiler-manager:1.6-SNAPSHOT: checking for updates
from snapshots
[INFO] snapshot org.codehaus.plexus:plexus-compiler-manager:1.6-SNAPSHOT: checking for updates
from apache.snapshots
[INFO] [compiler:compile]
Compiling 15 source files to /home/continuum/continuum-1.0.2/apps/continuum/work/153/target/classes
[INFO] [resources:testResources]
[INFO] Using default encoding to copy filtered resources.
Downloading: http://svn.apache.org/maven-snapshot-repository/incubator-activemq/activemq-core/4.1-SNAPSHOT/activemq-core-4.1-20060621.074924-2-tests.jar
43K downloaded
[INFO] [compiler:testCompile]
Compiling 1 source file to /home/continuum/continuum-1.0.2/apps/continuum/work/153/target/test-classes
[INFO] ------------------------------------------------------------------------
[ERROR] BUILD FAILURE
[INFO] ------------------------------------------------------------------------
[INFO] Compilation failure

/home/continuum/continuum-1.0.2/apps/continuum/work/153/src/test/java/org/apache/activemq/web/JettyServer.java:[21,32]
package org.apache.activemq.demo does not exist

/home/continuum/continuum-1.0.2/apps/continuum/work/153/src/test/java/org/apache/activemq/web/JettyServer.java:[53,8]
cannot resolve symbol
symbol  : variable DefaultQueueSender 
location: class org.apache.activemq.web.JettyServer


[INFO] ------------------------------------------------------------------------
[INFO] For more information, run Maven with the -e switch
[INFO] ------------------------------------------------------------------------
[INFO] Total time: 25 seconds
[INFO] Finished at: Wed Jun 21 10:08:17 PDT 2006
[INFO] Final Memory: 5M/15M
[INFO] ------------------------------------------------------------------------

****************************************************************************



Mime
View raw message