activemq-commits mailing list archives

Site index · List index
Message view « Date » · « Thread »
Top « Date » · « Thread »
From continuum <contin...@stan.gbuild.org>
Subject [continuum] BUILD FAILURE: ActiveMQ :: Core
Date Wed, 07 Jun 2006 08:01:44 GMT
Online report : http://ci.gbuild.org/continuum/servlet/continuum/target/ProjectBuild.vm/view/ProjectBuild/id/149/buildId/3794
Build statistics:
  State: Failed
  Previous Build: No previous build.
  Started at: Wed, 7 Jun 2006 01:01:15 -0700
  Finished at: Wed, 7 Jun 2006 01:01:37 -0700
  Total time: 21s
  Build Trigger: Schedule
  Exit code: 1
  Building machine hostname: stan.gbuild.org
  Operating system : Linux(unknown)
  Java version : 1.4.2_08(Sun Microsystems Inc.)

Changes
      No files changed
  
****************************************************************************
Output:
****************************************************************************
[INFO] Scanning for projects...
[INFO] ----------------------------------------------------------------------------
[INFO] Building ActiveMQ :: Core
[INFO]    task-segment: [clean, install]
[INFO] ----------------------------------------------------------------------------
Downloading: http://maven-csharp.javaforge.com/repo/org/codehaus/mojo/javacc-maven-plugin/2.0/javacc-maven-plugin-2.0.pom
0b downloaded
[WARNING] *** CHECKSUM FAILED - Invalid checksum file - RETRYING
Downloading: http://maven-csharp.javaforge.com/repo/org/codehaus/mojo/javacc-maven-plugin/2.0/javacc-maven-plugin-2.0.pom
0b downloaded
[WARNING] *** CHECKSUM FAILED - Invalid checksum file - IGNORING
[WARNING] Unable to get resource from repository maven-csharp-plugins (http://maven-csharp.javaforge.com/repo)
Downloading: http://www.mortbay.org/maven2/release/org/codehaus/mojo/javacc-maven-plugin/2.0/javacc-maven-plugin-2.0.pom
[WARNING] Unable to get resource from repository mortbay-repo (http://www.mortbay.org/maven2/release)
Downloading: http://repo1.maven.org/maven2/org/codehaus/mojo/javacc-maven-plugin/2.0/javacc-maven-plugin-2.0.pom
1K downloaded
Downloading: http://maven-csharp.javaforge.com/repo/org/codehaus/mojo/javacc-maven-plugin/2.0/javacc-maven-plugin-2.0.jar
0b downloaded
[WARNING] *** CHECKSUM FAILED - Invalid checksum file - RETRYING
Downloading: http://maven-csharp.javaforge.com/repo/org/codehaus/mojo/javacc-maven-plugin/2.0/javacc-maven-plugin-2.0.jar
0b downloaded
[WARNING] *** CHECKSUM FAILED - Invalid checksum file - IGNORING
[WARNING] Unable to get resource from repository maven-csharp-plugins (http://maven-csharp.javaforge.com/repo)
Downloading: http://www.mortbay.org/maven2/release/org/codehaus/mojo/javacc-maven-plugin/2.0/javacc-maven-plugin-2.0.jar
[WARNING] Unable to get resource from repository mortbay-repo (http://www.mortbay.org/maven2/release)
Downloading: http://repo1.maven.org/maven2/org/codehaus/mojo/javacc-maven-plugin/2.0/javacc-maven-plugin-2.0.jar
10K downloaded
[INFO] artifact org.apache.maven.plugins:maven-antrun-plugin: checking for updates from maven-csharp-plugins
[WARNING] *** CHECKSUM FAILED - Invalid checksum file - RETRYING
[WARNING] *** CHECKSUM FAILED - Invalid checksum file - IGNORING
[INFO] artifact org.apache.maven.plugins:maven-antrun-plugin: checking for updates from mortbay-repo
[INFO] [clean:clean]
[INFO] [javacc:javacc {execution: default}]
Java Compiler Compiler Version 3.2 (Parser Generator)
(type "javacc" with no arguments for help)
Reading from file /home/continuum/continuum-1.0.2/apps/continuum/work/149/src/main/grammar/SelectorParser.jj
. . .
Note: UNICODE_INPUT option is specified. Please make sure you create the parser/lexer usig
a Reader with the correct character encoding.
Warning: TokenMgrError.java: File is obsolete.  Please rename or delete this file so that
a new one can be generated for you.
Warning: ParseException.java: File is obsolete.  Please rename or delete this file so that
a new one can be generated for you.
Warning: Token.java: File is obsolete.  Please rename or delete this file so that a new one
can be generated for you.
Warning: SimpleCharStream.java: File is obsolete.  Please rename or delete this file so that
a new one can be generated for you.
Parser generated with 0 errors and 4 warnings.
[INFO] snapshot org.apache.geronimo.specs:specs:1.1-SNAPSHOT: checking for updates from apache.snapshots
[INFO] snapshot org.apache.geronimo.specs:specs:1.1-SNAPSHOT: checking for updates from codehaus-snapshot
[INFO] snapshot org.apache.geronimo.specs:specs:1.1-SNAPSHOT: checking for updates from maven-csharp
[WARNING] *** CHECKSUM FAILED - Invalid checksum file - RETRYING
[WARNING] *** CHECKSUM FAILED - Invalid checksum file - IGNORING
[INFO] snapshot org.apache.geronimo.specs:specs:1.1-SNAPSHOT: checking for updates from apache-maven1-snapshot
[INFO] snapshot org.apache.geronimo.specs:specs:1.1-SNAPSHOT: checking for updates from mortbay-repo
Downloading: http://cvs.apache.org/maven-snapshot-repository/org/apache/geronimo/specs/specs/1.1-SNAPSHOT/specs-1.1-20060419.231615-5.pom
10K downloaded
[WARNING] 
	Artifact junit:junit:jar:3.8.1:test retains local scope 'test' overriding broader scope 'compile'
	given by a dependency. If this is not intended, modify or remove the local scope.

[INFO] snapshot incubator-activemq:activemq-jaas:4.1-SNAPSHOT: checking for updates from apache.snapshots
[INFO] snapshot incubator-activemq:activemq-jaas:4.1-SNAPSHOT: checking for updates from codehaus-snapshot
[INFO] snapshot incubator-activemq:activemq-jaas:4.1-SNAPSHOT: checking for updates from maven-csharp
[WARNING] *** CHECKSUM FAILED - Invalid checksum file - RETRYING
[WARNING] *** CHECKSUM FAILED - Invalid checksum file - IGNORING
[INFO] snapshot incubator-activemq:activemq-jaas:4.1-SNAPSHOT: checking for updates from apache-maven1-snapshot
[INFO] snapshot incubator-activemq:activemq-jaas:4.1-SNAPSHOT: checking for updates from mortbay-repo
[WARNING] POM for 'incubator-activemq:activeio-core:pom:3.0-beta2:compile' is invalid. It
will be ignored for artifact resolution. Reason: Failed to validate POM
[WARNING] 
	Artifact commons-collections:commons-collections:jar:2.1:test retains local scope 'test'
overriding broader scope 'compile'
	given by a dependency. If this is not intended, modify or remove the local scope.

[WARNING] 
	Artifact ant:ant:jar:1.6.5:runtime retains local scope 'runtime' overriding broader scope
'compile'
	given by a dependency. If this is not intended, modify or remove the local scope.

[INFO] [antrun:run {execution: default}]
[INFO] Executing tasks
    [mkdir] Created dir: /home/continuum/continuum-1.0.2/apps/continuum/work/149/target/generated
[xsdGenerate] Generating META-INF properties file: /home/continuum/continuum-1.0.2/apps/continuum/work/149/target/generated/META-INF/services/org/apache/xbean/spring/http/activemq.org/config/1.0
for namespace: http://activemq.org/config/1.0
[xsdGenerate] Generating HTML documentation file: /home/continuum/continuum-1.0.2/apps/continuum/work/149/target/activemq-4.1-SNAPSHOT.xsd.html
for namespace: http://activemq.org/config/1.0
Warning, could not load class: org.apache.activemq.security.AuthorizationEntry
Warning, could not load class: org.apache.activemq.security.AuthorizationEntry
Warning, could not load class: org.apache.activemq.security.AuthorizationMap
Warning, could not load class: org.apache.activemq.security.AuthorizationMap
Warning, could not load class: org.apache.activemq.store.jdbc.Statements
Warning, could not load class: org.apache.activemq.store.jdbc.Statements
Warning, could not load class: org.apache.activemq.transport.Transport
Warning, could not load class: org.apache.activemq.transport.Transport
Warning, could not load class: org.apache.activemq.transport.Transport
Warning, could not load class: org.apache.activemq.transport.Transport
Warning, could not load class: org.apache.activemq.store.jdbc.Statements
Warning, could not load class: org.apache.activemq.store.jdbc.Statements
Warning, could not load class: org.apache.activemq.store.jdbc.Statements
Warning, could not load class: org.apache.activemq.transport.Transport
Warning, could not load class: org.apache.activemq.transport.Transport
Warning, could not load class: org.apache.activemq.transport.Transport
Warning, could not load class: org.apache.activemq.transport.Transport
Warning, could not load class: org.apache.activemq.memory.list.MessageList
Warning, could not load class: org.apache.activemq.memory.list.MessageList
Warning, could not load class: org.apache.activemq.memory.list.MessageList
Warning, could not load class: org.apache.activemq.transport.Transport
Warning, could not load class: org.apache.activemq.transport.Transport
Warning, could not load class: org.apache.activemq.transport.Transport
Warning, could not load class: org.apache.activemq.transport.Transport
Warning, could not load class: org.apache.activemq.transport.Transport
Warning, could not load class: org.apache.activemq.store.jdbc.Statements
Warning, could not load class: org.apache.activemq.store.jdbc.Statements
Warning, could not load class: org.apache.activemq.store.jdbc.Statements
Warning, could not load class: org.apache.activemq.store.jdbc.Statements
Warning, could not load class: org.apache.activemq.store.jdbc.JDBCAdapter
Warning, could not load class: org.apache.activemq.store.jdbc.JDBCAdapter
Warning, could not load class: org.apache.activemq.store.jdbc.Statements
Warning, could not load class: org.apache.activemq.memory.UsageManager
Warning, could not load class: org.apache.activeio.command.WireFormat
Warning, could not load class: org.apache.activemq.store.jdbc.JDBCAdapter
Warning, could not load class: org.apache.activemq.store.jdbc.Statements
Warning, could not load class: org.apache.activemq.memory.UsageManager
Warning, could not load class: org.apache.activeio.command.WireFormat
Warning, could not load class: javax.jms.QueueConnection
Warning, could not load class: javax.jms.QueueConnectionFactory
Warning, could not load class: javax.jms.QueueConnection
Warning, could not load class: javax.jms.QueueConnectionFactory
Warning, could not load class: javax.jms.QueueConnection
Warning, could not load class: javax.jms.QueueConnectionFactory
Warning, could not load class: javax.jms.QueueConnection
Warning, could not load class: javax.jms.QueueConnectionFactory
Warning, could not load class: javax.jms.TopicConnection
Warning, could not load class: javax.jms.TopicConnectionFactory
Warning, could not load class: javax.jms.TopicConnection
Warning, could not load class: javax.jms.TopicConnectionFactory
Warning, could not load class: javax.jms.TopicConnection
Warning, could not load class: javax.jms.TopicConnectionFactory
Warning, could not load class: javax.jms.TopicConnection
Warning, could not load class: javax.jms.TopicConnectionFactory
Warning, could not load class: org.apache.activeio.journal.Journal
Warning, could not load class: org.apache.activemq.store.PersistenceAdapter
Warning, could not load class: org.apache.activeio.journal.Journal
Warning, could not load class: org.apache.activemq.store.PersistenceAdapter
Warning, could not load class: org.apache.activemq.thread.TaskRunnerFactory
Warning, could not load class: org.apache.activemq.memory.UsageManager
Warning, could not load class: org.apache.activeio.journal.Journal
Warning, could not load class: org.apache.activemq.store.PersistenceAdapter
Warning, could not load class: org.apache.activemq.thread.TaskRunnerFactory
Warning, could not load class: org.apache.activemq.memory.UsageManager
Warning, could not load class: org.apache.activemq.memory.UsageManager
Warning, could not load class: org.apache.activemq.memory.UsageManager
Warning, could not load class: org.apache.activemq.memory.UsageManager
Warning, could not load class: org.apache.activemq.memory.UsageManager
Warning, could not load class: org.apache.activemq.memory.UsageManager
Warning, could not load class: org.apache.activemq.memory.UsageManager
Warning, could not load class: org.apache.activemq.network.DemandForwardingBridgeSupport
Warning, could not load class: org.apache.activemq.transport.Transport
Warning, could not load class: org.apache.activemq.transport.Transport
Warning, could not load class: org.apache.activemq.network.DemandForwardingBridgeSupport
Warning, could not load class: org.apache.activemq.transport.Transport
Warning, could not load class: org.apache.activemq.transport.Transport
Warning, could not load class: org.apache.activemq.network.DemandForwardingBridgeSupport
Warning, could not load class: org.apache.activemq.transport.Transport
Warning, could not load class: org.apache.activemq.transport.Transport
Warning, could not load class: org.apache.activemq.transport.discovery.DiscoveryAgent
Warning, could not load class: org.apache.activemq.transport.discovery.DiscoveryAgent
Warning, could not load class: org.apache.activemq.transport.discovery.DiscoveryAgent
Warning, could not load class: org.apache.activemq.store.jdbc.Statements
Warning, could not load class: org.apache.activemq.store.jdbc.Statements
Warning, could not load class: org.apache.activemq.broker.region.policy.DeadLetterStrategy
Warning, could not load class: org.apache.activemq.broker.region.policy.DispatchPolicy
Warning, could not load class: org.apache.activemq.broker.region.policy.DeadLetterStrategy
Warning, could not load class: org.apache.activemq.broker.region.policy.DispatchPolicy
Warning, could not load class: org.apache.activemq.broker.region.policy.MessageEvictionStrategy
Warning, could not load class: org.apache.activemq.broker.region.policy.PendingMessageLimitStrategy
Warning, could not load class: org.apache.activemq.broker.region.policy.SubscriptionRecoveryPolicy
Warning, could not load class: org.apache.activemq.broker.region.policy.DeadLetterStrategy
Warning, could not load class: org.apache.activemq.broker.region.policy.DispatchPolicy
Warning, could not load class: org.apache.activemq.broker.region.policy.MessageEvictionStrategy
Warning, could not load class: org.apache.activemq.broker.region.policy.PendingMessageLimitStrategy
Warning, could not load class: org.apache.activemq.broker.region.policy.SubscriptionRecoveryPolicy
Warning, could not load class: org.apache.activemq.broker.region.policy.PolicyEntry
Warning, could not load class: org.apache.activemq.broker.region.policy.PolicyEntry
Warning, could not load class: org.apache.activemq.transport.TransportServer
Warning, could not load class: org.apache.activemq.transport.TransportServer
Warning, could not load class: org.apache.activemq.transport.TransportServer
Warning, could not load class: org.apache.activemq.broker.region.policy.MessageQuery
Warning, could not load class: org.apache.activemq.broker.region.policy.MessageQuery
Warning, could not load class: org.apache.activeio.journal.Journal
Warning, could not load class: org.apache.activemq.store.PersistenceAdapter
Warning, could not load class: org.apache.activeio.journal.Journal
Warning, could not load class: org.apache.activemq.store.PersistenceAdapter
Warning, could not load class: org.apache.activemq.thread.TaskRunnerFactory
Warning, could not load class: org.apache.activemq.memory.UsageManager
Warning, could not load class: org.apache.activeio.journal.Journal
Warning, could not load class: org.apache.activemq.store.PersistenceAdapter
Warning, could not load class: org.apache.activemq.thread.TaskRunnerFactory
Warning, could not load class: org.apache.activemq.memory.UsageManager
Warning, could not load class: org.apache.activeio.journal.Journal
Warning, could not load class: org.apache.activeio.journal.Journal
Warning, could not load class: org.apache.activemq.thread.TaskRunnerFactory
Warning, could not load class: org.apache.activemq.memory.UsageManager
Warning, could not load class: org.apache.activeio.journal.Journal
Warning, could not load class: org.apache.activemq.thread.TaskRunnerFactory
Warning, could not load class: org.apache.activemq.memory.UsageManager
Warning, could not load class: org.apache.activemq.command.ActiveMQDestination
Warning, could not load class: org.apache.activemq.command.ActiveMQDestination
Warning, could not load class: org.apache.activemq.filter.DestinationMap
Warning, could not load class: org.apache.activemq.filter.DestinationMap
Warning, could not load class: org.apache.activemq.filter.DestinationMap
Warning, could not load class: org.apache.activemq.filter.DestinationMap
Warning, could not load class: org.apache.activemq.filter.DestinationMap
Warning, could not load class: org.apache.activemq.filter.DestinationMap
Warning, could not load class: javax.jms.Connection
Warning, could not load class: javax.jms.Connection
Warning, could not load class: org.apache.activemq.broker.Broker
Warning, could not load class: org.apache.activemq.command.BrokerInfo
Warning, could not load class: org.apache.activemq.broker.Broker
Warning, could not load class: org.apache.activemq.command.BrokerInfo
Warning, could not load class: org.apache.activemq.transport.discovery.DiscoveryAgent
Warning, could not load class: org.apache.activemq.security.MessageAuthorizationPolicy
Warning, could not load class: org.apache.activemq.transport.TransportServer
Warning, could not load class: org.apache.activemq.thread.TaskRunnerFactory
Warning, could not load class: org.apache.activemq.broker.Broker
Warning, could not load class: org.apache.activemq.command.BrokerInfo
Warning, could not load class: org.apache.activemq.transport.discovery.DiscoveryAgent
Warning, could not load class: org.apache.activemq.security.MessageAuthorizationPolicy
Warning, could not load class: org.apache.activemq.transport.TransportServer
Warning, could not load class: org.apache.activemq.thread.TaskRunnerFactory
Warning, could not load class: org.apache.activemq.memory.UsageManager
Warning, could not load class: org.apache.activemq.memory.UsageManager
Warning, could not load class: org.apache.activemq.memory.UsageManager
[xsdGenerate] Generating XSD file: /home/continuum/continuum-1.0.2/apps/continuum/work/149/target/activemq-4.1-SNAPSHOT.xsd
for namespace: http://activemq.org/config/1.0
Warning, could not load class: org.apache.activemq.security.AuthorizationEntry
Warning, could not load class: org.apache.activemq.security.AuthorizationEntry
Warning, could not load class: org.apache.activemq.security.AuthorizationEntry
Warning, could not load class: org.apache.activemq.security.AuthorizationMap
Warning, could not load class: org.apache.activemq.security.AuthorizationMap
Warning, could not load class: org.apache.activemq.security.AuthorizationMap
Warning, could not load class: org.apache.activemq.store.jdbc.Statements
Warning, could not load class: org.apache.activemq.store.jdbc.Statements
Warning, could not load class: org.apache.activemq.store.jdbc.Statements
Warning, could not load class: org.apache.activemq.transport.Transport
Warning, could not load class: org.apache.activemq.transport.Transport
Warning, could not load class: org.apache.activemq.transport.Transport
Warning, could not load class: org.apache.activemq.transport.Transport
Warning, could not load class: org.apache.activemq.transport.Transport
Warning, could not load class: org.apache.activemq.transport.Transport
Warning, could not load class: org.apache.activemq.store.jdbc.Statements
Warning, could not load class: org.apache.activemq.store.jdbc.Statements
Warning, could not load class: org.apache.activemq.store.jdbc.Statements
Warning, could not load class: org.apache.activemq.transport.Transport
Warning, could not load class: org.apache.activemq.transport.Transport
Warning, could not load class: org.apache.activemq.transport.Transport
Warning, could not load class: org.apache.activemq.transport.Transport
Warning, could not load class: org.apache.activemq.transport.Transport
Warning, could not load class: org.apache.activemq.transport.Transport
Warning, could not load class: org.apache.activemq.memory.list.MessageList
Warning, could not load class: org.apache.activemq.memory.list.MessageList
Warning, could not load class: org.apache.activemq.memory.list.MessageList
Warning, could not load class: org.apache.activemq.transport.Transport
Warning, could not load class: org.apache.activemq.transport.Transport
Warning, could not load class: org.apache.activemq.transport.Transport
Warning, could not load class: org.apache.activemq.transport.Transport
Warning, could not load class: org.apache.activemq.transport.Transport
Warning, could not load class: org.apache.activemq.transport.Transport
Warning, could not load class: org.apache.activemq.store.jdbc.Statements
Warning, could not load class: org.apache.activemq.store.jdbc.Statements
Warning, could not load class: org.apache.activemq.store.jdbc.Statements
Warning, could not load class: org.apache.activemq.store.jdbc.Statements
Warning, could not load class: org.apache.activemq.store.jdbc.Statements
Warning, could not load class: org.apache.activemq.store.jdbc.Statements
Warning, could not load class: org.apache.activemq.store.jdbc.JDBCAdapter
Warning, could not load class: org.apache.activemq.store.jdbc.Statements
Warning, could not load class: org.apache.activemq.memory.UsageManager
Warning, could not load class: org.apache.activeio.command.WireFormat
Warning, could not load class: org.apache.activemq.store.jdbc.JDBCAdapter
Warning, could not load class: org.apache.activemq.store.jdbc.Statements
Warning, could not load class: org.apache.activemq.memory.UsageManager
Warning, could not load class: org.apache.activeio.command.WireFormat
Warning, could not load class: org.apache.activemq.store.jdbc.JDBCAdapter
Warning, could not load class: org.apache.activemq.store.jdbc.Statements
Warning, could not load class: org.apache.activemq.memory.UsageManager
Warning, could not load class: org.apache.activeio.command.WireFormat
Warning, could not load class: javax.jms.QueueConnection
Warning, could not load class: javax.jms.QueueConnectionFactory
Warning, could not load class: javax.jms.QueueConnection
Warning, could not load class: javax.jms.QueueConnectionFactory
Warning, could not load class: javax.jms.QueueConnection
Warning, could not load class: javax.jms.QueueConnectionFactory
Warning, could not load class: javax.jms.QueueConnection
Warning, could not load class: javax.jms.QueueConnectionFactory
Warning, could not load class: javax.jms.QueueConnection
Warning, could not load class: javax.jms.QueueConnectionFactory
Warning, could not load class: javax.jms.QueueConnection
Warning, could not load class: javax.jms.QueueConnectionFactory
Warning, could not load class: javax.jms.TopicConnection
Warning, could not load class: javax.jms.TopicConnectionFactory
Warning, could not load class: javax.jms.TopicConnection
Warning, could not load class: javax.jms.TopicConnectionFactory
Warning, could not load class: javax.jms.TopicConnection
Warning, could not load class: javax.jms.TopicConnectionFactory
Warning, could not load class: javax.jms.TopicConnection
Warning, could not load class: javax.jms.TopicConnectionFactory
Warning, could not load class: javax.jms.TopicConnection
Warning, could not load class: javax.jms.TopicConnectionFactory
Warning, could not load class: javax.jms.TopicConnection
Warning, could not load class: javax.jms.TopicConnectionFactory
Warning, could not load class: org.apache.activeio.journal.Journal
Warning, could not load class: org.apache.activemq.store.PersistenceAdapter
Warning, could not load class: org.apache.activemq.thread.TaskRunnerFactory
Warning, could not load class: org.apache.activemq.memory.UsageManager
Warning, could not load class: org.apache.activeio.journal.Journal
Warning, could not load class: org.apache.activemq.store.PersistenceAdapter
Warning, could not load class: org.apache.activemq.thread.TaskRunnerFactory
Warning, could not load class: org.apache.activemq.memory.UsageManager
Warning, could not load class: org.apache.activeio.journal.Journal
Warning, could not load class: org.apache.activemq.store.PersistenceAdapter
Warning, could not load class: org.apache.activemq.thread.TaskRunnerFactory
Warning, could not load class: org.apache.activemq.memory.UsageManager
Warning, could not load class: org.apache.activemq.memory.UsageManager
Warning, could not load class: org.apache.activemq.memory.UsageManager
Warning, could not load class: org.apache.activemq.memory.UsageManager
Warning, could not load class: org.apache.activemq.memory.UsageManager
Warning, could not load class: org.apache.activemq.memory.UsageManager
Warning, could not load class: org.apache.activemq.memory.UsageManager
Warning, could not load class: org.apache.activemq.network.DemandForwardingBridgeSupport
Warning, could not load class: org.apache.activemq.transport.Transport
Warning, could not load class: org.apache.activemq.transport.Transport
Warning, could not load class: org.apache.activemq.network.DemandForwardingBridgeSupport
Warning, could not load class: org.apache.activemq.transport.Transport
Warning, could not load class: org.apache.activemq.transport.Transport
Warning, could not load class: org.apache.activemq.network.DemandForwardingBridgeSupport
Warning, could not load class: org.apache.activemq.transport.Transport
Warning, could not load class: org.apache.activemq.transport.Transport
Warning, could not load class: org.apache.activemq.transport.discovery.DiscoveryAgent
Warning, could not load class: org.apache.activemq.transport.discovery.DiscoveryAgent
Warning, could not load class: org.apache.activemq.transport.discovery.DiscoveryAgent
Warning, could not load class: org.apache.activemq.store.jdbc.Statements
Warning, could not load class: org.apache.activemq.store.jdbc.Statements
Warning, could not load class: org.apache.activemq.store.jdbc.Statements
Warning, could not load class: org.apache.activemq.broker.region.policy.DeadLetterStrategy
Warning, could not load class: org.apache.activemq.broker.region.policy.DispatchPolicy
Warning, could not load class: org.apache.activemq.broker.region.policy.MessageEvictionStrategy
Warning, could not load class: org.apache.activemq.broker.region.policy.PendingMessageLimitStrategy
Warning, could not load class: org.apache.activemq.broker.region.policy.SubscriptionRecoveryPolicy
Warning, could not load class: org.apache.activemq.broker.region.policy.DeadLetterStrategy
Warning, could not load class: org.apache.activemq.broker.region.policy.DispatchPolicy
Warning, could not load class: org.apache.activemq.broker.region.policy.MessageEvictionStrategy
Warning, could not load class: org.apache.activemq.broker.region.policy.PendingMessageLimitStrategy
Warning, could not load class: org.apache.activemq.broker.region.policy.SubscriptionRecoveryPolicy
Warning, could not load class: org.apache.activemq.broker.region.policy.DeadLetterStrategy
Warning, could not load class: org.apache.activemq.broker.region.policy.DispatchPolicy
Warning, could not load class: org.apache.activemq.broker.region.policy.MessageEvictionStrategy
Warning, could not load class: org.apache.activemq.broker.region.policy.PendingMessageLimitStrategy
Warning, could not load class: org.apache.activemq.broker.region.policy.SubscriptionRecoveryPolicy
Warning, could not load class: org.apache.activemq.broker.region.policy.PolicyEntry
Warning, could not load class: org.apache.activemq.broker.region.policy.PolicyEntry
Warning, could not load class: org.apache.activemq.broker.region.policy.PolicyEntry
Warning, could not load class: org.apache.activemq.transport.TransportServer
Warning, could not load class: org.apache.activemq.transport.TransportServer
Warning, could not load class: org.apache.activemq.transport.TransportServer
Warning, could not load class: org.apache.activemq.broker.region.policy.MessageQuery
Warning, could not load class: org.apache.activemq.broker.region.policy.MessageQuery
Warning, could not load class: org.apache.activemq.broker.region.policy.MessageQuery
Warning, could not load class: org.apache.activeio.journal.Journal
Warning, could not load class: org.apache.activemq.store.PersistenceAdapter
Warning, could not load class: org.apache.activemq.thread.TaskRunnerFactory
Warning, could not load class: org.apache.activemq.memory.UsageManager
Warning, could not load class: org.apache.activeio.journal.Journal
Warning, could not load class: org.apache.activemq.store.PersistenceAdapter
Warning, could not load class: org.apache.activemq.thread.TaskRunnerFactory
Warning, could not load class: org.apache.activemq.memory.UsageManager
Warning, could not load class: org.apache.activeio.journal.Journal
Warning, could not load class: org.apache.activemq.store.PersistenceAdapter
Warning, could not load class: org.apache.activemq.thread.TaskRunnerFactory
Warning, could not load class: org.apache.activemq.memory.UsageManager
Warning, could not load class: org.apache.activeio.journal.Journal
Warning, could not load class: org.apache.activemq.thread.TaskRunnerFactory
Warning, could not load class: org.apache.activemq.memory.UsageManager
Warning, could not load class: org.apache.activeio.journal.Journal
Warning, could not load class: org.apache.activemq.thread.TaskRunnerFactory
Warning, could not load class: org.apache.activemq.memory.UsageManager
Warning, could not load class: org.apache.activeio.journal.Journal
Warning, could not load class: org.apache.activemq.thread.TaskRunnerFactory
Warning, could not load class: org.apache.activemq.memory.UsageManager
Warning, could not load class: org.apache.activemq.command.ActiveMQDestination
Warning, could not load class: org.apache.activemq.command.ActiveMQDestination
Warning, could not load class: org.apache.activemq.command.ActiveMQDestination
Warning, could not load class: org.apache.activemq.filter.DestinationMap
Warning, could not load class: org.apache.activemq.filter.DestinationMap
Warning, could not load class: org.apache.activemq.filter.DestinationMap
Warning, could not load class: org.apache.activemq.filter.DestinationMap
Warning, could not load class: org.apache.activemq.filter.DestinationMap
Warning, could not load class: org.apache.activemq.filter.DestinationMap
Warning, could not load class: org.apache.activemq.filter.DestinationMap
Warning, could not load class: org.apache.activemq.filter.DestinationMap
Warning, could not load class: org.apache.activemq.filter.DestinationMap
Warning, could not load class: javax.jms.Connection
Warning, could not load class: javax.jms.Connection
Warning, could not load class: javax.jms.Connection
Warning, could not load class: org.apache.activemq.broker.Broker
Warning, could not load class: org.apache.activemq.command.BrokerInfo
Warning, could not load class: org.apache.activemq.transport.discovery.DiscoveryAgent
Warning, could not load class: org.apache.activemq.security.MessageAuthorizationPolicy
Warning, could not load class: org.apache.activemq.transport.TransportServer
Warning, could not load class: org.apache.activemq.thread.TaskRunnerFactory
Warning, could not load class: org.apache.activemq.broker.Broker
Warning, could not load class: org.apache.activemq.command.BrokerInfo
Warning, could not load class: org.apache.activemq.transport.discovery.DiscoveryAgent
Warning, could not load class: org.apache.activemq.security.MessageAuthorizationPolicy
Warning, could not load class: org.apache.activemq.transport.TransportServer
Warning, could not load class: org.apache.activemq.thread.TaskRunnerFactory
Warning, could not load class: org.apache.activemq.broker.Broker
Warning, could not load class: org.apache.activemq.command.BrokerInfo
Warning, could not load class: org.apache.activemq.transport.discovery.DiscoveryAgent
Warning, could not load class: org.apache.activemq.security.MessageAuthorizationPolicy
Warning, could not load class: org.apache.activemq.transport.TransportServer
Warning, could not load class: org.apache.activemq.thread.TaskRunnerFactory
Warning, could not load class: org.apache.activemq.memory.UsageManager
Warning, could not load class: org.apache.activemq.memory.UsageManager
Warning, could not load class: org.apache.activemq.memory.UsageManager
[xsdGenerate] ...done.
     [copy] Copying 1 file to /home/continuum/continuum-1.0.2/apps/continuum/work/149/target/classes
     [copy] Copying 1 file to /home/continuum/continuum-1.0.2/apps/continuum/work/xdocs
     [copy] Copying 1 file to /home/continuum/continuum-1.0.2/apps/continuum/work/xdocs
[INFO] Executed tasks
[INFO] [resources:resources]
[INFO] Using default encoding to copy filtered resources.
[WARNING] POM for 'incubator-activemq:activeio-core:pom:3.0-beta2:compile' is invalid. It
will be ignored for artifact resolution. Reason: Failed to validate POM
[INFO] [compiler:compile]
Compiling 676 source files to /home/continuum/continuum-1.0.2/apps/continuum/work/149/target/classes
[INFO] ------------------------------------------------------------------------
[ERROR] BUILD FAILURE
[INFO] ------------------------------------------------------------------------
[INFO] Compilation failure

/home/continuum/continuum-1.0.2/apps/continuum/work/149/src/main/java/org/apache/activemq/filter/JAXPXPathEvaluator.java:[24,23]
package javax.xml.xpath does not exist

/home/continuum/continuum-1.0.2/apps/continuum/work/149/src/main/java/org/apache/activemq/filter/JAXPXPathEvaluator.java:[25,23]
package javax.xml.xpath does not exist

/home/continuum/continuum-1.0.2/apps/continuum/work/149/src/main/java/org/apache/activemq/filter/JAXPXPathEvaluator.java:[26,23]
package javax.xml.xpath does not exist

/home/continuum/continuum-1.0.2/apps/continuum/work/149/src/main/java/org/apache/activemq/filter/JAXPXPathEvaluator.java:[27,23]
package javax.xml.xpath does not exist

/home/continuum/continuum-1.0.2/apps/continuum/work/149/src/main/java/org/apache/activemq/filter/JAXPXPathEvaluator.java:[35,25]
cannot resolve symbol
symbol  : class XPathFactory 
location: class org.apache.activemq.filter.JAXPXPathEvaluator

/home/continuum/continuum-1.0.2/apps/continuum/work/149/src/main/java/org/apache/activemq/filter/JAXPXPathEvaluator.java:[36,27]
package javax.xml.xpath does not exist

/home/continuum/continuum-1.0.2/apps/continuum/work/149/src/main/java/org/apache/activemq/filter/JAXPXPathEvaluator.java:[35,48]
cannot resolve symbol
symbol  : variable XPathFactory 
location: class org.apache.activemq.filter.JAXPXPathEvaluator

/home/continuum/continuum-1.0.2/apps/continuum/work/149/src/main/java/org/apache/activemq/filter/JAXPXPathEvaluator.java:[40,12]
cannot resolve symbol
symbol  : class XPath 
location: class org.apache.activemq.filter.JAXPXPathEvaluator

/home/continuum/continuum-1.0.2/apps/continuum/work/149/src/main/java/org/apache/activemq/filter/JAXPXPathEvaluator.java:[42,17]
cannot resolve symbol
symbol  : class XPathExpressionException 
location: class org.apache.activemq.filter.JAXPXPathEvaluator

/home/continuum/continuum-1.0.2/apps/continuum/work/149/src/main/java/org/apache/activemq/filter/JAXPXPathEvaluator.java:[63,62]
cannot resolve symbol
symbol  : variable XPathConstants 
location: class org.apache.activemq.filter.JAXPXPathEvaluator

/home/continuum/continuum-1.0.2/apps/continuum/work/149/src/main/java/org/apache/activemq/filter/JAXPXPathEvaluator.java:[64,17]
cannot resolve symbol
symbol  : class XPathExpressionException 
location: class org.apache.activemq.filter.JAXPXPathEvaluator

/home/continuum/continuum-1.0.2/apps/continuum/work/149/src/main/java/org/apache/activemq/filter/JAXPXPathEvaluator.java:[72,62]
cannot resolve symbol
symbol  : variable XPathConstants 
location: class org.apache.activemq.filter.JAXPXPathEvaluator

/home/continuum/continuum-1.0.2/apps/continuum/work/149/src/main/java/org/apache/activemq/filter/JAXPXPathEvaluator.java:[73,17]
cannot resolve symbol
symbol  : class XPathExpressionException 
location: class org.apache.activemq.filter.JAXPXPathEvaluator


[INFO] ------------------------------------------------------------------------
[INFO] For more information, run Maven with the -e switch
[INFO] ------------------------------------------------------------------------
[INFO] Total time: 19 seconds
[INFO] Finished at: Wed Jun 07 01:01:36 PDT 2006
[INFO] Final Memory: 17M/63M
[INFO] ------------------------------------------------------------------------

****************************************************************************



Mime
View raw message