activemq-commits mailing list archives

Site index · List index
Message view « Date » · « Thread »
Top « Date » · « Thread »
From continuum <contin...@stan.gbuild.org>
Subject [continuum] BUILD FAILURE: ActiveMQ :: Optional
Date Wed, 07 Jun 2006 08:05:17 GMT
Online report : http://ci.gbuild.org/continuum/servlet/continuum/target/ProjectBuild.vm/view/ProjectBuild/id/155/buildId/3799
Build statistics:
  State: Failed
  Previous Build: No previous build.
  Started at: Wed, 7 Jun 2006 01:05:01 -0700
  Finished at: Wed, 7 Jun 2006 01:05:09 -0700
  Total time: 8s
  Build Trigger: Schedule
  Exit code: 1
  Building machine hostname: stan.gbuild.org
  Operating system : Linux(unknown)
  Java version : 1.4.2_08(Sun Microsystems Inc.)

Changes
      No files changed
  
****************************************************************************
Output:
****************************************************************************
[INFO] Scanning for projects...
[INFO] ----------------------------------------------------------------------------
[INFO] Building ActiveMQ :: Optional
[INFO]    task-segment: [clean, install]
[INFO] ----------------------------------------------------------------------------
[INFO] [clean:clean]
[INFO] [resources:resources]
[INFO] Using default encoding to copy filtered resources.
Downloading: http://snapshots.maven.codehaus.org/maven2/org/springframework/spring/1.2.8/spring-1.2.8.pom
[WARNING] Unable to get resource from repository codehaus-snapshot (http://snapshots.maven.codehaus.org/maven2)
Downloading: http://maven-csharp.javaforge.com/repo/org/springframework/spring/1.2.8/spring-1.2.8.pom
0b downloaded
[WARNING] *** CHECKSUM FAILED - Invalid checksum file - RETRYING
Downloading: http://maven-csharp.javaforge.com/repo/org/springframework/spring/1.2.8/spring-1.2.8.pom
0b downloaded
[WARNING] *** CHECKSUM FAILED - Invalid checksum file - IGNORING
[WARNING] Unable to get resource from repository maven-csharp (http://maven-csharp.javaforge.com/repo)
Downloading: http://cvs.apache.org/repository/org.springframework/poms/spring-1.2.8.pom
[WARNING] Unable to get resource from repository apache-maven1-snapshot (http://cvs.apache.org/repository)
Downloading: http://www.mortbay.org/maven2/release/org/springframework/spring/1.2.8/spring-1.2.8.pom
[WARNING] Unable to get resource from repository mortbay-repo (http://www.mortbay.org/maven2/release)
Downloading: http://repo1.maven.org/maven2/org/springframework/spring/1.2.8/spring-1.2.8.pom
[WARNING] Unable to get resource from repository central (http://repo1.maven.org/maven2)
[WARNING] POM for 'incubator-activemq:activeio-core:pom:3.0-beta2:compile' is invalid. It
will be ignored for artifact resolution. Reason: Failed to validate POM
[WARNING] POM for 'incubator-activemq:activeio-core:pom:3.0-beta2:compile' is invalid. It
will be ignored for artifact resolution. Reason: Failed to validate POM
[WARNING] POM for 'incubator-activemq:activeio-core:pom:3.0-beta2:compile' is invalid. It
will be ignored for artifact resolution. Reason: Failed to validate POM
[INFO] [compiler:compile]
Compiling 26 source files to /home/continuum/continuum-1.0.2/apps/continuum/work/155/target/classes
[INFO] [resources:testResources]
[INFO] Using default encoding to copy filtered resources.
[WARNING] POM for 'incubator-activemq:activeio-core:pom:3.0-beta2:compile' is invalid. It
will be ignored for artifact resolution. Reason: Failed to validate POM
[WARNING] POM for 'incubator-activemq:activeio-core:pom:3.0-beta2:compile' is invalid. It
will be ignored for artifact resolution. Reason: Failed to validate POM
[WARNING] POM for 'incubator-activemq:activeio-core:pom:3.0-beta2:compile' is invalid. It
will be ignored for artifact resolution. Reason: Failed to validate POM
[INFO] [compiler:testCompile]
Compiling 7 source files to /home/continuum/continuum-1.0.2/apps/continuum/work/155/target/test-classes
[INFO] ------------------------------------------------------------------------
[ERROR] BUILD FAILURE
[INFO] ------------------------------------------------------------------------
[INFO] Compilation failure

/home/continuum/continuum-1.0.2/apps/continuum/work/155/src/test/java/org/apache/activemq/transport/xstream/XStreamWireFormatTest.java:[21,35]
cannot resolve symbol
symbol  : class MessageTest 
location: package command

/home/continuum/continuum-1.0.2/apps/continuum/work/155/src/test/java/org/apache/activemq/transport/xstream/XStreamWireFormatTest.java:[30,43]
cannot resolve symbol
symbol  : class MessageTest 
location: class org.apache.activemq.transport.xstream.XStreamWireFormatTest

/home/continuum/continuum-1.0.2/apps/continuum/work/155/src/test/java/org/apache/activemq/transport/http/HttpJmsSendAndReceiveTest.java:[21,32]
package org.apache.activemq.test does not exist

/home/continuum/continuum-1.0.2/apps/continuum/work/155/src/test/java/org/apache/activemq/transport/http/HttpJmsSendAndReceiveTest.java:[26,47]
cannot resolve symbol
symbol  : class JmsTopicSendReceiveWithTwoConnectionsTest 
location: class org.apache.activemq.transport.http.HttpJmsSendAndReceiveTest

/home/continuum/continuum-1.0.2/apps/continuum/work/155/src/test/java/org/apache/activemq/transport/http/HttpJmsDurableTopicSendReceiveTest.java:[19,27]
cannot resolve symbol
symbol  : class JmsDurableTopicSendReceiveTest 
location: package activemq

/home/continuum/continuum-1.0.2/apps/continuum/work/155/src/test/java/org/apache/activemq/transport/http/HttpJmsDurableTopicSendReceiveTest.java:[23,56]
cannot resolve symbol
symbol  : class JmsDurableTopicSendReceiveTest 
location: class org.apache.activemq.transport.http.HttpJmsDurableTopicSendReceiveTest

/home/continuum/continuum-1.0.2/apps/continuum/work/155/src/test/java/org/apache/activemq/transport/http/HttpTransportBrokerTest.java:[19,37]
cannot resolve symbol
symbol  : class TransportBrokerTestSupport 
location: package transport

/home/continuum/continuum-1.0.2/apps/continuum/work/155/src/test/java/org/apache/activemq/transport/http/HttpTransportBrokerTest.java:[24,45]
cannot resolve symbol
symbol  : class TransportBrokerTestSupport 
location: class org.apache.activemq.transport.http.HttpTransportBrokerTest

/home/continuum/continuum-1.0.2/apps/continuum/work/155/src/test/java/org/apache/activemq/transport/xstream/XStreamWireFormatTest.java:[34,8]
cannot resolve symbol
symbol  : variable super 
location: class org.apache.activemq.transport.xstream.XStreamWireFormatTest

/home/continuum/continuum-1.0.2/apps/continuum/work/155/src/test/java/org/apache/activemq/transport/xstream/XStreamWireFormatTest.java:[42,35]
cannot resolve symbol
symbol  : variable wireFormat 
location: class org.apache.activemq.transport.xstream.XStreamWireFormatTest

/home/continuum/continuum-1.0.2/apps/continuum/work/155/src/test/java/org/apache/activemq/transport/http/HttpJmsSendAndReceiveTest.java:[34,8]
cannot resolve symbol
symbol  : variable super 
location: class org.apache.activemq.transport.http.HttpJmsSendAndReceiveTest

/home/continuum/continuum-1.0.2/apps/continuum/work/155/src/test/java/org/apache/activemq/transport/http/HttpJmsSendAndReceiveTest.java:[38,8]
cannot resolve symbol
symbol  : variable super 
location: class org.apache.activemq.transport.http.HttpJmsSendAndReceiveTest

/home/continuum/continuum-1.0.2/apps/continuum/work/155/src/test/java/org/apache/activemq/transport/http/HttpJmsDurableTopicSendReceiveTest.java:[31,8]
cannot resolve symbol
symbol  : variable super 
location: class org.apache.activemq.transport.http.HttpJmsDurableTopicSendReceiveTest

/home/continuum/continuum-1.0.2/apps/continuum/work/155/src/test/java/org/apache/activemq/transport/http/HttpJmsDurableTopicSendReceiveTest.java:[35,8]
cannot resolve symbol
symbol  : variable super 
location: class org.apache.activemq.transport.http.HttpJmsDurableTopicSendReceiveTest

/home/continuum/continuum-1.0.2/apps/continuum/work/155/src/test/java/org/apache/activemq/transport/http/HttpTransportBrokerTest.java:[31,8]
cannot resolve symbol
symbol  : variable MAX_WAIT 
location: class org.apache.activemq.transport.http.HttpTransportBrokerTest

/home/continuum/continuum-1.0.2/apps/continuum/work/155/src/test/java/org/apache/activemq/transport/http/HttpTransportBrokerTest.java:[32,8]
cannot resolve symbol
symbol  : variable super 
location: class org.apache.activemq.transport.http.HttpTransportBrokerTest

/home/continuum/continuum-1.0.2/apps/continuum/work/155/src/test/java/org/apache/activemq/transport/http/HttpTransportBrokerTest.java:[36,8]
cannot resolve symbol
symbol  : variable super 
location: class org.apache.activemq.transport.http.HttpTransportBrokerTest

/home/continuum/continuum-1.0.2/apps/continuum/work/155/src/test/java/org/apache/activemq/transport/http/HttpTransportBrokerTest.java:[42,15]
suite() in org.apache.activemq.transport.http.HttpTransportBrokerTest cannot be applied to
(java.lang.Class)

/home/continuum/continuum-1.0.2/apps/continuum/work/155/src/test/java/org/apache/activemq/transport/https/HttpsTransportBrokerTest.java:[44,15]
cannot resolve symbol
symbol  : method suite (java.lang.Class)
location: class org.apache.activemq.transport.https.HttpsTransportBrokerTest

/home/continuum/continuum-1.0.2/apps/continuum/work/155/src/test/java/org/apache/activemq/transport/http/HttpPersistentSendAndReceiveTest.java:[27,8]
cannot resolve symbol
symbol  : variable topic 
location: class org.apache.activemq.transport.http.HttpPersistentSendAndReceiveTest

/home/continuum/continuum-1.0.2/apps/continuum/work/155/src/test/java/org/apache/activemq/transport/http/HttpPersistentSendAndReceiveTest.java:[28,8]
cannot resolve symbol
symbol  : variable deliveryMode 
location: class org.apache.activemq.transport.http.HttpPersistentSendAndReceiveTest


[INFO] ------------------------------------------------------------------------
[INFO] For more information, run Maven with the -e switch
[INFO] ------------------------------------------------------------------------
[INFO] Total time: 5 seconds
[INFO] Finished at: Wed Jun 07 01:05:09 PDT 2006
[INFO] Final Memory: 5M/14M
[INFO] ------------------------------------------------------------------------

****************************************************************************



Mime
View raw message