activemq-commits mailing list archives

Site index · List index
Message view « Date » · « Thread »
Top « Date » · « Thread »
From continuum <contin...@stan.gbuild.org>
Subject [continuum] BUILD FAILURE: ActiveMQ :: Web
Date Sat, 10 Jun 2006 12:53:04 GMT
Online report : http://ci.gbuild.org/continuum/servlet/continuum/target/ProjectBuild.vm/view/ProjectBuild/id/153/buildId/3887
Build statistics:
  State: Failed
  Previous State: Failed
  Started at: Sat, 10 Jun 2006 05:52:50 -0700
  Finished at: Sat, 10 Jun 2006 05:52:58 -0700
  Total time: 8s
  Build Trigger: Forced
  Exit code: 1
  Building machine hostname: stan.gbuild.org
  Operating system : Linux(unknown)
  Java version : 1.4.2_08(Sun Microsystems Inc.)

Changes
      No files changed
  
****************************************************************************
Output:
****************************************************************************
[INFO] Scanning for projects...
[INFO] ----------------------------------------------------------------------------
[INFO] Building ActiveMQ :: Web
[INFO]    task-segment: [clean, install]
[INFO] ----------------------------------------------------------------------------
[INFO] [clean:clean]
[INFO] Deleting directory /home/continuum/continuum-1.0.2/apps/continuum/work/153/target
[INFO] Deleting directory /home/continuum/continuum-1.0.2/apps/continuum/work/153/target/classes
[INFO] Deleting directory /home/continuum/continuum-1.0.2/apps/continuum/work/153/target/test-classes
[INFO] [resources:resources]
[INFO] Using default encoding to copy filtered resources.
[INFO] [compiler:compile]
Compiling 15 source files to /home/continuum/continuum-1.0.2/apps/continuum/work/153/target/classes
[INFO] [resources:testResources]
[INFO] Using default encoding to copy filtered resources.
[INFO] [compiler:testCompile]
Compiling 1 source file to /home/continuum/continuum-1.0.2/apps/continuum/work/153/target/test-classes
[INFO] ------------------------------------------------------------------------
[ERROR] BUILD FAILURE
[INFO] ------------------------------------------------------------------------
[INFO] Compilation failure

/home/continuum/continuum-1.0.2/apps/continuum/work/153/src/test/java/org/apache/activemq/web/JettyServer.java:[21,32]
package org.apache.activemq.demo does not exist

/home/continuum/continuum-1.0.2/apps/continuum/work/153/src/test/java/org/apache/activemq/web/JettyServer.java:[53,8]
cannot resolve symbol
symbol  : variable DefaultQueueSender 
location: class org.apache.activemq.web.JettyServer


[INFO] ------------------------------------------------------------------------
[INFO] For more information, run Maven with the -e switch
[INFO] ------------------------------------------------------------------------
[INFO] Total time: 5 seconds
[INFO] Finished at: Sat Jun 10 05:52:58 PDT 2006
[INFO] Final Memory: 5M/17M
[INFO] ------------------------------------------------------------------------

****************************************************************************



Mime
View raw message