activemq-commits mailing list archives

Site index · List index
Message view « Date » · « Thread »
Top « Date » · « Thread »
From continuum <contin...@stan.gbuild.org>
Subject [continuum] BUILD FAILURE: ActiveMQ :: Web
Date Wed, 07 Jun 2006 08:03:15 GMT
Online report : http://ci.gbuild.org/continuum/servlet/continuum/target/ProjectBuild.vm/view/ProjectBuild/id/153/buildId/3796
Build statistics:
  State: Failed
  Previous Build: No previous build.
  Started at: Wed, 7 Jun 2006 01:02:38 -0700
  Finished at: Wed, 7 Jun 2006 01:03:09 -0700
  Total time: 30s
  Build Trigger: Schedule
  Exit code: 1
  Building machine hostname: stan.gbuild.org
  Operating system : Linux(unknown)
  Java version : 1.4.2_08(Sun Microsystems Inc.)

Changes
      No files changed
  
****************************************************************************
Output:
****************************************************************************
[INFO] Scanning for projects...
[INFO] ----------------------------------------------------------------------------
[INFO] Building ActiveMQ :: Web
[INFO]    task-segment: [clean, install]
[INFO] ----------------------------------------------------------------------------
[INFO] [clean:clean]
[INFO] [resources:resources]
[INFO] Using default encoding to copy filtered resources.
Downloading: http://snapshots.maven.codehaus.org/maven2/rome/rome/0.8/rome-0.8.pom
[WARNING] Unable to get resource from repository codehaus-snapshot (http://snapshots.maven.codehaus.org/maven2)
Downloading: http://maven-csharp.javaforge.com/repo/rome/rome/0.8/rome-0.8.pom
0b downloaded
[WARNING] *** CHECKSUM FAILED - Invalid checksum file - RETRYING
Downloading: http://maven-csharp.javaforge.com/repo/rome/rome/0.8/rome-0.8.pom
0b downloaded
[WARNING] *** CHECKSUM FAILED - Invalid checksum file - IGNORING
[WARNING] Unable to get resource from repository maven-csharp (http://maven-csharp.javaforge.com/repo)
Downloading: http://cvs.apache.org/repository/rome/poms/rome-0.8.pom
[WARNING] Unable to get resource from repository apache-maven1-snapshot (http://cvs.apache.org/repository)
Downloading: http://www.mortbay.org/maven2/release/rome/rome/0.8/rome-0.8.pom
[WARNING] Unable to get resource from repository mortbay-repo (http://www.mortbay.org/maven2/release)
Downloading: http://repo1.maven.org/maven2/rome/rome/0.8/rome-0.8.pom
3K downloaded
Downloading: http://snapshots.maven.codehaus.org/maven2/jdom/jdom/1.0/jdom-1.0.pom
[WARNING] Unable to get resource from repository codehaus-snapshot (http://snapshots.maven.codehaus.org/maven2)
Downloading: http://maven-csharp.javaforge.com/repo/jdom/jdom/1.0/jdom-1.0.pom
0b downloaded
[WARNING] *** CHECKSUM FAILED - Invalid checksum file - RETRYING
Downloading: http://maven-csharp.javaforge.com/repo/jdom/jdom/1.0/jdom-1.0.pom
0b downloaded
[WARNING] *** CHECKSUM FAILED - Invalid checksum file - IGNORING
[WARNING] Unable to get resource from repository maven-csharp (http://maven-csharp.javaforge.com/repo)
Downloading: http://cvs.apache.org/repository/jdom/poms/jdom-1.0.pom
[WARNING] Unable to get resource from repository apache-maven1-snapshot (http://cvs.apache.org/repository)
Downloading: http://www.mortbay.org/maven2/release/jdom/jdom/1.0/jdom-1.0.pom
[WARNING] Unable to get resource from repository mortbay-repo (http://www.mortbay.org/maven2/release)
Downloading: http://repo1.maven.org/maven2/jdom/jdom/1.0/jdom-1.0.pom
1K downloaded
[WARNING] POM for 'incubator-activemq:activeio-core:pom:3.0-beta2:test' is invalid. It will
be ignored for artifact resolution. Reason: Failed to validate POM
Downloading: http://snapshots.maven.codehaus.org/maven2/org/mortbay/jetty/jetty-util/6.0.0beta17/jetty-util-6.0.0beta17.pom
[WARNING] Unable to get resource from repository codehaus-snapshot (http://snapshots.maven.codehaus.org/maven2)
Downloading: http://maven-csharp.javaforge.com/repo/org/mortbay/jetty/jetty-util/6.0.0beta17/jetty-util-6.0.0beta17.pom
0b downloaded
[WARNING] *** CHECKSUM FAILED - Invalid checksum file - RETRYING
Downloading: http://maven-csharp.javaforge.com/repo/org/mortbay/jetty/jetty-util/6.0.0beta17/jetty-util-6.0.0beta17.pom
0b downloaded
[WARNING] *** CHECKSUM FAILED - Invalid checksum file - IGNORING
[WARNING] Unable to get resource from repository maven-csharp (http://maven-csharp.javaforge.com/repo)
Downloading: http://cvs.apache.org/repository/org.mortbay.jetty/poms/jetty-util-6.0.0beta17.pom
[WARNING] Unable to get resource from repository apache-maven1-snapshot (http://cvs.apache.org/repository)
Downloading: http://www.mortbay.org/maven2/release/org/mortbay/jetty/jetty-util/6.0.0beta17/jetty-util-6.0.0beta17.pom
2K downloaded
Downloading: http://snapshots.maven.codehaus.org/maven2/org/mortbay/jetty/project/6.0.0beta17/project-6.0.0beta17.pom
[WARNING] Unable to get resource from repository codehaus-snapshot (http://snapshots.maven.codehaus.org/maven2)
Downloading: http://maven-csharp.javaforge.com/repo/org/mortbay/jetty/project/6.0.0beta17/project-6.0.0beta17.pom
0b downloaded
[WARNING] *** CHECKSUM FAILED - Invalid checksum file - RETRYING
Downloading: http://maven-csharp.javaforge.com/repo/org/mortbay/jetty/project/6.0.0beta17/project-6.0.0beta17.pom
0b downloaded
[WARNING] *** CHECKSUM FAILED - Invalid checksum file - IGNORING
[WARNING] Unable to get resource from repository maven-csharp (http://maven-csharp.javaforge.com/repo)
Downloading: http://cvs.apache.org/repository/org.mortbay.jetty/poms/project-6.0.0beta17.pom
[WARNING] Unable to get resource from repository apache-maven1-snapshot (http://cvs.apache.org/repository)
Downloading: http://www.mortbay.org/maven2/release/org/mortbay/jetty/project/6.0.0beta17/project-6.0.0beta17.pom
9K downloaded
[WARNING] POM for 'incubator-activemq:activeio-core:pom:3.0-beta2:compile' is invalid. It
will be ignored for artifact resolution. Reason: Failed to validate POM
Downloading: http://snapshots.maven.codehaus.org/maven2/org/mortbay/jetty/servlet-api-2.5/6.0.0beta17/servlet-api-2.5-6.0.0beta17.pom
[WARNING] Unable to get resource from repository codehaus-snapshot (http://snapshots.maven.codehaus.org/maven2)
Downloading: http://maven-csharp.javaforge.com/repo/org/mortbay/jetty/servlet-api-2.5/6.0.0beta17/servlet-api-2.5-6.0.0beta17.pom
0b downloaded
[WARNING] *** CHECKSUM FAILED - Invalid checksum file - RETRYING
Downloading: http://maven-csharp.javaforge.com/repo/org/mortbay/jetty/servlet-api-2.5/6.0.0beta17/servlet-api-2.5-6.0.0beta17.pom
0b downloaded
[WARNING] *** CHECKSUM FAILED - Invalid checksum file - IGNORING
[WARNING] Unable to get resource from repository maven-csharp (http://maven-csharp.javaforge.com/repo)
Downloading: http://cvs.apache.org/repository/org.mortbay.jetty/poms/servlet-api-2.5-6.0.0beta17.pom
[WARNING] Unable to get resource from repository apache-maven1-snapshot (http://cvs.apache.org/repository)
Downloading: http://www.mortbay.org/maven2/release/org/mortbay/jetty/servlet-api-2.5/6.0.0beta17/servlet-api-2.5-6.0.0beta17.pom
2K downloaded
Downloading: http://snapshots.maven.codehaus.org/maven2/org/mortbay/jetty/jetty/6.0.0beta17/jetty-6.0.0beta17.pom
[WARNING] Unable to get resource from repository codehaus-snapshot (http://snapshots.maven.codehaus.org/maven2)
Downloading: http://maven-csharp.javaforge.com/repo/org/mortbay/jetty/jetty/6.0.0beta17/jetty-6.0.0beta17.pom
0b downloaded
[WARNING] *** CHECKSUM FAILED - Invalid checksum file - RETRYING
Downloading: http://maven-csharp.javaforge.com/repo/org/mortbay/jetty/jetty/6.0.0beta17/jetty-6.0.0beta17.pom
0b downloaded
[WARNING] *** CHECKSUM FAILED - Invalid checksum file - IGNORING
[WARNING] Unable to get resource from repository maven-csharp (http://maven-csharp.javaforge.com/repo)
Downloading: http://cvs.apache.org/repository/org.mortbay.jetty/poms/jetty-6.0.0beta17.pom
[WARNING] Unable to get resource from repository apache-maven1-snapshot (http://cvs.apache.org/repository)
Downloading: http://www.mortbay.org/maven2/release/org/mortbay/jetty/jetty/6.0.0beta17/jetty-6.0.0beta17.pom
2K downloaded
Downloading: http://snapshots.maven.codehaus.org/maven2/org/mortbay/jetty/servlet-api-2.5/6.0.0beta17/servlet-api-2.5-6.0.0beta17.jar
[WARNING] Unable to get resource from repository codehaus-snapshot (http://snapshots.maven.codehaus.org/maven2)
Downloading: http://maven-csharp.javaforge.com/repo/org/mortbay/jetty/servlet-api-2.5/6.0.0beta17/servlet-api-2.5-6.0.0beta17.jar
0b downloaded
[WARNING] *** CHECKSUM FAILED - Invalid checksum file - RETRYING
Downloading: http://maven-csharp.javaforge.com/repo/org/mortbay/jetty/servlet-api-2.5/6.0.0beta17/servlet-api-2.5-6.0.0beta17.jar
0b downloaded
[WARNING] *** CHECKSUM FAILED - Invalid checksum file - IGNORING
[WARNING] Unable to get resource from repository maven-csharp (http://maven-csharp.javaforge.com/repo)
Downloading: http://cvs.apache.org/repository/org.mortbay.jetty/jars/servlet-api-2.5-6.0.0beta17.jar
[WARNING] Unable to get resource from repository apache-maven1-snapshot (http://cvs.apache.org/repository)
Downloading: http://www.mortbay.org/maven2/release/org/mortbay/jetty/servlet-api-2.5/6.0.0beta17/servlet-api-2.5-6.0.0beta17.jar
130K downloaded
Downloading: http://snapshots.maven.codehaus.org/maven2/jdom/jdom/1.0/jdom-1.0.jar
[WARNING] Unable to get resource from repository codehaus-snapshot (http://snapshots.maven.codehaus.org/maven2)
Downloading: http://maven-csharp.javaforge.com/repo/jdom/jdom/1.0/jdom-1.0.jar
0b downloaded
[WARNING] *** CHECKSUM FAILED - Invalid checksum file - RETRYING
Downloading: http://maven-csharp.javaforge.com/repo/jdom/jdom/1.0/jdom-1.0.jar
0b downloaded
[WARNING] *** CHECKSUM FAILED - Invalid checksum file - IGNORING
[WARNING] Unable to get resource from repository maven-csharp (http://maven-csharp.javaforge.com/repo)
Downloading: http://cvs.apache.org/repository/jdom/jars/jdom-1.0.jar
[WARNING] Unable to get resource from repository apache-maven1-snapshot (http://cvs.apache.org/repository)
Downloading: http://www.mortbay.org/maven2/release/jdom/jdom/1.0/jdom-1.0.jar
[WARNING] Unable to get resource from repository mortbay-repo (http://www.mortbay.org/maven2/release)
Downloading: http://repo1.maven.org/maven2/jdom/jdom/1.0/jdom-1.0.jar
149K downloaded
Downloading: http://snapshots.maven.codehaus.org/maven2/org/mortbay/jetty/jetty-util/6.0.0beta17/jetty-util-6.0.0beta17.jar
[WARNING] Unable to get resource from repository codehaus-snapshot (http://snapshots.maven.codehaus.org/maven2)
Downloading: http://maven-csharp.javaforge.com/repo/org/mortbay/jetty/jetty-util/6.0.0beta17/jetty-util-6.0.0beta17.jar
0b downloaded
[WARNING] *** CHECKSUM FAILED - Invalid checksum file - RETRYING
Downloading: http://maven-csharp.javaforge.com/repo/org/mortbay/jetty/jetty-util/6.0.0beta17/jetty-util-6.0.0beta17.jar
0b downloaded
[WARNING] *** CHECKSUM FAILED - Invalid checksum file - IGNORING
[WARNING] Unable to get resource from repository maven-csharp (http://maven-csharp.javaforge.com/repo)
Downloading: http://cvs.apache.org/repository/org.mortbay.jetty/jars/jetty-util-6.0.0beta17.jar
[WARNING] Unable to get resource from repository apache-maven1-snapshot (http://cvs.apache.org/repository)
Downloading: http://www.mortbay.org/maven2/release/org/mortbay/jetty/jetty-util/6.0.0beta17/jetty-util-6.0.0beta17.jar
64K downloaded
Downloading: http://snapshots.maven.codehaus.org/maven2/rome/rome/0.8/rome-0.8.jar
[WARNING] Unable to get resource from repository codehaus-snapshot (http://snapshots.maven.codehaus.org/maven2)
Downloading: http://maven-csharp.javaforge.com/repo/rome/rome/0.8/rome-0.8.jar
0b downloaded
[WARNING] *** CHECKSUM FAILED - Invalid checksum file - RETRYING
Downloading: http://maven-csharp.javaforge.com/repo/rome/rome/0.8/rome-0.8.jar
0b downloaded
[WARNING] *** CHECKSUM FAILED - Invalid checksum file - IGNORING
[WARNING] Unable to get resource from repository maven-csharp (http://maven-csharp.javaforge.com/repo)
Downloading: http://cvs.apache.org/repository/rome/jars/rome-0.8.jar
[WARNING] Unable to get resource from repository apache-maven1-snapshot (http://cvs.apache.org/repository)
Downloading: http://www.mortbay.org/maven2/release/rome/rome/0.8/rome-0.8.jar
[WARNING] Unable to get resource from repository mortbay-repo (http://www.mortbay.org/maven2/release)
Downloading: http://repo1.maven.org/maven2/rome/rome/0.8/rome-0.8.jar
192K downloaded
[INFO] [compiler:compile]
Compiling 15 source files to /home/continuum/continuum-1.0.2/apps/continuum/work/153/target/classes
[INFO] [resources:testResources]
[INFO] Using default encoding to copy filtered resources.
[WARNING] POM for 'incubator-activemq:activeio-core:pom:3.0-beta2:test' is invalid. It will
be ignored for artifact resolution. Reason: Failed to validate POM
[WARNING] POM for 'incubator-activemq:activeio-core:pom:3.0-beta2:compile' is invalid. It
will be ignored for artifact resolution. Reason: Failed to validate POM
Downloading: http://snapshots.maven.codehaus.org/maven2/org/mortbay/jetty/jetty/6.0.0beta17/jetty-6.0.0beta17.jar
[WARNING] Unable to get resource from repository codehaus-snapshot (http://snapshots.maven.codehaus.org/maven2)
Downloading: http://maven-csharp.javaforge.com/repo/org/mortbay/jetty/jetty/6.0.0beta17/jetty-6.0.0beta17.jar
0b downloaded
[WARNING] *** CHECKSUM FAILED - Invalid checksum file - RETRYING
Downloading: http://maven-csharp.javaforge.com/repo/org/mortbay/jetty/jetty/6.0.0beta17/jetty-6.0.0beta17.jar
0b downloaded
[WARNING] *** CHECKSUM FAILED - Invalid checksum file - IGNORING
[WARNING] Unable to get resource from repository maven-csharp (http://maven-csharp.javaforge.com/repo)
Downloading: http://cvs.apache.org/repository/org.mortbay.jetty/jars/jetty-6.0.0beta17.jar
[WARNING] Unable to get resource from repository apache-maven1-snapshot (http://cvs.apache.org/repository)
Downloading: http://www.mortbay.org/maven2/release/org/mortbay/jetty/jetty/6.0.0beta17/jetty-6.0.0beta17.jar
429K downloaded
Downloading: http://cvs.apache.org/repository/incubator-activemq/jars/activemq-core-4.1-SNAPSHOT-tests.jar
44K downloaded
[INFO] [compiler:testCompile]
Compiling 1 source file to /home/continuum/continuum-1.0.2/apps/continuum/work/153/target/test-classes
[INFO] ------------------------------------------------------------------------
[ERROR] BUILD FAILURE
[INFO] ------------------------------------------------------------------------
[INFO] Compilation failure

/home/continuum/continuum-1.0.2/apps/continuum/work/153/src/test/java/org/apache/activemq/web/JettyServer.java:[21,32]
package org.apache.activemq.demo does not exist

/home/continuum/continuum-1.0.2/apps/continuum/work/153/src/test/java/org/apache/activemq/web/JettyServer.java:[53,8]
cannot resolve symbol
symbol  : variable DefaultQueueSender 
location: class org.apache.activemq.web.JettyServer


[INFO] ------------------------------------------------------------------------
[INFO] For more information, run Maven with the -e switch
[INFO] ------------------------------------------------------------------------
[INFO] Total time: 28 seconds
[INFO] Finished at: Wed Jun 07 01:03:09 PDT 2006
[INFO] Final Memory: 5M/12M
[INFO] ------------------------------------------------------------------------

****************************************************************************



Mime
View raw message