activemq-commits mailing list archives

Site index · List index
Message view « Date » · « Thread »
Top « Date » · « Thread »
From continuum <contin...@stan.gbuild.org>
Subject [continuum] BUILD SUCCESSFUL: ActiveMQ :: JAAS
Date Wed, 07 Jun 2006 08:01:01 GMT
Online report : http://ci.gbuild.org/continuum/servlet/continuum/target/ProjectBuild.vm/view/ProjectBuild/id/148/buildId/3793
Build statistics:
  State: Ok
  Previous Build: No previous build.
  Started at: Wed, 7 Jun 2006 01:00:45 -0700
  Finished at: Wed, 7 Jun 2006 01:00:54 -0700
  Total time: 8s
  Build Trigger: Schedule
  Exit code: 0
  Building machine hostname: stan.gbuild.org
  Operating system : Linux(unknown)
  Java version : 1.4.2_08(Sun Microsystems Inc.)

Changes
      No files changed
  
****************************************************************************
Output:
****************************************************************************
[INFO] Scanning for projects...
[INFO] ----------------------------------------------------------------------------
[INFO] Building ActiveMQ :: JAAS
[INFO]    task-segment: [clean, install]
[INFO] ----------------------------------------------------------------------------
[INFO] [clean:clean]
[INFO] artifact org.apache.maven.plugins:maven-resources-plugin: checking for updates from
maven-csharp-plugins
[WARNING] *** CHECKSUM FAILED - Invalid checksum file - RETRYING
[WARNING] *** CHECKSUM FAILED - Invalid checksum file - IGNORING
[INFO] artifact org.apache.maven.plugins:maven-resources-plugin: checking for updates from
mortbay-repo
[INFO] artifact org.apache.maven.plugins:maven-jar-plugin: checking for updates from maven-csharp-plugins
[WARNING] *** CHECKSUM FAILED - Invalid checksum file - RETRYING
[WARNING] *** CHECKSUM FAILED - Invalid checksum file - IGNORING
[INFO] artifact org.apache.maven.plugins:maven-jar-plugin: checking for updates from mortbay-repo
[INFO] [resources:resources]
[INFO] Using default encoding to copy filtered resources.
[WARNING] POM for 'directory-protocols:kerberos-protocol:pom:0.5:test' is invalid. It will
be ignored for artifact resolution. Reason: Not a v4.0.0 POM.
[WARNING] POM for 'directory-protocols:ldap-protocol:pom:0.9.2:test' is invalid. It will be
ignored for artifact resolution. Reason: Not a v4.0.0 POM.
[WARNING] POM for 'directory-shared:ldap-common:pom:0.9.2:test' is invalid. It will be ignored
for artifact resolution. Reason: Not a v4.0.0 POM.
[WARNING] POM for 'directory:apacheds-shared:pom:0.9.2:test' is invalid. It will be ignored
for artifact resolution. Reason: Not a v4.0.0 POM.
[WARNING] POM for 'directory-asn1:asn1-der:pom:0.3.2:test' is invalid. It will be ignored
for artifact resolution. Reason: Not a v4.0.0 POM.
[WARNING] POM for 'directory-network:mina:pom:0.7.3:test' is invalid. It will be ignored for
artifact resolution. Reason: Not a v4.0.0 POM.
[WARNING] POM for 'directory:apacheds-core:pom:0.9.2:test' is invalid. It will be ignored
for artifact resolution. Reason: Not a v4.0.0 POM.
[WARNING] POM for 'directory-shared:apache-ldapber-provider:pom:0.9.2:test' is invalid. It
will be ignored for artifact resolution. Reason: Not a v4.0.0 POM.
[WARNING] POM for 'directory-asn1:asn1-codec:pom:0.3.2:test' is invalid. It will be ignored
for artifact resolution. Reason: Not a v4.0.0 POM.
[WARNING] POM for 'directory-shared:kerberos-common:pom:0.5:test' is invalid. It will be ignored
for artifact resolution. Reason: Not a v4.0.0 POM.
[INFO] [compiler:compile]
Compiling 4 source files to /home/continuum/continuum-1.0.2/apps/continuum/work/148/target/classes
[INFO] [resources:testResources]
[INFO] Using default encoding to copy filtered resources.
[WARNING] POM for 'directory-protocols:kerberos-protocol:pom:0.5:test' is invalid. It will
be ignored for artifact resolution. Reason: Not a v4.0.0 POM.
[WARNING] POM for 'directory-protocols:ldap-protocol:pom:0.9.2:test' is invalid. It will be
ignored for artifact resolution. Reason: Not a v4.0.0 POM.
[WARNING] POM for 'directory-shared:ldap-common:pom:0.9.2:test' is invalid. It will be ignored
for artifact resolution. Reason: Not a v4.0.0 POM.
[WARNING] POM for 'directory:apacheds-shared:pom:0.9.2:test' is invalid. It will be ignored
for artifact resolution. Reason: Not a v4.0.0 POM.
[WARNING] POM for 'directory-asn1:asn1-der:pom:0.3.2:test' is invalid. It will be ignored
for artifact resolution. Reason: Not a v4.0.0 POM.
[WARNING] POM for 'directory-network:mina:pom:0.7.3:test' is invalid. It will be ignored for
artifact resolution. Reason: Not a v4.0.0 POM.
[WARNING] POM for 'directory:apacheds-core:pom:0.9.2:test' is invalid. It will be ignored
for artifact resolution. Reason: Not a v4.0.0 POM.
[WARNING] POM for 'directory-shared:apache-ldapber-provider:pom:0.9.2:test' is invalid. It
will be ignored for artifact resolution. Reason: Not a v4.0.0 POM.
[WARNING] POM for 'directory-asn1:asn1-codec:pom:0.3.2:test' is invalid. It will be ignored
for artifact resolution. Reason: Not a v4.0.0 POM.
[WARNING] POM for 'directory-shared:kerberos-common:pom:0.5:test' is invalid. It will be ignored
for artifact resolution. Reason: Not a v4.0.0 POM.
[INFO] [compiler:testCompile]
Compiling 7 source files to /home/continuum/continuum-1.0.2/apps/continuum/work/148/target/test-classes
[WARNING] POM for 'directory-protocols:kerberos-protocol:pom:0.5:test' is invalid. It will
be ignored for artifact resolution. Reason: Not a v4.0.0 POM.
[WARNING] POM for 'directory-protocols:ldap-protocol:pom:0.9.2:test' is invalid. It will be
ignored for artifact resolution. Reason: Not a v4.0.0 POM.
[WARNING] POM for 'directory-shared:ldap-common:pom:0.9.2:test' is invalid. It will be ignored
for artifact resolution. Reason: Not a v4.0.0 POM.
[WARNING] POM for 'directory:apacheds-shared:pom:0.9.2:test' is invalid. It will be ignored
for artifact resolution. Reason: Not a v4.0.0 POM.
[WARNING] POM for 'directory-asn1:asn1-der:pom:0.3.2:test' is invalid. It will be ignored
for artifact resolution. Reason: Not a v4.0.0 POM.
[WARNING] POM for 'directory-network:mina:pom:0.7.3:test' is invalid. It will be ignored for
artifact resolution. Reason: Not a v4.0.0 POM.
[WARNING] POM for 'directory:apacheds-core:pom:0.9.2:test' is invalid. It will be ignored
for artifact resolution. Reason: Not a v4.0.0 POM.
[WARNING] POM for 'directory-shared:apache-ldapber-provider:pom:0.9.2:test' is invalid. It
will be ignored for artifact resolution. Reason: Not a v4.0.0 POM.
[WARNING] POM for 'directory-asn1:asn1-codec:pom:0.3.2:test' is invalid. It will be ignored
for artifact resolution. Reason: Not a v4.0.0 POM.
[WARNING] POM for 'directory-shared:kerberos-common:pom:0.5:test' is invalid. It will be ignored
for artifact resolution. Reason: Not a v4.0.0 POM.
[INFO] [surefire:test]
[INFO] Setting reports dir: /home/continuum/continuum-1.0.2/apps/continuum/work/148/target/surefire-reports

-------------------------------------------------------
 T E S T S
-------------------------------------------------------
Path to login config: /home/continuum/continuum-1.0.2/apps/continuum/work/148/target/test-classes/login.config
[surefire] Running org.apache.activemq.jaas.PropertiesLoginModuleTest
[surefire] Tests run: 3, Failures: 0, Errors: 0, Time elapsed: 0.096 sec
[surefire] Running org.apache.activemq.jaas.GroupPrincipalTest
[surefire] Tests run: 3, Failures: 0, Errors: 0, Time elapsed: 0.012 sec
[surefire] Running org.apache.activemq.jaas.UserPrincipalTest
[surefire] Tests run: 3, Failures: 0, Errors: 0, Time elapsed: 0.006 sec
[INFO] [jar:jar]
[INFO] Building jar: /home/continuum/continuum-1.0.2/apps/continuum/work/148/target/activemq-jaas-4.1-SNAPSHOT.jar
[INFO] [install:install]
[INFO] Installing /home/continuum/continuum-1.0.2/apps/continuum/work/148/target/activemq-jaas-4.1-SNAPSHOT.jar
to /home/continuum/.m2/repository/incubator-activemq/activemq-jaas/4.1-SNAPSHOT/activemq-jaas-4.1-SNAPSHOT.jar
[INFO] [maven-one-plugin:install-maven-one-repository {execution: default}]
[INFO] Installing /home/continuum/continuum-1.0.2/apps/continuum/work/148/target/activemq-jaas-4.1-SNAPSHOT.jar
to /home/continuum/.maven/repository/incubator-activemq/jars/activemq-jaas-4.1-SNAPSHOT.jar
[INFO] ------------------------------------------------------------------------
[INFO] BUILD SUCCESSFUL
[INFO] ------------------------------------------------------------------------
[INFO] Total time: 6 seconds
[INFO] Finished at: Wed Jun 07 01:00:54 PDT 2006
[INFO] Final Memory: 5M/11M
[INFO] ------------------------------------------------------------------------

****************************************************************************



Mime
View raw message