activemq-commits mailing list archives

Site index · List index
Message view « Date » · « Thread »
Top « Date » · « Thread »
From continuum <contin...@stan.gbuild.org>
Subject [continuum] BUILD FAILURE: ActiveMQ :: Assembly
Date Mon, 03 Apr 2006 14:46:12 GMT
Online report : http://ci.gbuild.org/continuum/servlet/continuum/target/ProjectBuild.vm/view/ProjectBuild/id/36/buildId/1870
Build statistics:
  State: Failed
  Previous State: Failed
  Started at: Mon, 3 Apr 2006 07:46:09 -0700
  Finished at: Mon, 3 Apr 2006 07:46:11 -0700
  Total time: 1s
  Build Trigger: Forced
  Exit code: 1
  Building machine hostname: stan.gbuild.org
  Operating system : Linux(unknown)
  Java version : 1.4.2_08(Sun Microsystems Inc.)

Changes
      No files changed
  
****************************************************************************
Output:
****************************************************************************
[INFO] Scanning for projects...
[INFO] ----------------------------------------------------------------------------
[ERROR] FATAL ERROR
[INFO] ----------------------------------------------------------------------------
[INFO] Failed to resolve artifact.

GroupId: incubator-activemq
ArtifactId: activemq
Version: 4.0-SNAPSHOT

Reason: Unable to download the artifact from any repository

  incubator-activemq:activemq:pom:4.0-SNAPSHOT

from the specified remote repositories:
  central (http://repo1.maven.org/maven2)


[INFO] ----------------------------------------------------------------------------
[INFO] Trace
org.apache.maven.reactor.MavenExecutionException: POM 'incubator-activemq:activemq' not found
in repository: Unable to download the artifact from any repository

  incubator-activemq:activemq:pom:4.0-SNAPSHOT

from the specified remote repositories:
  central (http://repo1.maven.org/maven2)

	at org.apache.maven.DefaultMaven.getProjects(DefaultMaven.java:365)
	at org.apache.maven.DefaultMaven.doExecute(DefaultMaven.java:278)
	at org.apache.maven.DefaultMaven.execute(DefaultMaven.java:115)
	at org.apache.maven.cli.MavenCli.main(MavenCli.java:249)
	at sun.reflect.NativeMethodAccessorImpl.invoke0(Native Method)
	at sun.reflect.NativeMethodAccessorImpl.invoke(NativeMethodAccessorImpl.java:39)
	at sun.reflect.DelegatingMethodAccessorImpl.invoke(DelegatingMethodAccessorImpl.java:25)
	at java.lang.reflect.Method.invoke(Method.java:324)
	at org.codehaus.classworlds.Launcher.launchEnhanced(Launcher.java:315)
	at org.codehaus.classworlds.Launcher.launch(Launcher.java:255)
	at org.codehaus.classworlds.Launcher.mainWithExitCode(Launcher.java:430)
	at org.codehaus.classworlds.Launcher.main(Launcher.java:375)
Caused by: org.apache.maven.project.ProjectBuildingException: POM 'incubator-activemq:activemq'
not found in repository: Unable to download the artifact from any repository

  incubator-activemq:activemq:pom:4.0-SNAPSHOT

from the specified remote repositories:
  central (http://repo1.maven.org/maven2)

	at org.apache.maven.project.DefaultMavenProjectBuilder.findModelFromRepository(DefaultMavenProjectBuilder.java:429)
	at org.apache.maven.project.DefaultMavenProjectBuilder.assembleLineage(DefaultMavenProjectBuilder.java:986)
	at org.apache.maven.project.DefaultMavenProjectBuilder.build(DefaultMavenProjectBuilder.java:593)
	at org.apache.maven.project.DefaultMavenProjectBuilder.buildFromSourceFile(DefaultMavenProjectBuilder.java:303)
	at org.apache.maven.project.DefaultMavenProjectBuilder.build(DefaultMavenProjectBuilder.java:274)
	at org.apache.maven.DefaultMaven.getProject(DefaultMaven.java:515)
	at org.apache.maven.DefaultMaven.collectProjects(DefaultMaven.java:447)
	at org.apache.maven.DefaultMaven.getProjects(DefaultMaven.java:351)
	... 11 more
Caused by: org.apache.maven.artifact.resolver.ArtifactNotFoundException: Unable to download
the artifact from any repository

  incubator-activemq:activemq:pom:4.0-SNAPSHOT

from the specified remote repositories:
  central (http://repo1.maven.org/maven2)

	at org.apache.maven.artifact.resolver.DefaultArtifactResolver.resolve(DefaultArtifactResolver.java:136)
	at org.apache.maven.artifact.resolver.DefaultArtifactResolver.resolve(DefaultArtifactResolver.java:63)
	at org.apache.maven.project.DefaultMavenProjectBuilder.findModelFromRepository(DefaultMavenProjectBuilder.java:386)
	... 18 more
Caused by: org.apache.maven.wagon.ResourceDoesNotExistException: Unable to download the artifact
from any repository
	at org.apache.maven.artifact.manager.DefaultWagonManager.getArtifact(DefaultWagonManager.java:260)
	at org.apache.maven.artifact.resolver.DefaultArtifactResolver.resolve(DefaultArtifactResolver.java:124)
	... 20 more
[INFO] ----------------------------------------------------------------------------
[INFO] Total time: < 1 second
[INFO] Finished at: Mon Apr 03 07:46:11 PDT 2006
[INFO] Final Memory: 1M/2M
[INFO] ----------------------------------------------------------------------------

****************************************************************************



Mime
View raw message