activemq-commits mailing list archives

Site index · List index
Message view « Date » · « Thread »
Top « Date » · « Thread »
From continuum <contin...@stan.gbuild.org>
Subject [continuum] BUILD FAILURE: ActiveMQ
Date Wed, 29 Mar 2006 09:58:24 GMT
Online report : http://ci.gbuild.org/continuum/servlet/continuum/target/ProjectBuild.vm/view/ProjectBuild/id/29/buildId/1724
Build statistics:
  State: Failed
  Previous State: Failed
  Started at: Wed, 29 Mar 2006 01:58:11 -0800
  Finished at: Wed, 29 Mar 2006 01:58:18 -0800
  Total time: 6s
  Build Trigger: Forced
  Exit code: 1
  Building machine hostname: stan.gbuild.org
  Operating system : Linux(unknown)
  Java version : 1.4.2_08(Sun Microsystems Inc.)

Changes
      No files changed
  
****************************************************************************
Output:
****************************************************************************
[INFO] Scanning for projects...
[INFO] ----------------------------------------------------------------------------
[INFO] Building ActiveMQ
[INFO]    task-segment: [clean, install]
[INFO] ----------------------------------------------------------------------------
[INFO] artifact org.apache.maven.plugins:maven-clean-plugin: checking for updates from maven-csharp-plugins
[WARNING] *** CHECKSUM FAILED - Invalid checksum file - RETRYING
[WARNING] *** CHECKSUM FAILED - Invalid checksum file - IGNORING
[INFO] artifact org.apache.maven.plugins:maven-one-plugin: checking for updates from maven-csharp-plugins
[WARNING] *** CHECKSUM FAILED - Invalid checksum file - RETRYING
[WARNING] *** CHECKSUM FAILED - Invalid checksum file - IGNORING
[INFO] ----------------------------------------------------------------------------
[ERROR] BUILD ERROR
[INFO] ----------------------------------------------------------------------------
[INFO] The plugin 'org.apache.maven.plugins:maven-one-plugin' does not exist or no valid version
could be found
[INFO] ----------------------------------------------------------------------------
[INFO] For more information, run Maven with the -e switch
[INFO] ----------------------------------------------------------------------------
[INFO] Total time: 5 seconds
[INFO] Finished at: Wed Mar 29 01:58:18 PST 2006
[INFO] Final Memory: 1M/4M
[INFO] ----------------------------------------------------------------------------

****************************************************************************



Mime
View raw message