ace-dev mailing list archives

Site index · List index
Message view « Date » · « Thread »
Top « Date » · « Thread »
From Apache Jenkins Server <jenk...@builds.apache.org>
Subject Build failed in Jenkins: ACE-trunk #332
Date Mon, 29 Feb 2016 10:37:41 GMT
See <https://builds.apache.org/job/ACE-trunk/332/changes>

Changes:

[bpouwelse] Ignore some generated files

[bpouwelse] Fixed imports for org.apache.ace.deployment.servlet

------------------------------------------
[...truncated 558 lines...]

:org.apache.ace.verifier:processResources
:org.apache.ace.verifier:classes
:org.apache.ace.verifier:jar
:org.apache.ace.verifier:assemble
:build:compileJava UP-TO-DATE
:build:processResources UP-TO-DATE
:build:classes UP-TO-DATE
:build:jar SKIPPED
:build:assemble UP-TO-DATE
:build:rat
:build:compileTestJava UP-TO-DATE
:build:processTestResources UP-TO-DATE
:build:testClasses UP-TO-DATE
:build:test UP-TO-DATE
:build:check SKIPPED
:cnf:compileJava UP-TO-DATE
:cnf:processResources UP-TO-DATE
:cnf:classes UP-TO-DATE
:cnf:jar SKIPPED
:cnf:assemble UP-TO-DATE
:cnf:compileTestJava UP-TO-DATE
:cnf:processTestResources UP-TO-DATE
:cnf:testClasses UP-TO-DATE
:cnf:test UP-TO-DATE
:cnf:check SKIPPED
:org.apache.ace.agent:compileTestJavaNote: Some input files use unchecked or unsafe operations.
Note: Recompile with -Xlint:unchecked for details.

:org.apache.ace.agent:processTestResources UP-TO-DATE
:org.apache.ace.agent:testClasses
:org.apache.ace.agent:test
:org.apache.ace.agent:check SKIPPED
:org.apache.ace.agent.controller.itest:compileTestJava UP-TO-DATE
:org.apache.ace.agent.controller.itest:processTestResources UP-TO-DATE
:org.apache.ace.agent.controller.itest:testClasses UP-TO-DATE
:org.apache.ace.agent.controller.itest:test UP-TO-DATE
:org.apache.ace.agent.controller.itest:check2016-02-29 10:34:22.521:INFO:oejs.Server:jetty-7.x.y-SNAPSHOT
2016-02-29 10:34:22.563:INFO:oejsh.ContextHandler:started o.e.j.s.ServletContextHandler{/,null}
2016-02-29 10:34:22.597:INFO:oejs.AbstractConnector:Started SelectChannelConnector@0.0.0.0:28080
Custom standalone controller running...
Synchronizing feedback of auditlog with server...
Downloading DEPLOYMENT update (from v0.0.0 to v0.0.2)...
Download progress: 584 bytes read...
Installing DEPLOYMENT update (from v0.0.0 to v0.0.2)...
Custom standalone controller stopped...
Tests run  : 2
Passed     : 2
Errors     : 0
Failures   : 0
No Errors

:org.apache.ace.agent.itest:compileTestJava UP-TO-DATE
:org.apache.ace.agent.itest:processTestResources UP-TO-DATE
:org.apache.ace.agent.itest:testClasses UP-TO-DATE
:org.apache.ace.agent.itest:test UP-TO-DATE
:org.apache.ace.agent.itest:check2016-02-29 10:34:26.374:INFO:oejs.Server:jetty-7.x.y-SNAPSHOT
2016-02-29 10:34:26.419:INFO:oejsh.ContextHandler:started o.e.j.s.ServletContextHandler{/,null}
2016-02-29 10:34:26.452:INFO:oejs.AbstractConnector:Started SelectChannelConnector@0.0.0.0:28080
ERROR: Bundle test.bundle1 [28] Unable to update the bundle. (java.io.EOFException: Unexpected
end of ZLIB input stream)
java.io.EOFException: Unexpected end of ZLIB input stream
	at java.util.zip.InflaterInputStream.fill(InflaterInputStream.java:240)
	at java.util.zip.InflaterInputStream.read(InflaterInputStream.java:158)
	at java.util.zip.ZipInputStream.read(ZipInputStream.java:193)
	at java.util.jar.JarInputStream.read(JarInputStream.java:207)
	at org.apache.felix.deploymentadmin.ContentCopyingJarInputStream.read(ContentCopyingJarInputStream.java:99)
	at java.io.FilterInputStream.read(FilterInputStream.java:107)
	at org.apache.felix.deploymentadmin.NonCloseableStream.read(NonCloseableStream.java:70)
	at org.apache.felix.deploymentadmin.spi.UpdateCommand$BundleInputStream.read(UpdateCommand.java:189)
	at org.apache.felix.framework.cache.BundleCache.copyStreamToFile(BundleCache.java:357)
	at org.apache.felix.framework.cache.JarRevision.initialize(JarRevision.java:170)
	at org.apache.felix.framework.cache.JarRevision.<init>(JarRevision.java:77)
	at org.apache.felix.framework.cache.BundleArchive.createRevisionFromLocation(BundleArchive.java:872)
	at org.apache.felix.framework.cache.BundleArchive.reviseInternal(BundleArchive.java:550)
	at org.apache.felix.framework.cache.BundleArchive.revise(BundleArchive.java:522)
	at org.apache.felix.framework.BundleImpl.revise(BundleImpl.java:1138)
	at org.apache.felix.framework.Felix.updateBundle(Felix.java:2282)
	at org.apache.felix.framework.BundleImpl.update(BundleImpl.java:973)
	at org.apache.felix.deploymentadmin.spi.UpdateCommand.doExecute(UpdateCommand.java:89)
	at org.apache.felix.deploymentadmin.spi.Command.execute(Command.java:55)
	at org.apache.felix.deploymentadmin.spi.DeploymentSessionImpl.call(DeploymentSessionImpl.java:81)
	at org.apache.felix.deploymentadmin.DeploymentAdminImpl.installDeploymentPackage(DeploymentAdminImpl.java:221)
	at org.apache.ace.agent.impl.DeploymentHandlerImpl.install(DeploymentHandlerImpl.java:238)
	at org.apache.ace.agent.impl.DefaultController$DownloadUpdateInstaller.doInstallUpdate(DefaultController.java:89)
	at org.apache.ace.agent.impl.DefaultController$UpdateInstaller.installUpdate(DefaultController.java:253)
	at org.apache.ace.agent.impl.DefaultController.runDeploymentUpdate(DefaultController.java:613)
	at org.apache.ace.agent.impl.DefaultController.run(DefaultController.java:460)
	at org.apache.ace.agent.impl.AgentContextImpl$1.run(AgentContextImpl.java:252)
	at java.util.concurrent.Executors$RunnableAdapter.call(Executors.java:471)
	at java.util.concurrent.FutureTask.run(FutureTask.java:262)
	at java.util.concurrent.ScheduledThreadPoolExecutor$ScheduledFutureTask.access$201(ScheduledThreadPoolExecutor.java:178)
	at java.util.concurrent.ScheduledThreadPoolExecutor$ScheduledFutureTask.run(ScheduledThreadPoolExecutor.java:292)
	at java.util.concurrent.ThreadPoolExecutor.runWorker(ThreadPoolExecutor.java:1145)
	at java.util.concurrent.ThreadPoolExecutor$Worker.run(ThreadPoolExecutor.java:615)
	at java.lang.Thread.run(Thread.java:745)
Tests run  : 22
Passed     : 22
Errors     : 0
Failures   : 0
No Errors

:org.apache.ace.agent.launcher:compileTestJava
:org.apache.ace.agent.launcher:processTestResources
:org.apache.ace.agent.launcher:testClasses
:org.apache.ace.agent.launcher:test
:org.apache.ace.agent.launcher:check SKIPPED
:org.apache.ace.agent.update.itest:compileTestJava UP-TO-DATE
:org.apache.ace.agent.update.itest:processTestResources UP-TO-DATE
:org.apache.ace.agent.update.itest:testClasses UP-TO-DATE
:org.apache.ace.agent.update.itest:test UP-TO-DATE
:org.apache.ace.agent.update.itest:check2016-02-29 10:36:27.759:INFO:oejs.Server:jetty-7.x.y-SNAPSHOT
2016-02-29 10:36:27.787:INFO:oejsh.ContextHandler:started o.e.j.s.ServletContextHandler{/,null}
2016-02-29 10:36:27.824:INFO:oejs.AbstractConnector:Started SelectChannelConnector@0.0.0.0:28080

[INFO] Started Jetty 7.6.13.v20130916 at port(s) HTTP:28080 on context path /
Updating in phase: CORRUPT_STREAM (from v1.0.2 to v1.0.3)...
Updating in phase: BUNDLE_DOES_NOT_RESOLVE (from v1.0.2 to v1.0.3)...
Updating in phase: BUNDLE_DOES_NOT_START (from v1.0.2 to v1.0.3)...
Updating in phase: BUNDLE_WORKS (from v1.0.2 to v1.0.3)...
Tests run  : 1
Passed     : 1
Errors     : 0
Failures   : 0
No Errors
:org.apache.ace.authentication:compileTestJava
:org.apache.ace.authentication:processTestResources UP-TO-DATE
:org.apache.ace.authentication:testClasses
:org.apache.ace.authentication:test
:org.apache.ace.authentication:check SKIPPED
:org.apache.ace.authentication.itest:compileTestJava UP-TO-DATE
:org.apache.ace.authentication.itest:processTestResources UP-TO-DATE
:org.apache.ace.authentication.itest:testClasses UP-TO-DATE
:org.apache.ace.authentication.itest:test UP-TO-DATE
:org.apache.ace.authentication.itest:check2016-02-29 10:36:49.276:INFO::main: Logging initialized
@1391ms
2016-02-29 10:36:49.356:INFO:oejs.Server:main: jetty-9.2.14.v20151106
2016-02-29 10:36:49.443:INFO:oejsh.ContextHandler:main: Started o.e.j.s.ServletContextHandler@284dbb2f{/,null,AVAILABLE}
2016-02-29 10:36:49.443:INFO:oejs.Server:main: Started @1559ms
2016-02-29 10:36:49.478:INFO:oejs.ServerConnector:main: Started ServerConnector@76dbb00d{HTTP/1.1}{0.0.0.0:28080}
Tests run  : 7
Passed     : 7
Errors     : 0
Failures   : 0
No Errors

:org.apache.ace.bnd:compileTestJava UP-TO-DATE
:org.apache.ace.bnd:processTestResources UP-TO-DATE
:org.apache.ace.bnd:testClasses UP-TO-DATE
:org.apache.ace.bnd:test UP-TO-DATE
:org.apache.ace.bnd:check SKIPPED
:org.apache.ace.builder:compileTestJava
:org.apache.ace.builder:processTestResources UP-TO-DATE
:org.apache.ace.builder:testClasses
:org.apache.ace.builder:test
:org.apache.ace.builder:check SKIPPED
:org.apache.ace.client.automation:compileTestJava UP-TO-DATE
:org.apache.ace.client.automation:processTestResources UP-TO-DATE
:org.apache.ace.client.automation:testClasses UP-TO-DATE
:org.apache.ace.client.automation:test UP-TO-DATE
:org.apache.ace.client.automation:check SKIPPED
:org.apache.ace.client.repository:compileTestJava
:org.apache.ace.client.repository:processTestResources
:org.apache.ace.client.repository:testClasses
:org.apache.ace.client.repository:test
:org.apache.ace.client.repository:check SKIPPED
:org.apache.ace.client.repository.itest:compileTestJava UP-TO-DATE
:org.apache.ace.client.repository.itest:processTestResources UP-TO-DATE
:org.apache.ace.client.repository.itest:testClasses UP-TO-DATE
:org.apache.ace.client.repository.itest:test UP-TO-DATE
:org.apache.ace.client.repository.itest:check2016-02-29 10:37:10.067:INFO::main: Logging initialized
@1141ms
2016-02-29 10:37:10.104:INFO:oejs.Server:main: jetty-9.2.14.v20151106
2016-02-29 10:37:10.153:INFO:oejsh.ContextHandler:main: Started o.e.j.s.ServletContextHandler@66159148{/,null,AVAILABLE}
2016-02-29 10:37:10.153:INFO:oejs.Server:main: Started @1228ms
2016-02-29 10:37:10.172:INFO:oejs.ServerConnector:main: Started ServerConnector@44f5df97{HTTP/1.1}{0.0.0.0:28080}

[INFO] Started Jetty 9.2.14.v20151106 at port(s) HTTP:28080 on context path / [minThreads=8,maxThreads=200,acceptors=3,selectors=4]
Waiting for URL http://localhost:28080/obr/index.xml: 404 (want 200)
Waiting for URL http://localhost:28080/obr/index.xml: 404 (want 200)
Tests run  : 20
Passed     : 20
Errors     : 0
Failures   : 0
No Errors
:org.apache.ace.client.rest:compileTestJava
:org.apache.ace.client.rest:processTestResources UP-TO-DATE
:org.apache.ace.client.rest:testClasses
:org.apache.ace.client.rest:test
:org.apache.ace.client.rest:check SKIPPED
:org.apache.ace.client.rest.itest:compileTestJava UP-TO-DATE
:org.apache.ace.client.rest.itest:processTestResources UP-TO-DATE
:org.apache.ace.client.rest.itest:testClasses UP-TO-DATE
:org.apache.ace.client.rest.itest:test UP-TO-DATE
:org.apache.ace.client.rest.itest:check2016-02-29 10:37:28.470:INFO::main: Logging initialized
@1045ms
2016-02-29 10:37:28.507:INFO:oejs.Server:main: jetty-9.2.14.v20151106
2016-02-29 10:37:28.555:INFO:oejsh.ContextHandler:main: Started o.e.j.s.ServletContextHandler@728aedb8{/,null,AVAILABLE}
2016-02-29 10:37:28.556:INFO:oejs.Server:main: Started @1131ms
2016-02-29 10:37:28.573:INFO:oejs.ServerConnector:main: Started ServerConnector@2c306dfe{HTTP/1.1}{0.0.0.0:28080}

[INFO] Started Jetty 9.2.14.v20151106 at port(s) HTTP:28080 on context path / [minThreads=8,maxThreads=200,acceptors=3,selectors=4]
Waiting for URL http://localhost:28080: 404 (want 200)
Waiting for URL http://localhost:28080: 404 (want 200)
Waiting for URL http://localhost:28080: 404 (want 200)
Waiting for URL http://localhost:28080: 404 (want 200)
Waiting for URL http://localhost:28080: 404 (want 200)
Waiting for URL http://localhost:28080: 404 (want 200)
Waiting for URL http://localhost:28080: 404 (want 200)
Waiting for URL http://localhost:28080: 404 (want 200)
Waiting for URL http://localhost:28080: 404 (want 200)
Waiting for URL http://localhost:28080: 404 (want 200)
http://localhost:28080/client/work/rest-22/artifact/artifact-Bundle-SymbolicName-foo.b1-Bundle-Version-1.0.0/
http://localhost:28080/client/work/rest-22/artifact/artifact-Bundle-SymbolicName-foo.b2-Bundle-Version-1.0.0/
http://localhost:28080/client/work/rest-22/artifact/artifact-Bundle-SymbolicName-foo.b3-Bundle-Version-1.0.0/
http://localhost:28080/client/work/rest-22/artifact2feature/artifact2feature-leftEndpoint-%28artifactName%3Dfoo.a1%29-rightEndpoint-%28name%3Dfoo.f1%29-rightCardinality-1-leftCardinality-1/
http://localhost:28080/client/work/rest-22/artifact2feature/artifact2feature-leftEndpoint-%28artifactName%3Dfoo.a2%29-rightEndpoint-%28name%3Dfoo.f2%29-rightCardinality-1-leftCardinality-1/
http://localhost:28080/client/work/rest-22/artifact2feature/artifact2feature-leftEndpoint-%28artifactName%3Dfoo.a3%29-rightEndpoint-%28name%3Dfoo.f3%29-rightCardinality-1-leftCardinality-1/
http://localhost:28080/client/work/rest-22/feature/feature-name-foo.f1/
http://localhost:28080/client/work/rest-22/feature/feature-name-foo.f2/
http://localhost:28080/client/work/rest-22/feature/feature-name-foo.f3/
http://localhost:28080/client/work/rest-22/feature2distribution/feature2distribution-leftEndpoint-%28name%3Dfoo.f1%29-rightEndpoint-%28name%3Dfoo.d1%29-rightCardinality-1-leftCardinality-1/
http://localhost:28080/client/work/rest-22/feature2distribution/feature2distribution-leftEndpoint-%28name%3Dfoo.f2%29-rightEndpoint-%28name%3Dfoo.d1%29-rightCardinality-1-leftCardinality-1/
http://localhost:28080/client/work/rest-22/feature2distribution/feature2distribution-leftEndpoint-%28name%3Dfoo.f3%29-rightEndpoint-%28name%3Dfoo.d1%29-rightCardinality-1-leftCardinality-1/
http://localhost:28080/client/work/rest-22/distribution/distribution-name-foo.d1/
http://localhost:28080/client/work/rest-22/distribution2target/distribution2target-leftEndpoint-%28name%3Dfoo.d1%29-rightEndpoint-%28id%3Dfoo.t1%29-rightCardinality-1-leftCardinality-1/
http://localhost:28080/client/work/rest-22/target/target-id-foo.t1/
Tests run  : 5
Passed     : 4
Errors     : 0
Failures   : 1
1 Error(s)
Error  : Exit code remote process 1: java -cp /x1/jenkins/jenkins-slave/workspace/ACE-trunk/cnf/localrepo/org.apache.felix.framework/org.apache.felix.framework-5.2.0.jar:/x1/jenkins/jenkins-slave/workspace/ACE-trunk/cnf/cache/3.1.0/biz.aQute.launcher/biz.aQute.launcher-3.1.0.jar:/x1/jenkins/jenkins-slave/workspace/ACE-trunk/cnf/cache/3.1.0/biz.aQute.junit/biz.aQute.junit-3.1.0.jar
-ea -Dlauncher.properties="/x1/jenkins/jenkins-slave/workspace/ACE-trunk/org.apache.ace.client.rest.itest/generated/launch5294517927368027148.properties"
-ea aQute.launcher.Launcher
:org.apache.ace.client.rest.itest:check FAILED

FAILURE: Build failed with an exception.

* What went wrong:
Execution failed for task ':org.apache.ace.client.rest.itest:check'.
> Project org.apache.ace.client.rest.itest has errors, one error was reported

* Try:
Run with --stacktrace option to get the stack trace. Run with --info or --debug option to
get more log output.

BUILD FAILED

Total time: 5 mins 11.543 secs
Build step 'Invoke Gradle script' changed build result to FAILURE
Build step 'Invoke Gradle script' marked build as failure
Recording test results
TestNG Reports Processing: START
Looking for TestNG results report in workspace using pattern: **/testng/testng-results.xml
Did not find any matching files.

Mime
View raw message