ace-dev mailing list archives

Site index · List index
Message view « Date » · « Thread »
Top « Date » · « Thread »
From Apache Jenkins Server <jenk...@builds.apache.org>
Subject Build failed in Jenkins: ACE-trunk #176
Date Fri, 29 Nov 2013 13:43:45 GMT
See <https://builds.apache.org/job/ACE-trunk/176/changes>

Changes:

[jawi] Cleanups and simplified test cases.

[jawi] Cleanups and simplified test cases.

------------------------------------------
[...truncated 4770 lines...]
  [bndtest] [INFO] 13:41:52 (controller) Installing deployment update 0.0.0 => 6.0.0...
  [bndtest] [INFO] 13:41:53 (controller) Starting download of deployment update, 0.0.0 =>
4.0.0...
  [bndtest] [INFO] 13:41:53 (controller) 1962 bytes of deployment update downloaded...
  [bndtest] [INFO] 13:41:54 (controller) Installing deployment update 0.0.0 => 4.0.0...
  [bndtest] [ERROR] 13:41:54 (deployment) Stream does not contain a valid deployment package:
missing manifest!
  [bndtest] [WARNING] 13:41:54 (controller) Installation of deployment package failed: Missing
mandatory manifest header!
  [bndtest] org.apache.ace.agent.InstallationFailedException: Installation of deployment package
failed!
  [bndtest] 	at org.apache.ace.agent.impl.DeploymentHandlerImpl.install(Unknown Source)
  [bndtest] 	at org.apache.ace.agent.impl.DefaultController$DownloadUpdateInstaller.doInstallUpdate(Unknown
Source)
  [bndtest] 	at org.apache.ace.agent.impl.DefaultController$UpdateInstaller.installUpdate(Unknown
Source)
  [bndtest] 	at org.apache.ace.agent.impl.DefaultController.runDeploymentUpdate(Unknown Source)
  [bndtest] 	at org.apache.ace.agent.impl.DefaultController.run(Unknown Source)
  [bndtest] 	at java.util.concurrent.Executors$RunnableAdapter.call(Executors.java:441)
  [bndtest] 	at java.util.concurrent.FutureTask$Sync.innerRun(FutureTask.java:303)
  [bndtest] 	at java.util.concurrent.FutureTask.run(FutureTask.java:138)
  [bndtest] 	at java.util.concurrent.ScheduledThreadPoolExecutor$ScheduledFutureTask.access$301(ScheduledThreadPoolExecutor.java:98)
  [bndtest] 	at java.util.concurrent.ScheduledThreadPoolExecutor$ScheduledFutureTask.run(ScheduledThreadPoolExecutor.java:206)
  [bndtest] 	at java.util.concurrent.ThreadPoolExecutor$Worker.runTask(ThreadPoolExecutor.java:886)
  [bndtest] 	at java.util.concurrent.ThreadPoolExecutor$Worker.run(ThreadPoolExecutor.java:908)
  [bndtest] 	at java.lang.Thread.run(Thread.java:662)
  [bndtest] [INFO] 13:41:54 (controller) Cancelling deployment package download for version
4.0.0 because of reset...
  [bndtest] [INFO] 13:41:55 (controller) Starting download of deployment update, 0.0.0 =>
2.0.0...
  [bndtest] [WARNING] 13:41:56 (controller) Sync received retry exception from server. Rescheduled
in 1 seconds
  [bndtest] [INFO] 13:41:57 (controller) Starting download of deployment update, 0.0.0 =>
2.0.0...
  [bndtest] [INFO] 13:41:57 (controller) 1105 bytes of deployment update downloaded...
  [bndtest] [INFO] 13:41:58 (controller) Installing deployment update 0.0.0 => 2.0.0...
  [bndtest] [INFO] 13:42:00 (controller) Starting download of deployment update, 0.0.0 =>
3.0.0...
  [bndtest] [INFO] 13:42:01 (controller) Installing deployment update 0.0.0 => 3.0.0...
  [bndtest] [ERROR] 13:42:01 (deployment) Stream does not contain a valid deployment package:
missing manifest!
  [bndtest] [WARNING] 13:42:01 (controller) Installation of deployment package failed: Missing
mandatory manifest header!
  [bndtest] org.apache.ace.agent.InstallationFailedException: Installation of deployment package
failed!
  [bndtest] 	at org.apache.ace.agent.impl.DeploymentHandlerImpl.install(Unknown Source)
  [bndtest] 	at org.apache.ace.agent.impl.DefaultController$DownloadUpdateInstaller.doInstallUpdate(Unknown
Source)
  [bndtest] 	at org.apache.ace.agent.impl.DefaultController$UpdateInstaller.installUpdate(Unknown
Source)
  [bndtest] 	at org.apache.ace.agent.impl.DefaultController.runDeploymentUpdate(Unknown Source)
  [bndtest] 	at org.apache.ace.agent.impl.DefaultController.run(Unknown Source)
  [bndtest] 	at java.util.concurrent.Executors$RunnableAdapter.call(Executors.java:441)
  [bndtest] 	at java.util.concurrent.FutureTask$Sync.innerRun(FutureTask.java:303)
  [bndtest] 	at java.util.concurrent.FutureTask.run(FutureTask.java:138)
  [bndtest] 	at java.util.concurrent.ScheduledThreadPoolExecutor$ScheduledFutureTask.access$301(ScheduledThreadPoolExecutor.java:98)
  [bndtest] 	at java.util.concurrent.ScheduledThreadPoolExecutor$ScheduledFutureTask.run(ScheduledThreadPoolExecutor.java:206)
  [bndtest] 	at java.util.concurrent.ThreadPoolExecutor$Worker.runTask(ThreadPoolExecutor.java:886)
  [bndtest] 	at java.util.concurrent.ThreadPoolExecutor$Worker.run(ThreadPoolExecutor.java:908)
  [bndtest] 	at java.lang.Thread.run(Thread.java:662)
  [bndtest] [INFO] 13:42:01 (controller) Cancelling deployment package download for version
3.0.0 because of reset...
  [bndtest] [WARNING] 13:42:02 (controller) Sync received retry exception from server. Rescheduled
in 1 seconds
  [bndtest] [INFO] 13:42:03 (controller) Starting download of deployment update, 0.0.0 =>
1.0.0...
  [bndtest] [INFO] 13:42:03 (controller) 1105 bytes of deployment update downloaded...
  [bndtest] [INFO] 13:42:04 (controller) Installing deployment update 0.0.0 => 1.0.0...
  [bndtest] [INFO] 13:42:05 (controller) Installing streaming deployment update 0.0.0 =>
6.0.0
  [bndtest] [INFO] 13:42:06 (controller) Installing streaming deployment update 0.0.0 =>
5.0.0
  [bndtest] [WARNING] 13:42:06 (controller) Installation of deployment package failed: Unknown/other
error condition!
  [bndtest] org.apache.ace.agent.InstallationFailedException: Installation of deployment package
failed!
  [bndtest] 	at org.apache.ace.agent.impl.DeploymentHandlerImpl.install(Unknown Source)
  [bndtest] 	at org.apache.ace.agent.impl.DefaultController$StreamingUpdateInstaller.doInstallUpdate(Unknown
Source)
  [bndtest] 	at org.apache.ace.agent.impl.DefaultController$UpdateInstaller.installUpdate(Unknown
Source)
  [bndtest] 	at org.apache.ace.agent.impl.DefaultController.runDeploymentUpdate(Unknown Source)
  [bndtest] 	at org.apache.ace.agent.impl.DefaultController.run(Unknown Source)
  [bndtest] 	at java.util.concurrent.Executors$RunnableAdapter.call(Executors.java:441)
  [bndtest] 	at java.util.concurrent.FutureTask$Sync.innerRun(FutureTask.java:303)
  [bndtest] 	at java.util.concurrent.FutureTask.run(FutureTask.java:138)
  [bndtest] 	at java.util.concurrent.ScheduledThreadPoolExecutor$ScheduledFutureTask.access$301(ScheduledThreadPoolExecutor.java:98)
  [bndtest] 	at java.util.concurrent.ScheduledThreadPoolExecutor$ScheduledFutureTask.run(ScheduledThreadPoolExecutor.java:206)
  [bndtest] 	at java.util.concurrent.ThreadPoolExecutor$Worker.runTask(ThreadPoolExecutor.java:886)
  [bndtest] 	at java.util.concurrent.ThreadPoolExecutor$Worker.run(ThreadPoolExecutor.java:908)
  [bndtest] 	at java.lang.Thread.run(Thread.java:662)
  [bndtest] Caused by: org.osgi.framework.BundleException: Unable to cache bundle: osgi-dp:test.bundle2
  [bndtest] 	at org.apache.felix.framework.Felix.installBundle(Felix.java:2703)
  [bndtest] 	at org.apache.felix.framework.BundleContextImpl.installBundle(BundleContextImpl.java:165)
  [bndtest] 	at org.apache.felix.deploymentadmin.spi.UpdateCommand.execute(UpdateCommand.java:76)
  [bndtest] 	at org.apache.felix.deploymentadmin.spi.DeploymentSessionImpl.call(DeploymentSessionImpl.java:73)
  [bndtest] 	at org.apache.felix.deploymentadmin.DeploymentAdminImpl.installDeploymentPackage(DeploymentAdminImpl.java:214)
  [bndtest] 	... 13 more
  [bndtest] Caused by: java.io.EOFException: Unexpected end of ZLIB input stream
  [bndtest] 	at java.util.zip.InflaterInputStream.fill(InflaterInputStream.java:223)
  [bndtest] 	at java.util.zip.InflaterInputStream.read(InflaterInputStream.java:141)
  [bndtest] 	at java.util.zip.ZipInputStream.read(ZipInputStream.java:154)
  [bndtest] 	at java.util.jar.JarInputStream.read(JarInputStream.java:195)
  [bndtest] 	at java.io.FilterInputStream.read(FilterInputStream.java:90)
  [bndtest] 	at org.apache.felix.deploymentadmin.NonCloseableStream.read(NonCloseableStream.java:64)
  [bndtest] 	at org.apache.felix.deploymentadmin.spi.UpdateCommand$BundleInputStream.read(UpdateCommand.java:176)
  [bndtest] 	at org.apache.felix.framework.cache.BundleCache.copyStreamToFile(BundleCache.java:357)
  [bndtest] 	at org.apache.felix.framework.cache.JarRevision.initialize(JarRevision.java:170)
  [bndtest] 	at org.apache.felix.framework.cache.JarRevision.<init>(JarRevision.java:77)
  [bndtest] 	at org.apache.felix.framework.cache.BundleArchive.createRevisionFromLocation(BundleArchive.java:872)
  [bndtest] 	at org.apache.felix.framework.cache.BundleArchive.reviseInternal(BundleArchive.java:550)
  [bndtest] 	at org.apache.felix.framework.cache.BundleArchive.<init>(BundleArchive.java:153)
  [bndtest] 	at org.apache.felix.framework.cache.BundleCache.create(BundleCache.java:277)
  [bndtest] 	at org.apache.felix.framework.Felix.installBundle(Felix.java:2699)
  [bndtest] 	... 17 more
  [bndtest] [INFO] 13:42:07 (controller) Installing streaming deployment update 0.0.0 =>
1.0.0
  [bndtest] [INFO] 13:42:08 (controller) Installing streaming deployment update 0.0.0 =>
4.0.0
  [bndtest] [ERROR] 13:42:08 (deployment) Stream does not contain a valid deployment package:
missing manifest!
  [bndtest] [WARNING] 13:42:08 (controller) Installation of deployment package failed: Missing
mandatory manifest header!
  [bndtest] org.apache.ace.agent.InstallationFailedException: Installation of deployment package
failed!
  [bndtest] 	at org.apache.ace.agent.impl.DeploymentHandlerImpl.install(Unknown Source)
  [bndtest] 	at org.apache.ace.agent.impl.DefaultController$StreamingUpdateInstaller.doInstallUpdate(Unknown
Source)
  [bndtest] 	at org.apache.ace.agent.impl.DefaultController$UpdateInstaller.installUpdate(Unknown
Source)
  [bndtest] 	at org.apache.ace.agent.impl.DefaultController.runDeploymentUpdate(Unknown Source)
  [bndtest] 	at org.apache.ace.agent.impl.DefaultController.run(Unknown Source)
  [bndtest] 	at java.util.concurrent.Executors$RunnableAdapter.call(Executors.java:441)
  [bndtest] 	at java.util.concurrent.FutureTask$Sync.innerRun(FutureTask.java:303)
  [bndtest] 	at java.util.concurrent.FutureTask.run(FutureTask.java:138)
  [bndtest] 	at java.util.concurrent.ScheduledThreadPoolExecutor$ScheduledFutureTask.access$301(ScheduledThreadPoolExecutor.java:98)
  [bndtest] 	at java.util.concurrent.ScheduledThreadPoolExecutor$ScheduledFutureTask.run(ScheduledThreadPoolExecutor.java:206)
  [bndtest] 	at java.util.concurrent.ThreadPoolExecutor$Worker.runTask(ThreadPoolExecutor.java:886)
  [bndtest] 	at java.util.concurrent.ThreadPoolExecutor$Worker.run(ThreadPoolExecutor.java:908)
  [bndtest] 	at java.lang.Thread.run(Thread.java:662)
  [bndtest] [INFO] 13:42:09 (controller) Installing streaming deployment update 0.0.0 =>
2.0.0
  [bndtest] [WARNING] 13:42:09 (controller) Sync received retry exception from server. Rescheduled
in 1 seconds
  [bndtest] [INFO] 13:42:10 (controller) Installing streaming deployment update 0.0.0 =>
2.0.0
  [bndtest] [INFO] 13:42:11 (controller) Installing streaming deployment update 0.0.0 =>
3.0.0
  [bndtest] [ERROR] 13:42:11 (deployment) Stream does not contain a valid deployment package:
missing manifest!
  [bndtest] [WARNING] 13:42:11 (controller) Installation of deployment package failed: Missing
mandatory manifest header!
  [bndtest] org.apache.ace.agent.InstallationFailedException: Installation of deployment package
failed!
  [bndtest] 	at org.apache.ace.agent.impl.DeploymentHandlerImpl.install(Unknown Source)
  [bndtest] 	at org.apache.ace.agent.impl.DefaultController$StreamingUpdateInstaller.doInstallUpdate(Unknown
Source)
  [bndtest] 	at org.apache.ace.agent.impl.DefaultController$UpdateInstaller.installUpdate(Unknown
Source)
  [bndtest] 	at org.apache.ace.agent.impl.DefaultController.runDeploymentUpdate(Unknown Source)
  [bndtest] 	at org.apache.ace.agent.impl.DefaultController.run(Unknown Source)
  [bndtest] 	at java.util.concurrent.Executors$RunnableAdapter.call(Executors.java:441)
  [bndtest] 	at java.util.concurrent.FutureTask$Sync.innerRun(FutureTask.java:303)
  [bndtest] 	at java.util.concurrent.FutureTask.run(FutureTask.java:138)
  [bndtest] 	at java.util.concurrent.ScheduledThreadPoolExecutor$ScheduledFutureTask.access$301(ScheduledThreadPoolExecutor.java:98)
  [bndtest] 	at java.util.concurrent.ScheduledThreadPoolExecutor$ScheduledFutureTask.run(ScheduledThreadPoolExecutor.java:206)
  [bndtest] 	at java.util.concurrent.ThreadPoolExecutor$Worker.runTask(ThreadPoolExecutor.java:886)
  [bndtest] 	at java.util.concurrent.ThreadPoolExecutor$Worker.run(ThreadPoolExecutor.java:908)
  [bndtest] 	at java.lang.Thread.run(Thread.java:662)
  [bndtest] [WARNING] 13:42:13 (controller) Sync received retry exception from server. Rescheduled
in 1 seconds
  [bndtest] [INFO] 13:42:14 (controller) Installing streaming deployment update 0.0.0 =>
1.0.0
  [bndtest] [INFO] 13:42:15 (controller) Installing streaming deployment update 0.0.0 =>
1.0.0
  [bndtest] [INFO] 13:42:16 (controller) Installing streaming deployment update 1.0.0 =>
6.0.0
  [bndtest] [ERROR] 13:42:16 (deployment) Stream does not contain a valid deployment package:
missing manifest!
  [bndtest] [WARNING] 13:42:16 (controller) Installation of deployment package failed: Missing
mandatory manifest header!
  [bndtest] org.apache.ace.agent.InstallationFailedException: Installation of deployment package
failed!
  [bndtest] 	at org.apache.ace.agent.impl.DeploymentHandlerImpl.install(Unknown Source)
  [bndtest] 	at org.apache.ace.agent.impl.DefaultController$StreamingUpdateInstaller.doInstallUpdate(Unknown
Source)
  [bndtest] 	at org.apache.ace.agent.impl.DefaultController$UpdateInstaller.installUpdate(Unknown
Source)
  [bndtest] 	at org.apache.ace.agent.impl.DefaultController.runDeploymentUpdate(Unknown Source)
  [bndtest] 	at org.apache.ace.agent.impl.DefaultController.run(Unknown Source)
  [bndtest] 	at java.util.concurrent.Executors$RunnableAdapter.call(Executors.java:441)
  [bndtest] 	at java.util.concurrent.FutureTask$Sync.innerRun(FutureTask.java:303)
  [bndtest] 	at java.util.concurrent.FutureTask.run(FutureTask.java:138)
  [bndtest] 	at java.util.concurrent.ScheduledThreadPoolExecutor$ScheduledFutureTask.access$301(ScheduledThreadPoolExecutor.java:98)
  [bndtest] 	at java.util.concurrent.ScheduledThreadPoolExecutor$ScheduledFutureTask.run(ScheduledThreadPoolExecutor.java:206)
  [bndtest] 	at java.util.concurrent.ThreadPoolExecutor$Worker.runTask(ThreadPoolExecutor.java:886)
  [bndtest] 	at java.util.concurrent.ThreadPoolExecutor$Worker.run(ThreadPoolExecutor.java:908)
  [bndtest] 	at java.lang.Thread.run(Thread.java:662)
  [bndtest] Tests run  : 20
  [bndtest] Passed     : 20
  [bndtest] Errors     : 0
  [bndtest] Failures   : 0
  [bndtest] All tests passed

template.init:
     [echo] Enter project org.apache.ace.agent.controller.itest

init:

dependencies:

compile:

test:
  [bndtest] Testing /zonestorage/hudson_solaris/home/hudson/hudson-slave/workspace/ACE-trunk/org.apache.ace.agent.controller.itest/bnd.bnd
  [bndtest] 2013-11-29 13:42:19.572:INFO:oejs.Server:jetty-7.x.y-SNAPSHOT
  [bndtest] ____________________________
  [bndtest] Welcome to Apache Felix Gogo
  [bndtest] 
  [bndtest] 2013-11-29 13:42:19.606:INFO:oejsh.ContextHandler:started o.e.j.s.ServletContextHandler{/,null}
  [bndtest] 2013-11-29 13:42:19.651:INFO:oejs.AbstractConnector:Started SelectChannelConnector@0.0.0.0:8080
  [bndtest] g! [DEBUG] 13:42:19 (discovery) Config changed: urls: null, checking: null
  [bndtest] [INFO] 13:42:19 (CustomController) Custom controller running...
  [bndtest] [INFO] 13:42:30 (CustomController) Custom controller stopping...
  [bndtest] [DEBUG] 13:42:30 (discovery) Config changed: urls: null, checking: null
  [bndtest] Custom standalone controller running...
  [bndtest] Synchronizing feedback of auditlog with server...
  [bndtest] Downloading DEPLOYMENT update (from v0.0.0 to v0.0.2)...
  [bndtest] Download progress: 1125 bytes read...
  [bndtest] [DEBUG] 13:42:31 (downloads) Download completed: 1125 bytes downloaded...
  [bndtest] Installing DEPLOYMENT update (from v0.0.0 to v0.0.2)...
  [bndtest] Tests run  : 2
  [bndtest] Passed     : 1
  [bndtest] Errors     : 0
  [bndtest] Failures   : 1
  [bndtest] 1 Error(s)
  [bndtest] Tests failed
  [bndtest] 	at aQute.bnd.ant.TestTask.executeProject(TestTask.java:78)
  [bndtest] 	at aQute.bnd.ant.TestTask.execute(TestTask.java:49)
  [bndtest] 	at org.apache.tools.ant.UnknownElement.execute(UnknownElement.java:291)
  [bndtest] 	at sun.reflect.GeneratedMethodAccessor4.invoke(Unknown Source)
  [bndtest] 	at sun.reflect.DelegatingMethodAccessorImpl.invoke(DelegatingMethodAccessorImpl.java:25)
  [bndtest] 	at java.lang.reflect.Method.invoke(Method.java:597)
  [bndtest] 	at org.apache.tools.ant.dispatch.DispatchUtils.execute(DispatchUtils.java:106)
  [bndtest] 	at org.apache.tools.ant.Task.perform(Task.java:348)
  [bndtest] 	at org.apache.tools.ant.Target.execute(Target.java:390)
  [bndtest] 	at org.apache.tools.ant.Target.performTasks(Target.java:411)
  [bndtest] 	at org.apache.tools.ant.Project.executeSortedTargets(Project.java:1399)
  [bndtest] 	at org.apache.tools.ant.helper.SingleCheckExecutor.executeTargets(SingleCheckExecutor.java:38)
  [bndtest] 	at org.apache.tools.ant.Project.executeTargets(Project.java:1251)
  [bndtest] 	at org.apache.tools.ant.taskdefs.Ant.execute(Ant.java:442)
  [bndtest] 	at org.apache.tools.ant.taskdefs.SubAnt.execute(SubAnt.java:302)
  [bndtest] 	at org.apache.tools.ant.taskdefs.SubAnt.execute(SubAnt.java:221)
  [bndtest] 	at org.apache.tools.ant.UnknownElement.execute(UnknownElement.java:291)
  [bndtest] 	at sun.reflect.GeneratedMethodAccessor4.invoke(Unknown Source)
  [bndtest] 	at sun.reflect.DelegatingMethodAccessorImpl.invoke(DelegatingMethodAccessorImpl.java:25)
  [bndtest] 	at java.lang.reflect.Method.invoke(Method.java:597)
  [bndtest] 	at org.apache.tools.ant.dispatch.DispatchUtils.execute(DispatchUtils.java:106)
  [bndtest] 	at org.apache.tools.ant.Task.perform(Task.java:348)
  [bndtest] 	at org.apache.tools.ant.Target.execute(Target.java:390)
  [bndtest] 	at org.apache.tools.ant.Target.performTasks(Target.java:411)
  [bndtest] 	at org.apache.tools.ant.Project.executeSortedTargets(Project.java:1399)
  [bndtest] 	at org.apache.tools.ant.Project.executeTarget(Project.java:1368)
  [bndtest] 	at org.apache.tools.ant.helper.DefaultExecutor.executeTargets(DefaultExecutor.java:41)
  [bndtest] 	at org.apache.tools.ant.Project.executeTargets(Project.java:1251)
  [bndtest] 	at org.apache.tools.ant.Main.runBuild(Main.java:809)
  [bndtest] 	at org.apache.tools.ant.Main.startAnt(Main.java:217)
  [bndtest] 	at org.apache.tools.ant.launch.Launcher.run(Launcher.java:280)
  [bndtest] 	at org.apache.tools.ant.launch.Launcher.main(Launcher.java:109)

BUILD FAILED
/zonestorage/hudson_solaris/home/hudson/hudson-slave/workspace/ACE-trunk/cnf/build.xml:55:
The following error occurred while executing this line:
/zonestorage/hudson_solaris/home/hudson/hudson-slave/workspace/ACE-trunk/cnf/build-template.xml:67:
Tests failed

Total time: 8 minutes 26 seconds
Build step 'Invoke Ant' marked build as failure
Recording test results
TestNG Reports Processing: START
Looking for TestNG results report in workspace using pattern: **/testng/testng-results.xml
Saving reports...
Processing '/home/hudson/hudson/jobs/ACE-trunk/builds/2013-11-29_13-26-29/testng/testng-results-1.xml'
Processing '/home/hudson/hudson/jobs/ACE-trunk/builds/2013-11-29_13-26-29/testng/testng-results-10.xml'
Processing '/home/hudson/hudson/jobs/ACE-trunk/builds/2013-11-29_13-26-29/testng/testng-results-11.xml'
Processing '/home/hudson/hudson/jobs/ACE-trunk/builds/2013-11-29_13-26-29/testng/testng-results-12.xml'
Processing '/home/hudson/hudson/jobs/ACE-trunk/builds/2013-11-29_13-26-29/testng/testng-results-13.xml'
Processing '/home/hudson/hudson/jobs/ACE-trunk/builds/2013-11-29_13-26-29/testng/testng-results-14.xml'
Processing '/home/hudson/hudson/jobs/ACE-trunk/builds/2013-11-29_13-26-29/testng/testng-results-15.xml'
Processing '/home/hudson/hudson/jobs/ACE-trunk/builds/2013-11-29_13-26-29/testng/testng-results-16.xml'
Processing '/home/hudson/hudson/jobs/ACE-trunk/builds/2013-11-29_13-26-29/testng/testng-results-17.xml'
Processing '/home/hudson/hudson/jobs/ACE-trunk/builds/2013-11-29_13-26-29/testng/testng-results-2.xml'
Processing '/home/hudson/hudson/jobs/ACE-trunk/builds/2013-11-29_13-26-29/testng/testng-results-3.xml'
Processing '/home/hudson/hudson/jobs/ACE-trunk/builds/2013-11-29_13-26-29/testng/testng-results-4.xml'
Processing '/home/hudson/hudson/jobs/ACE-trunk/builds/2013-11-29_13-26-29/testng/testng-results-5.xml'
Processing '/home/hudson/hudson/jobs/ACE-trunk/builds/2013-11-29_13-26-29/testng/testng-results-6.xml'
Processing '/home/hudson/hudson/jobs/ACE-trunk/builds/2013-11-29_13-26-29/testng/testng-results-7.xml'
Processing '/home/hudson/hudson/jobs/ACE-trunk/builds/2013-11-29_13-26-29/testng/testng-results-8.xml'
Processing '/home/hudson/hudson/jobs/ACE-trunk/builds/2013-11-29_13-26-29/testng/testng-results-9.xml'
Processing '/home/hudson/hudson/jobs/ACE-trunk/builds/2013-11-29_13-26-29/testng/testng-results.xml'
TestNG Reports Processing: FINISH

Mime
View raw message