ace-dev mailing list archives

Site index · List index
Message view « Date » · « Thread »
Top « Date » · « Thread »
From Apache Jenkins Server <jenk...@builds.apache.org>
Subject Build failed in Jenkins: ACE-trunk #112
Date Fri, 04 Oct 2013 11:41:18 GMT
See <https://builds.apache.org/job/ACE-trunk/112/changes>

Changes:

[jawi] Rewrote test a little to make it more robust.

------------------------------------------
[...truncated 3716 lines...]
  [bndtest] Oct 4, 2013 11:41:15 AM com.mongodb.DBTCPConnector fetchMaxBsonObjectSize
  [bndtest] WARNING: Exception determining maxBSON size using0
  [bndtest] java.io.IOException: couldn't connect to [hemera/140.211.11.27:27017] bc:java.net.ConnectException:
Connection refused
  [bndtest] 	at com.mongodb.DBPort._open(DBPort.java:228)
  [bndtest] 	at com.mongodb.DBPort.go(DBPort.java:112)
  [bndtest] 	at com.mongodb.DBPort.go(DBPort.java:93)
  [bndtest] 	at com.mongodb.DBPort.findOne(DBPort.java:146)
  [bndtest] 	at com.mongodb.DBPort.runCommand(DBPort.java:157)
  [bndtest] 	at com.mongodb.DBTCPConnector.fetchMaxBsonObjectSize(DBTCPConnector.java:457)
  [bndtest] 	at com.mongodb.DBTCPConnector.checkMaster(DBTCPConnector.java:444)
  [bndtest] 	at com.mongodb.DBTCPConnector.call(DBTCPConnector.java:209)
  [bndtest] 	at com.mongodb.DBApiLayer$MyCollection.__find(DBApiLayer.java:305)
  [bndtest] 	at com.mongodb.DB.command(DB.java:160)
  [bndtest] 	at com.mongodb.DB.command(DB.java:183)
  [bndtest] 	at com.mongodb.DBCollection.getCount(DBCollection.java:864)
  [bndtest] 	at com.mongodb.DBCollection.getCount(DBCollection.java:835)
  [bndtest] 	at com.mongodb.DBCollection.getCount(DBCollection.java:812)
  [bndtest] 	at org.apache.ace.log.server.store.tests.MongoLogStoreTest.configureAdditionalServices(MongoLogStoreTest.java:156)
  [bndtest] 	at org.apache.ace.it.IntegrationTestBase.setUp(IntegrationTestBase.java:479)
  [bndtest] 	at junit.framework.TestCase.runBare(TestCase.java:132)
  [bndtest] 	at junit.framework.TestResult$1.protect(TestResult.java:110)
  [bndtest] 	at junit.framework.TestResult.runProtected(TestResult.java:128)
  [bndtest] 	at junit.framework.TestResult.run(TestResult.java:113)
  [bndtest] 	at junit.framework.TestCase.run(TestCase.java:124)
  [bndtest] 	at junit.framework.TestSuite.runTest(TestSuite.java:243)
  [bndtest] 	at junit.framework.TestSuite.run(TestSuite.java:238)
  [bndtest] 	at junit.framework.TestSuite.runTest(TestSuite.java:243)
  [bndtest] 	at junit.framework.TestSuite.run(TestSuite.java:238)
  [bndtest] 	at aQute.junit.Activator.test(Activator.java:236)
  [bndtest] 	at aQute.junit.Activator.automatic(Activator.java:127)
  [bndtest] 	at aQute.junit.Activator.run(Activator.java:61)
  [bndtest] Oct 4, 2013 11:41:15 AM com.mongodb.DBPortPool gotError
  [bndtest] WARNING: emptying DBPortPool to localhost:27017 b/c of error
  [bndtest] java.io.IOException: couldn't connect to [hemera/140.211.11.27:27017] bc:java.net.ConnectException:
Connection refused
  [bndtest] 	at com.mongodb.DBPort._open(DBPort.java:228)
  [bndtest] 	at com.mongodb.DBPort.go(DBPort.java:112)
  [bndtest] 	at com.mongodb.DBPort.call(DBPort.java:79)
  [bndtest] 	at com.mongodb.DBTCPConnector.call(DBTCPConnector.java:218)
  [bndtest] 	at com.mongodb.DBApiLayer$MyCollection.__find(DBApiLayer.java:305)
  [bndtest] 	at com.mongodb.DB.command(DB.java:160)
  [bndtest] 	at com.mongodb.DB.command(DB.java:183)
  [bndtest] 	at com.mongodb.DBCollection.getCount(DBCollection.java:864)
  [bndtest] 	at com.mongodb.DBCollection.getCount(DBCollection.java:835)
  [bndtest] 	at com.mongodb.DBCollection.getCount(DBCollection.java:812)
  [bndtest] 	at org.apache.ace.log.server.store.tests.MongoLogStoreTest.configureAdditionalServices(MongoLogStoreTest.java:156)
  [bndtest] 	at org.apache.ace.it.IntegrationTestBase.setUp(IntegrationTestBase.java:479)
  [bndtest] 	at junit.framework.TestCase.runBare(TestCase.java:132)
  [bndtest] 	at junit.framework.TestResult$1.protect(TestResult.java:110)
  [bndtest] 	at junit.framework.TestResult.runProtected(TestResult.java:128)
  [bndtest] 	at junit.framework.TestResult.run(TestResult.java:113)
  [bndtest] 	at junit.framework.TestCase.run(TestCase.java:124)
  [bndtest] 	at junit.framework.TestSuite.runTest(TestSuite.java:243)
  [bndtest] 	at junit.framework.TestSuite.run(TestSuite.java:238)
  [bndtest] 	at junit.framework.TestSuite.runTest(TestSuite.java:243)
  [bndtest] 	at junit.framework.TestSuite.run(TestSuite.java:238)
  [bndtest] 	at aQute.junit.Activator.test(Activator.java:236)
  [bndtest] 	at aQute.junit.Activator.automatic(Activator.java:127)
  [bndtest] 	at aQute.junit.Activator.run(Activator.java:61)
  [bndtest] Mongodb not available on localhost, skipping test...
  [bndtest] Oct 4, 2013 11:41:15 AM com.mongodb.DBTCPConnector fetchMaxBsonObjectSize
  [bndtest] WARNING: Exception determining maxBSON size using0
  [bndtest] java.io.IOException: couldn't connect to [hemera/140.211.11.27:27017] bc:java.net.ConnectException:
Connection refused
  [bndtest] 	at com.mongodb.DBPort._open(DBPort.java:228)
  [bndtest] 	at com.mongodb.DBPort.go(DBPort.java:112)
  [bndtest] 	at com.mongodb.DBPort.go(DBPort.java:93)
  [bndtest] 	at com.mongodb.DBPort.findOne(DBPort.java:146)
  [bndtest] 	at com.mongodb.DBPort.runCommand(DBPort.java:157)
  [bndtest] 	at com.mongodb.DBTCPConnector.fetchMaxBsonObjectSize(DBTCPConnector.java:457)
  [bndtest] 	at com.mongodb.DBTCPConnector.checkMaster(DBTCPConnector.java:444)
  [bndtest] 	at com.mongodb.DBTCPConnector.call(DBTCPConnector.java:209)
  [bndtest] 	at com.mongodb.DBApiLayer$MyCollection.__find(DBApiLayer.java:305)
  [bndtest] 	at com.mongodb.DB.command(DB.java:160)
  [bndtest] 	at com.mongodb.DB.command(DB.java:183)
  [bndtest] 	at com.mongodb.DBCollection.getCount(DBCollection.java:864)
  [bndtest] 	at com.mongodb.DBCollection.getCount(DBCollection.java:835)
  [bndtest] 	at com.mongodb.DBCollection.getCount(DBCollection.java:812)
  [bndtest] 	at org.apache.ace.log.server.store.tests.MongoLogStoreTest.configureAdditionalServices(MongoLogStoreTest.java:156)
  [bndtest] 	at org.apache.ace.it.IntegrationTestBase.setUp(IntegrationTestBase.java:479)
  [bndtest] 	at junit.framework.TestCase.runBare(TestCase.java:132)
  [bndtest] 	at junit.framework.TestResult$1.protect(TestResult.java:110)
  [bndtest] 	at junit.framework.TestResult.runProtected(TestResult.java:128)
  [bndtest] 	at junit.framework.TestResult.run(TestResult.java:113)
  [bndtest] 	at junit.framework.TestCase.run(TestCase.java:124)
  [bndtest] 	at junit.framework.TestSuite.runTest(TestSuite.java:243)
  [bndtest] 	at junit.framework.TestSuite.run(TestSuite.java:238)
  [bndtest] 	at junit.framework.TestSuite.runTest(TestSuite.java:243)
  [bndtest] 	at junit.framework.TestSuite.run(TestSuite.java:238)
  [bndtest] 	at aQute.junit.Activator.test(Activator.java:236)
  [bndtest] 	at aQute.junit.Activator.automatic(Activator.java:127)
  [bndtest] 	at aQute.junit.Activator.run(Activator.java:61)
  [bndtest] Oct 4, 2013 11:41:15 AM com.mongodb.DBPortPool gotError
  [bndtest] WARNING: emptying DBPortPool to localhost:27017 b/c of error
  [bndtest] java.io.IOException: couldn't connect to [hemera/140.211.11.27:27017] bc:java.net.ConnectException:
Connection refused
  [bndtest] 	at com.mongodb.DBPort._open(DBPort.java:228)
  [bndtest] 	at com.mongodb.DBPort.go(DBPort.java:112)
  [bndtest] 	at com.mongodb.DBPort.call(DBPort.java:79)
  [bndtest] 	at com.mongodb.DBTCPConnector.call(DBTCPConnector.java:218)
  [bndtest] 	at com.mongodb.DBApiLayer$MyCollection.__find(DBApiLayer.java:305)
  [bndtest] 	at com.mongodb.DB.command(DB.java:160)
  [bndtest] 	at com.mongodb.DB.command(DB.java:183)
  [bndtest] 	at com.mongodb.DBCollection.getCount(DBCollection.java:864)
  [bndtest] 	at com.mongodb.DBCollection.getCount(DBCollection.java:835)
  [bndtest] 	at com.mongodb.DBCollection.getCount(DBCollection.java:812)
  [bndtest] 	at org.apache.ace.log.server.store.tests.MongoLogStoreTest.configureAdditionalServices(MongoLogStoreTest.java:156)
  [bndtest] 	at org.apache.ace.it.IntegrationTestBase.setUp(IntegrationTestBase.java:479)
  [bndtest] 	at junit.framework.TestCase.runBare(TestCase.java:132)
  [bndtest] 	at junit.framework.TestResult$1.protect(TestResult.java:110)
  [bndtest] 	at junit.framework.TestResult.runProtected(TestResult.java:128)
  [bndtest] 	at junit.framework.TestResult.run(TestResult.java:113)
  [bndtest] 	at junit.framework.TestCase.run(TestCase.java:124)
  [bndtest] 	at junit.framework.TestSuite.runTest(TestSuite.java:243)
  [bndtest] 	at junit.framework.TestSuite.run(TestSuite.java:238)
  [bndtest] 	at junit.framework.TestSuite.runTest(TestSuite.java:243)
  [bndtest] 	at junit.framework.TestSuite.run(TestSuite.java:238)
  [bndtest] 	at aQute.junit.Activator.test(Activator.java:236)
  [bndtest] 	at aQute.junit.Activator.automatic(Activator.java:127)
  [bndtest] 	at aQute.junit.Activator.run(Activator.java:61)
  [bndtest] Mongodb not available on localhost, skipping test...
  [bndtest] Errors: 0
  [bndtest] Failures: 0
  [bndtest] All tests passed

template.init:
     [echo] Enter project org.apache.ace.webui.vaadin

init:

dependencies:

compile:

test:

template.init:
     [echo] Enter project org.apache.ace.log.server.ui

init:

dependencies:

compile:

test:

template.init:
     [echo] Enter project org.apache.ace.nodelauncher

init:

dependencies:

compile:

test:

template.init:
     [echo] Enter project org.apache.ace.processlauncher

init:

dependencies:

compile:

test:

template.init:
     [echo] Enter project org.apache.ace.repository.itest

init:

dependencies:

compile:

test:
  [bndtest] Testing /x1/jenkins/jenkins-slave/workspace/ACE-trunk/org.apache.ace.repository.itest/bnd.bnd
  [bndtest] 2013-10-04 11:41:17.377:INFO:oejs.Server:jetty-7.x.y-SNAPSHOT
  [bndtest] 2013-10-04 11:41:17.404:INFO:oejsh.ContextHandler:started o.e.j.s.ServletContextHandler{/,null}
  [bndtest] 2013-10-04 11:41:17.432:INFO:oejs.AbstractConnector:Started SelectChannelConnector@0.0.0.0:8080
  [bndtest] ____________________________
  [bndtest] Welcome to Apache Felix Gogo
  [bndtest] 
  [bndtest] Errors: 1
  [bndtest] Failures: 0
  [bndtest] 1 Error(s)
  [bndtest] Tests failed
  [bndtest] 	at aQute.bnd.ant.TestTask.executeProject(TestTask.java:78)
  [bndtest] 	at aQute.bnd.ant.TestTask.execute(TestTask.java:49)
  [bndtest] 	at org.apache.tools.ant.UnknownElement.execute(UnknownElement.java:291)
  [bndtest] 	at sun.reflect.GeneratedMethodAccessor4.invoke(Unknown Source)
  [bndtest] 	at sun.reflect.DelegatingMethodAccessorImpl.invoke(DelegatingMethodAccessorImpl.java:25)
  [bndtest] 	at java.lang.reflect.Method.invoke(Method.java:597)
  [bndtest] 	at org.apache.tools.ant.dispatch.DispatchUtils.execute(DispatchUtils.java:106)
  [bndtest] 	at org.apache.tools.ant.Task.perform(Task.java:348)
  [bndtest] 	at org.apache.tools.ant.Target.execute(Target.java:390)
  [bndtest] 	at org.apache.tools.ant.Target.performTasks(Target.java:411)
  [bndtest] 	at org.apache.tools.ant.Project.executeSortedTargets(Project.java:1399)
  [bndtest] 	at org.apache.tools.ant.helper.SingleCheckExecutor.executeTargets(SingleCheckExecutor.java:38)
  [bndtest] 	at org.apache.tools.ant.Project.executeTargets(Project.java:1251)
  [bndtest] 	at org.apache.tools.ant.taskdefs.Ant.execute(Ant.java:442)
  [bndtest] 	at org.apache.tools.ant.taskdefs.SubAnt.execute(SubAnt.java:302)
  [bndtest] 	at org.apache.tools.ant.taskdefs.SubAnt.execute(SubAnt.java:221)
  [bndtest] 	at org.apache.tools.ant.UnknownElement.execute(UnknownElement.java:291)
  [bndtest] 	at sun.reflect.GeneratedMethodAccessor4.invoke(Unknown Source)
  [bndtest] 	at sun.reflect.DelegatingMethodAccessorImpl.invoke(DelegatingMethodAccessorImpl.java:25)
  [bndtest] 	at java.lang.reflect.Method.invoke(Method.java:597)
  [bndtest] 	at org.apache.tools.ant.dispatch.DispatchUtils.execute(DispatchUtils.java:106)
  [bndtest] 	at org.apache.tools.ant.Task.perform(Task.java:348)
  [bndtest] 	at org.apache.tools.ant.Target.execute(Target.java:390)
  [bndtest] 	at org.apache.tools.ant.Target.performTasks(Target.java:411)
  [bndtest] 	at org.apache.tools.ant.Project.executeSortedTargets(Project.java:1399)
  [bndtest] 	at org.apache.tools.ant.Project.executeTarget(Project.java:1368)
  [bndtest] 	at org.apache.tools.ant.helper.DefaultExecutor.executeTargets(DefaultExecutor.java:41)
  [bndtest] 	at org.apache.tools.ant.Project.executeTargets(Project.java:1251)
  [bndtest] 	at org.apache.tools.ant.Main.runBuild(Main.java:809)
  [bndtest] 	at org.apache.tools.ant.Main.startAnt(Main.java:217)
  [bndtest] 	at org.apache.tools.ant.launch.Launcher.run(Launcher.java:280)
  [bndtest] 	at org.apache.tools.ant.launch.Launcher.main(Launcher.java:109)

BUILD FAILED
/x1/jenkins/jenkins-slave/workspace/ACE-trunk/cnf/build.xml:55: The following error occurred
while executing this line:
/x1/jenkins/jenkins-slave/workspace/ACE-trunk/cnf/build-template.xml:67: Tests failed

Total time: 6 minutes 8 seconds
Build step 'Invoke Ant' marked build as failure
Recording test results
TestNG Reports Processing: START
Looking for TestNG results report in workspace using pattern: **/testng/testng-results.xml
Saving reports...
Processing '/home/hudson/hudson/jobs/ACE-trunk/builds/2013-10-04_11-34-57/testng/testng-results-1.xml'
Processing '/home/hudson/hudson/jobs/ACE-trunk/builds/2013-10-04_11-34-57/testng/testng-results-10.xml'
Processing '/home/hudson/hudson/jobs/ACE-trunk/builds/2013-10-04_11-34-57/testng/testng-results-11.xml'
Processing '/home/hudson/hudson/jobs/ACE-trunk/builds/2013-10-04_11-34-57/testng/testng-results-12.xml'
Processing '/home/hudson/hudson/jobs/ACE-trunk/builds/2013-10-04_11-34-57/testng/testng-results-13.xml'
Processing '/home/hudson/hudson/jobs/ACE-trunk/builds/2013-10-04_11-34-57/testng/testng-results-14.xml'
Processing '/home/hudson/hudson/jobs/ACE-trunk/builds/2013-10-04_11-34-57/testng/testng-results-15.xml'
Processing '/home/hudson/hudson/jobs/ACE-trunk/builds/2013-10-04_11-34-57/testng/testng-results-16.xml'
Processing '/home/hudson/hudson/jobs/ACE-trunk/builds/2013-10-04_11-34-57/testng/testng-results-17.xml'
Processing '/home/hudson/hudson/jobs/ACE-trunk/builds/2013-10-04_11-34-57/testng/testng-results-2.xml'
Processing '/home/hudson/hudson/jobs/ACE-trunk/builds/2013-10-04_11-34-57/testng/testng-results-3.xml'
Processing '/home/hudson/hudson/jobs/ACE-trunk/builds/2013-10-04_11-34-57/testng/testng-results-4.xml'
Processing '/home/hudson/hudson/jobs/ACE-trunk/builds/2013-10-04_11-34-57/testng/testng-results-5.xml'
Processing '/home/hudson/hudson/jobs/ACE-trunk/builds/2013-10-04_11-34-57/testng/testng-results-6.xml'
Processing '/home/hudson/hudson/jobs/ACE-trunk/builds/2013-10-04_11-34-57/testng/testng-results-7.xml'
Processing '/home/hudson/hudson/jobs/ACE-trunk/builds/2013-10-04_11-34-57/testng/testng-results-8.xml'
Processing '/home/hudson/hudson/jobs/ACE-trunk/builds/2013-10-04_11-34-57/testng/testng-results-9.xml'
Processing '/home/hudson/hudson/jobs/ACE-trunk/builds/2013-10-04_11-34-57/testng/testng-results.xml'
TestNG Reports Processing: FINISH

Mime
View raw message