ace-dev mailing list archives

Site index · List index
Message view « Date » · « Thread »
Top « Date » · « Thread »
From Apache Jenkins Server <jenk...@builds.apache.org>
Subject Build failed in Jenkins: ACE-trunk #118
Date Thu, 10 Oct 2013 14:41:45 GMT
See <https://builds.apache.org/job/ACE-trunk/118/changes>

Changes:

[jawi] ACE-330 - limit number of deployment versions per target:

- updated config files to reflect the changes in code due to
  previous refactoring wrt repository settings.

[jawi] ACE-330 - limit number of deployment versions per target:

- introduced a new concept to configure repositories: 
  RepositoryConfiguration, which can be used to make fiddle settings of
  repositories, and is used, for example, to limit the number of 
  deployment versions;
- moved the OBR url setting needed in the artifact repository, that was
  scattered throughout the code to RepositoryConfiguration, simplifying
  some of the calling code;
- fixed some concurrency issues in the base repository implementation;
- made the integration tests no longer dependent on port 8080 for servlet
  communication, we could run itests on any port we want.

[jawi] Improved the readability/understandability of the code a bit.

------------------------------------------
[...truncated 5152 lines...]
  [bndtest] Got response code 401 for http://localhost:8080/obr/repository.xml
  [bndtest] 2013-10-10 14:41:38.276:INFO:oejsh.ContextHandler:stopped o.e.j.s.ServletContextHandler{/,null}
  [bndtest] 2013-10-10 14:41:38.329:INFO:oejs.Server:jetty-7.x.y-SNAPSHOT
  [bndtest] 2013-10-10 14:41:38.329:INFO:oejsh.ContextHandler:started o.e.j.s.ServletContextHandler{/,null}
  [bndtest] 2013-10-10 14:41:38.332:INFO:oejs.AbstractConnector:Started SelectChannelConnector@0.0.0.0:8080
  [bndtest] 2013-10-10 14:41:38.358:INFO:oejsh.ContextHandler:stopped o.e.j.s.ServletContextHandler{/,null}
  [bndtest] 2013-10-10 14:41:38.409:INFO:oejs.Server:jetty-7.x.y-SNAPSHOT
  [bndtest] 2013-10-10 14:41:38.410:INFO:oejsh.ContextHandler:started o.e.j.s.ServletContextHandler{/,null}
  [bndtest] 2013-10-10 14:41:38.413:INFO:oejs.AbstractConnector:Started SelectChannelConnector@0.0.0.0:8080
  [bndtest] Got response code 404 for http://localhost:8080/obr/repository.xml
  [bndtest] Bundle Indexer | v2.2
  [bndtest] (c) 2007 OSGi, All Rights Reserved
  [bndtest] Got response code 401 for http://localhost:8080/obr/repository.xml
  [bndtest] 2013-10-10 14:41:38.704:INFO:oejsh.ContextHandler:stopped o.e.j.s.ServletContextHandler{/,null}
  [bndtest] 2013-10-10 14:41:38.755:INFO:oejs.Server:jetty-7.x.y-SNAPSHOT
  [bndtest] 2013-10-10 14:41:38.756:INFO:oejsh.ContextHandler:started o.e.j.s.ServletContextHandler{/,null}
  [bndtest] 2013-10-10 14:41:38.759:INFO:oejs.AbstractConnector:Started SelectChannelConnector@0.0.0.0:8080
  [bndtest] 2013-10-10 14:41:38.786:INFO:oejsh.ContextHandler:stopped o.e.j.s.ServletContextHandler{/,null}
  [bndtest] 2013-10-10 14:41:38.839:INFO:oejs.Server:jetty-7.x.y-SNAPSHOT
  [bndtest] 2013-10-10 14:41:38.840:INFO:oejsh.ContextHandler:started o.e.j.s.ServletContextHandler{/,null}
  [bndtest] 2013-10-10 14:41:38.843:INFO:oejs.AbstractConnector:Started SelectChannelConnector@0.0.0.0:8080
  [bndtest] Got response code 404 for http://localhost:8080/obr/repository.xml
  [bndtest] Bundle Indexer | v2.2
  [bndtest] (c) 2007 OSGi, All Rights Reserved
  [bndtest] Got response code 401 for http://localhost:8080/obr/repository.xml
  [bndtest] Log:
  [bndtest]  * Thu Oct 10 14:41:39 UTC 2013 - Error storing artifact: Error importing artifact
file:/tmp/org.apache.ace.test24806274139622607624.jar: Socket Closed - 21
  [bndtest] org.apache.felix.log.LogException: java.io.IOException: Error importing artifact
file:/tmp/org.apache.ace.test24806274139622607624.jar: Socket Closed
  [bndtest] 	at org.apache.ace.client.repository.impl.ArtifactRepositoryImpl.upload(ArtifactRepositoryImpl.java:481)
  [bndtest] 	at org.apache.ace.client.repository.impl.ArtifactRepositoryImpl.importArtifact(ArtifactRepositoryImpl.java:353)
  [bndtest] 	at org.apache.ace.client.repository.impl.ArtifactRepositoryImpl.importArtifact(ArtifactRepositoryImpl.java:296)
  [bndtest] 	at org.apache.ace.it.authentication.ObrAuthenticationTest.testImportArtifactWithCredentialsOk(ObrAuthenticationTest.java:271)
  [bndtest] 	at sun.reflect.NativeMethodAccessorImpl.invoke0(Native Method)
  [bndtest] 	at sun.reflect.NativeMethodAccessorImpl.invoke(NativeMethodAccessorImpl.java:39)
  [bndtest] 	at sun.reflect.DelegatingMethodAccessorImpl.invoke(DelegatingMethodAccessorImpl.java:25)
  [bndtest] 	at java.lang.reflect.Method.invoke(Method.java:597)
  [bndtest] 	at junit.framework.TestCase.runTest(TestCase.java:168)
  [bndtest] 	at junit.framework.TestCase.runBare(TestCase.java:134)
  [bndtest] 	at junit.framework.TestResult$1.protect(TestResult.java:110)
  [bndtest] 	at junit.framework.TestResult.runProtected(TestResult.java:128)
  [bndtest] 	at junit.framework.TestResult.run(TestResult.java:113)
  [bndtest] 	at junit.framework.TestCase.run(TestCase.java:124)
  [bndtest] 	at junit.framework.TestSuite.runTest(TestSuite.java:243)
  [bndtest] 	at junit.framework.TestSuite.run(TestSuite.java:238)
  [bndtest] 	at junit.framework.TestSuite.runTest(TestSuite.java:243)
  [bndtest] 	at junit.framework.TestSuite.run(TestSuite.java:238)
  [bndtest] 	at aQute.junit.Activator.test(Activator.java:258)
  [bndtest] 	at aQute.junit.Activator.automatic(Activator.java:149)
  [bndtest] 	at aQute.junit.Activator.run(Activator.java:83)
  [bndtest] 	at aQute.launcher.Launcher.run(Launcher.java:176)
  [bndtest] 	at aQute.launcher.Launcher.main(Launcher.java:80)
  [bndtest] Caused by: java.net.SocketException: Socket Closed
  [bndtest] 	at java.net.PlainSocketImpl.getOption(PlainSocketImpl.java:286)
  [bndtest] 	at java.net.Socket.getSoTimeout(Socket.java:1032)
  [bndtest] 	at sun.net.www.http.HttpClient.available(HttpClient.java:356)
  [bndtest] 	at sun.net.www.http.HttpClient.New(HttpClient.java:273)
  [bndtest] 	at sun.net.www.http.HttpClient.New(HttpClient.java:310)
  [bndtest] 	at sun.net.www.protocol.http.HttpURLConnection.getNewHttpClient(HttpURLConnection.java:987)
  [bndtest] 	at sun.net.www.protocol.http.HttpURLConnection.plainConnect(HttpURLConnection.java:923)
  [bndtest] 	at sun.net.www.protocol.http.HttpURLConnection.connect(HttpURLConnection.java:841)
  [bndtest] 	at sun.net.www.protocol.http.HttpURLConnection.getOutputStream(HttpURLConnection.java:1031)
  [bndtest] 	at org.apache.ace.client.repository.impl.ArtifactRepositoryImpl.upload(ArtifactRepositoryImpl.java:456)
  [bndtest] 	... 22 more
  [bndtest]  * Thu Oct 10 14:41:39 UTC 2013 - Authentication failure! - 39
  [bndtest]  * Thu Oct 10 14:41:39 UTC 2013 - Authentication failure! - 39
  [bndtest]  * Thu Oct 10 14:41:38 UTC 2013 - ServiceEvent REGISTERED - 39
  [bndtest]  * Thu Oct 10 14:41:38 UTC 2013 - ServiceEvent REGISTERED - 40
  [bndtest]  * Thu Oct 10 14:41:38 UTC 2013 - ServiceEvent REGISTERED - 23
  [bndtest]  * Thu Oct 10 14:41:38 UTC 2013 - ServiceEvent REGISTERED - 43
  [bndtest]  * Thu Oct 10 14:41:38 UTC 2013 - Started jetty 7.x.y-SNAPSHOT at port(s) HTTP:8080
on context path / - 8
  [bndtest]  * Thu Oct 10 14:41:38 UTC 2013 - ServiceEvent REGISTERED - 8
  [bndtest]  * Thu Oct 10 14:41:38 UTC 2013 - ServiceEvent REGISTERED - 8
  [bndtest]  * Thu Oct 10 14:41:38 UTC 2013 - ServiceEvent UNREGISTERING - 8
  [bndtest]  * Thu Oct 10 14:41:38 UTC 2013 - ServiceEvent UNREGISTERING - 8
  [bndtest]  * Thu Oct 10 14:41:38 UTC 2013 - Started jetty 7.x.y-SNAPSHOT at port(s) HTTP:8080
on context path / - 8
  [bndtest]  * Thu Oct 10 14:41:38 UTC 2013 - ServiceEvent REGISTERED - 8
  [bndtest]  * Thu Oct 10 14:41:38 UTC 2013 - ServiceEvent REGISTERED - 8
  [bndtest]  * Thu Oct 10 14:41:38 UTC 2013 - ServiceEvent UNREGISTERING - 8
  [bndtest]  * Thu Oct 10 14:41:38 UTC 2013 - ServiceEvent UNREGISTERING - 8
  [bndtest]  * Thu Oct 10 14:41:38 UTC 2013 - ServiceEvent UNREGISTERING - 40
  [bndtest]  * Thu Oct 10 14:41:38 UTC 2013 - ServiceEvent UNREGISTERING - 39
  [bndtest]  * Thu Oct 10 14:41:38 UTC 2013 - ServiceEvent UNREGISTERING - 43
  [bndtest]  * Thu Oct 10 14:41:38 UTC 2013 - ServiceEvent UNREGISTERING - 23
  [bndtest]  * Thu Oct 10 14:41:38 UTC 2013 - Authentication failure! - 39
  [bndtest]  * Thu Oct 10 14:41:38 UTC 2013 - Authentication failure! - 39
  [bndtest]  * Thu Oct 10 14:41:38 UTC 2013 - Authentication failure! - 39
  [bndtest]  * Thu Oct 10 14:41:38 UTC 2013 - Authentication failure! - 39
  [bndtest]  * Thu Oct 10 14:41:38 UTC 2013 - ServiceEvent REGISTERED - 39
  [bndtest]  * Thu Oct 10 14:41:38 UTC 2013 - ServiceEvent REGISTERED - 40
  [bndtest]  * Thu Oct 10 14:41:38 UTC 2013 - ServiceEvent REGISTERED - 23
  [bndtest]  * Thu Oct 10 14:41:38 UTC 2013 - ServiceEvent REGISTERED - 43
  [bndtest]  * Thu Oct 10 14:41:38 UTC 2013 - Started jetty 7.x.y-SNAPSHOT at port(s) HTTP:8080
on context path / - 8
  [bndtest]  * Thu Oct 10 14:41:38 UTC 2013 - ServiceEvent REGISTERED - 8
  [bndtest]  * Thu Oct 10 14:41:38 UTC 2013 - ServiceEvent REGISTERED - 8
  [bndtest]  * Thu Oct 10 14:41:38 UTC 2013 - ServiceEvent UNREGISTERING - 8
  [bndtest]  * Thu Oct 10 14:41:38 UTC 2013 - ServiceEvent UNREGISTERING - 8
  [bndtest]  * Thu Oct 10 14:41:38 UTC 2013 - Started jetty 7.x.y-SNAPSHOT at port(s) HTTP:8080
on context path / - 8
  [bndtest]  * Thu Oct 10 14:41:38 UTC 2013 - ServiceEvent REGISTERED - 8
  [bndtest]  * Thu Oct 10 14:41:38 UTC 2013 - ServiceEvent REGISTERED - 8
  [bndtest]  * Thu Oct 10 14:41:38 UTC 2013 - ServiceEvent UNREGISTERING - 8
  [bndtest]  * Thu Oct 10 14:41:38 UTC 2013 - ServiceEvent UNREGISTERING - 8
  [bndtest]  * Thu Oct 10 14:41:38 UTC 2013 - ServiceEvent UNREGISTERING - 40
  [bndtest]  * Thu Oct 10 14:41:38 UTC 2013 - ServiceEvent UNREGISTERING - 39
  [bndtest]  * Thu Oct 10 14:41:38 UTC 2013 - ServiceEvent UNREGISTERING - 43
  [bndtest]  * Thu Oct 10 14:41:38 UTC 2013 - ServiceEvent UNREGISTERING - 23
  [bndtest]  * Thu Oct 10 14:41:38 UTC 2013 - Authentication failure! - 39
  [bndtest]  * Thu Oct 10 14:41:38 UTC 2013 - Authentication failure! - 39
  [bndtest]  * Thu Oct 10 14:41:38 UTC 2013 - Authentication failure! - 39
  [bndtest]  * Thu Oct 10 14:41:38 UTC 2013 - Authentication failure! - 39
  [bndtest]  * Thu Oct 10 14:41:38 UTC 2013 - ServiceEvent REGISTERED - 39
  [bndtest]  * Thu Oct 10 14:41:38 UTC 2013 - ServiceEvent REGISTERED - 40
  [bndtest]  * Thu Oct 10 14:41:38 UTC 2013 - ServiceEvent REGISTERED - 23
  [bndtest]  * Thu Oct 10 14:41:38 UTC 2013 - ServiceEvent REGISTERED - 43
  [bndtest]  * Thu Oct 10 14:41:37 UTC 2013 - Started jetty 7.x.y-SNAPSHOT at port(s) HTTP:8080
on context path / - 8
  [bndtest]  * Thu Oct 10 14:41:37 UTC 2013 - ServiceEvent REGISTERED - 8
  [bndtest]  * Thu Oct 10 14:41:37 UTC 2013 - ServiceEvent REGISTERED - 8
  [bndtest]  * Thu Oct 10 14:41:37 UTC 2013 - ServiceEvent UNREGISTERING - 8
  [bndtest]  * Thu Oct 10 14:41:37 UTC 2013 - ServiceEvent UNREGISTERING - 8
  [bndtest]  * Thu Oct 10 14:41:37 UTC 2013 - Started jetty 7.x.y-SNAPSHOT at port(s) HTTP:8080
on context path / - 8
  [bndtest]  * Thu Oct 10 14:41:37 UTC 2013 - ServiceEvent REGISTERED - 8
  [bndtest]  * Thu Oct 10 14:41:37 UTC 2013 - ServiceEvent REGISTERED - 8
  [bndtest]  * Thu Oct 10 14:41:37 UTC 2013 - ServiceEvent UNREGISTERING - 8
  [bndtest]  * Thu Oct 10 14:41:37 UTC 2013 - ServiceEvent UNREGISTERING - 8
  [bndtest]  * Thu Oct 10 14:41:37 UTC 2013 - ServiceEvent UNREGISTERING - 40
  [bndtest]  * Thu Oct 10 14:41:37 UTC 2013 - ServiceEvent UNREGISTERING - 39
  [bndtest]  * Thu Oct 10 14:41:37 UTC 2013 - ServiceEvent UNREGISTERING - 43
  [bndtest]  * Thu Oct 10 14:41:37 UTC 2013 - ServiceEvent UNREGISTERING - 23
  [bndtest]  * Thu Oct 10 14:41:37 UTC 2013 - Authentication failure! - 39
  [bndtest]  * Thu Oct 10 14:41:37 UTC 2013 - Authentication failure! - 39
  [bndtest]  * Thu Oct 10 14:41:37 UTC 2013 - ServiceEvent REGISTERED - 39
  [bndtest]  * Thu Oct 10 14:41:37 UTC 2013 - ServiceEvent REGISTERED - 40
  [bndtest]  * Thu Oct 10 14:41:37 UTC 2013 - ServiceEvent REGISTERED - 23
  [bndtest]  * Thu Oct 10 14:41:37 UTC 2013 - ServiceEvent REGISTERED - 43
  [bndtest]  * Thu Oct 10 14:41:37 UTC 2013 - Started jetty 7.x.y-SNAPSHOT at port(s) HTTP:8080
on context path / - 8
  [bndtest]  * Thu Oct 10 14:41:37 UTC 2013 - ServiceEvent REGISTERED - 8
  [bndtest]  * Thu Oct 10 14:41:37 UTC 2013 - ServiceEvent REGISTERED - 8
  [bndtest]  * Thu Oct 10 14:41:37 UTC 2013 - ServiceEvent UNREGISTERING - 8
  [bndtest]  * Thu Oct 10 14:41:37 UTC 2013 - ServiceEvent UNREGISTERING - 8
  [bndtest]  * Thu Oct 10 14:41:37 UTC 2013 - Started jetty 7.x.y-SNAPSHOT at port(s) HTTP:8080
on context path / - 8
  [bndtest]  * Thu Oct 10 14:41:37 UTC 2013 - ServiceEvent REGISTERED - 8
  [bndtest]  * Thu Oct 10 14:41:37 UTC 2013 - ServiceEvent REGISTERED - 8
  [bndtest]  * Thu Oct 10 14:41:37 UTC 2013 - ServiceEvent UNREGISTERING - 8
  [bndtest]  * Thu Oct 10 14:41:37 UTC 2013 - ServiceEvent UNREGISTERING - 8
  [bndtest]  * Thu Oct 10 14:41:37 UTC 2013 - ServiceEvent UNREGISTERING - 33
  [bndtest]  * Thu Oct 10 14:41:37 UTC 2013 - ServiceEvent UNREGISTERING - 34
  [bndtest]  * Thu Oct 10 14:41:37 UTC 2013 - ServiceEvent UNREGISTERING - 30
  [bndtest]  * Thu Oct 10 14:41:37 UTC 2013 - ServiceEvent UNREGISTERING - 36
  [bndtest]  * Thu Oct 10 14:41:37 UTC 2013 - ServiceEvent UNREGISTERING - 35
  [bndtest]  * Thu Oct 10 14:41:37 UTC 2013 - ServiceEvent UNREGISTERING - 27
  [bndtest]  * Thu Oct 10 14:41:37 UTC 2013 - ServiceEvent UNREGISTERING - 35
  [bndtest]  * Thu Oct 10 14:41:37 UTC 2013 - ServiceEvent UNREGISTERING - 43
  [bndtest]  * Thu Oct 10 14:41:37 UTC 2013 - ServiceEvent UNREGISTERING - 23
  [bndtest]  * Thu Oct 10 14:41:36 UTC 2013 - Authentication failure! - 34
  [bndtest]  * Thu Oct 10 14:41:36 UTC 2013 - Authentication failure! - 34
  [bndtest]  * Thu Oct 10 14:41:36 UTC 2013 - ServiceEvent REGISTERED - 33
  [bndtest]  * Thu Oct 10 14:41:36 UTC 2013 - ServiceEvent REGISTERED - 34
  [bndtest]  * Thu Oct 10 14:41:36 UTC 2013 - Unable to (fully) synchronize log with remote
(endpoint=auditlog) - 35
  [bndtest] java.io.FileNotFoundException: http://localhost:8080/auditlog/query?tid=target-id&logid=1381416096814
  [bndtest] 	at sun.net.www.protocol.http.HttpURLConnection.getInputStream(HttpURLConnection.java:1457)
  [bndtest] 	at org.apache.ace.log.target.task.LogSyncTask.run(LogSyncTask.java:103)
  [bndtest] 	at org.apache.ace.scheduler.Executer.run(Executer.java:92)
  [bndtest] 	at java.util.TimerThread.mainLoop(Timer.java:512)
  [bndtest] 	at java.util.TimerThread.run(Timer.java:462)
  [bndtest]  * Thu Oct 10 14:41:36 UTC 2013 - ServiceEvent REGISTERED - 35
  [bndtest]  * Thu Oct 10 14:41:36 UTC 2013 - ServiceEvent REGISTERED - 35
  [bndtest]  * Thu Oct 10 14:41:36 UTC 2013 - ServiceEvent REGISTERED - 36
  [bndtest]  * Thu Oct 10 14:41:36 UTC 2013 - ServiceEvent REGISTERED - 30
  [bndtest]  * Thu Oct 10 14:41:36 UTC 2013 - ServiceEvent REGISTERED - 27
  [bndtest] 2013-10-10 14:41:39.181:INFO:oejsh.ContextHandler:stopped o.e.j.s.ServletContextHandler{/,null}
  [bndtest] 2013-10-10 14:41:39.233:INFO:oejs.Server:jetty-7.x.y-SNAPSHOT
  [bndtest] 2013-10-10 14:41:39.234:INFO:oejsh.ContextHandler:started o.e.j.s.ServletContextHandler{/,null}
  [bndtest] 2013-10-10 14:41:39.237:INFO:oejs.AbstractConnector:Started SelectChannelConnector@0.0.0.0:8080
  [bndtest] 2013-10-10 14:41:39.263:INFO:oejsh.ContextHandler:stopped o.e.j.s.ServletContextHandler{/,null}
  [bndtest] 2013-10-10 14:41:39.315:INFO:oejs.Server:jetty-7.x.y-SNAPSHOT
  [bndtest] 2013-10-10 14:41:39.315:INFO:oejsh.ContextHandler:started o.e.j.s.ServletContextHandler{/,null}
  [bndtest] 2013-10-10 14:41:39.318:INFO:oejs.AbstractConnector:Started SelectChannelConnector@0.0.0.0:8080
  [bndtest] Got response code 404 for http://localhost:8080/obr/repository.xml
  [bndtest] Bundle Indexer | v2.2
  [bndtest] (c) 2007 OSGi, All Rights Reserved
  [bndtest] Got response code 401 for http://localhost:8080/obr/repository.xml
  [bndtest] 2013-10-10 14:41:39.569:INFO:oejsh.ContextHandler:stopped o.e.j.s.ServletContextHandler{/,null}
  [bndtest] Tests run  : 7
  [bndtest] Passed     : 6
  [bndtest] Errors     : 1
  [bndtest] Failures   : 0
  [bndtest] 1 Error(s)
  [bndtest] Tests failed
  [bndtest] 	at aQute.bnd.ant.TestTask.executeProject(TestTask.java:78)
  [bndtest] 	at aQute.bnd.ant.TestTask.execute(TestTask.java:49)
  [bndtest] 	at org.apache.tools.ant.UnknownElement.execute(UnknownElement.java:291)
  [bndtest] 	at sun.reflect.GeneratedMethodAccessor4.invoke(Unknown Source)
  [bndtest] 	at sun.reflect.DelegatingMethodAccessorImpl.invoke(DelegatingMethodAccessorImpl.java:25)
  [bndtest] 	at java.lang.reflect.Method.invoke(Method.java:597)
  [bndtest] 	at org.apache.tools.ant.dispatch.DispatchUtils.execute(DispatchUtils.java:106)
  [bndtest] 	at org.apache.tools.ant.Task.perform(Task.java:348)
  [bndtest] 	at org.apache.tools.ant.Target.execute(Target.java:390)
  [bndtest] 	at org.apache.tools.ant.Target.performTasks(Target.java:411)
  [bndtest] 	at org.apache.tools.ant.Project.executeSortedTargets(Project.java:1399)
  [bndtest] 	at org.apache.tools.ant.helper.SingleCheckExecutor.executeTargets(SingleCheckExecutor.java:38)
  [bndtest] 	at org.apache.tools.ant.Project.executeTargets(Project.java:1251)
  [bndtest] 	at org.apache.tools.ant.taskdefs.Ant.execute(Ant.java:442)
  [bndtest] 	at org.apache.tools.ant.taskdefs.SubAnt.execute(SubAnt.java:302)
  [bndtest] 	at org.apache.tools.ant.taskdefs.SubAnt.execute(SubAnt.java:221)
  [bndtest] 	at org.apache.tools.ant.UnknownElement.execute(UnknownElement.java:291)
  [bndtest] 	at sun.reflect.GeneratedMethodAccessor4.invoke(Unknown Source)
  [bndtest] 	at sun.reflect.DelegatingMethodAccessorImpl.invoke(DelegatingMethodAccessorImpl.java:25)
  [bndtest] 	at java.lang.reflect.Method.invoke(Method.java:597)
  [bndtest] 	at org.apache.tools.ant.dispatch.DispatchUtils.execute(DispatchUtils.java:106)
  [bndtest] 	at org.apache.tools.ant.Task.perform(Task.java:348)
  [bndtest] 	at org.apache.tools.ant.Target.execute(Target.java:390)
  [bndtest] 	at org.apache.tools.ant.Target.performTasks(Target.java:411)
  [bndtest] 	at org.apache.tools.ant.Project.executeSortedTargets(Project.java:1399)
  [bndtest] 	at org.apache.tools.ant.Project.executeTarget(Project.java:1368)
  [bndtest] 	at org.apache.tools.ant.helper.DefaultExecutor.executeTargets(DefaultExecutor.java:41)
  [bndtest] 	at org.apache.tools.ant.Project.executeTargets(Project.java:1251)
  [bndtest] 	at org.apache.tools.ant.Main.runBuild(Main.java:809)
  [bndtest] 	at org.apache.tools.ant.Main.startAnt(Main.java:217)
  [bndtest] 	at org.apache.tools.ant.launch.Launcher.run(Launcher.java:280)
  [bndtest] 	at org.apache.tools.ant.launch.Launcher.main(Launcher.java:109)

BUILD FAILED
/home/hudson/jenkins-slave/workspace/ACE-trunk/cnf/build.xml:55: The following error occurred
while executing this line:
/home/hudson/jenkins-slave/workspace/ACE-trunk/cnf/build-template.xml:67: Tests failed

Total time: 6 minutes 3 seconds
Build step 'Invoke Ant' marked build as failure
Recording test results
TestNG Reports Processing: START
Looking for TestNG results report in workspace using pattern: **/testng/testng-results.xml
Saving reports...
Processing '/home/hudson/hudson/jobs/ACE-trunk/builds/2013-10-10_14-33-54/testng/testng-results-1.xml'
Processing '/home/hudson/hudson/jobs/ACE-trunk/builds/2013-10-10_14-33-54/testng/testng-results-10.xml'
Processing '/home/hudson/hudson/jobs/ACE-trunk/builds/2013-10-10_14-33-54/testng/testng-results-11.xml'
Processing '/home/hudson/hudson/jobs/ACE-trunk/builds/2013-10-10_14-33-54/testng/testng-results-12.xml'
Processing '/home/hudson/hudson/jobs/ACE-trunk/builds/2013-10-10_14-33-54/testng/testng-results-13.xml'
Processing '/home/hudson/hudson/jobs/ACE-trunk/builds/2013-10-10_14-33-54/testng/testng-results-14.xml'
Processing '/home/hudson/hudson/jobs/ACE-trunk/builds/2013-10-10_14-33-54/testng/testng-results-15.xml'
Processing '/home/hudson/hudson/jobs/ACE-trunk/builds/2013-10-10_14-33-54/testng/testng-results-16.xml'
Processing '/home/hudson/hudson/jobs/ACE-trunk/builds/2013-10-10_14-33-54/testng/testng-results-17.xml'
Processing '/home/hudson/hudson/jobs/ACE-trunk/builds/2013-10-10_14-33-54/testng/testng-results-2.xml'
Processing '/home/hudson/hudson/jobs/ACE-trunk/builds/2013-10-10_14-33-54/testng/testng-results-3.xml'
Processing '/home/hudson/hudson/jobs/ACE-trunk/builds/2013-10-10_14-33-54/testng/testng-results-4.xml'
Processing '/home/hudson/hudson/jobs/ACE-trunk/builds/2013-10-10_14-33-54/testng/testng-results-5.xml'
Processing '/home/hudson/hudson/jobs/ACE-trunk/builds/2013-10-10_14-33-54/testng/testng-results-6.xml'
Processing '/home/hudson/hudson/jobs/ACE-trunk/builds/2013-10-10_14-33-54/testng/testng-results-7.xml'
Processing '/home/hudson/hudson/jobs/ACE-trunk/builds/2013-10-10_14-33-54/testng/testng-results-8.xml'
Processing '/home/hudson/hudson/jobs/ACE-trunk/builds/2013-10-10_14-33-54/testng/testng-results-9.xml'
Processing '/home/hudson/hudson/jobs/ACE-trunk/builds/2013-10-10_14-33-54/testng/testng-results.xml'
TestNG Reports Processing: FINISH

Mime
View raw message