ace-dev mailing list archives

Site index · List index
Message view « Date » · « Thread »
Top « Date » · « Thread »
From Apache Jenkins Server <jenk...@builds.apache.org>
Subject Build failed in Jenkins: ACE-trunk #125
Date Wed, 16 Oct 2013 11:57:05 GMT
See <https://builds.apache.org/job/ACE-trunk/125/changes>

Changes:

[jawi] ACE-419: Some additional documentation added.

------------------------------------------
[...truncated 50250 lines...]
  [bndtest] 	at org.apache.ace.agent.impl.DeploymentHandlerImpl.getAvailableVersions(Unknown
Source)
  [bndtest] 	at org.apache.ace.agent.impl.UpdateHandlerBase.getHighestAvailableVersion(Unknown
Source)
  [bndtest] 	at org.apache.ace.agent.impl.DefaultController$UpdateInstaller.installUpdate(Unknown
Source)
  [bndtest] 	at org.apache.ace.agent.impl.DefaultController.runDeploymentUpdate(Unknown Source)
  [bndtest] 	at org.apache.ace.agent.impl.DefaultController.run(Unknown Source)
  [bndtest] 	at java.util.concurrent.Executors$RunnableAdapter.call(Executors.java:439)
  [bndtest] 	at java.util.concurrent.FutureTask$Sync.innerRun(FutureTask.java:303)
  [bndtest] 	at java.util.concurrent.FutureTask.run(FutureTask.java:138)
  [bndtest] 	at java.util.concurrent.ScheduledThreadPoolExecutor$ScheduledFutureTask.access$301(ScheduledThreadPoolExecutor.java:98)
  [bndtest] 	at java.util.concurrent.ScheduledThreadPoolExecutor$ScheduledFutureTask.run(ScheduledThreadPoolExecutor.java:206)
  [bndtest] 	at java.util.concurrent.ThreadPoolExecutor$Worker.runTask(ThreadPoolExecutor.java:895)
  [bndtest] 	at java.util.concurrent.ThreadPoolExecutor$Worker.run(ThreadPoolExecutor.java:918)
  [bndtest] 	at java.lang.Thread.run(Thread.java:662)
  [bndtest] [WARNING] 11:55:10 (controller) Exception while sending feedback for channel:
auditlog
  [bndtest] java.io.IOException: Unable to handle server responsecode: 404, for http://localhost:8080/auditlog/send
  [bndtest] 	at org.apache.ace.agent.impl.ConnectionUtil.checkConnectionResponse(Unknown Source)
  [bndtest] 	at org.apache.ace.agent.impl.FeedbackChannelImpl.sendFeedback(Unknown Source)
  [bndtest] 	at org.apache.ace.agent.impl.DefaultController.runFeedback(Unknown Source)
  [bndtest] 	at org.apache.ace.agent.impl.DefaultController.run(Unknown Source)
  [bndtest] 	at java.util.concurrent.Executors$RunnableAdapter.call(Executors.java:439)
  [bndtest] 	at java.util.concurrent.FutureTask$Sync.innerRun(FutureTask.java:303)
  [bndtest] 	at java.util.concurrent.FutureTask.run(FutureTask.java:138)
  [bndtest] 	at java.util.concurrent.ScheduledThreadPoolExecutor$ScheduledFutureTask.access$301(ScheduledThreadPoolExecutor.java:98)
  [bndtest] 	at java.util.concurrent.ScheduledThreadPoolExecutor$ScheduledFutureTask.run(ScheduledThreadPoolExecutor.java:206)
  [bndtest] 	at java.util.concurrent.ThreadPoolExecutor$Worker.runTask(ThreadPoolExecutor.java:895)
  [bndtest] 	at java.util.concurrent.ThreadPoolExecutor$Worker.run(ThreadPoolExecutor.java:918)
  [bndtest] 	at java.lang.Thread.run(Thread.java:662)
  [bndtest] [ERROR] 11:55:10 (controller) Agent update aborted due to Exception.
  [bndtest] java.io.IOException: Unable to handle server responsecode: 404, for http://localhost:8080/agent/007/org.apache.ace.agent/versions/
  [bndtest] 	at org.apache.ace.agent.impl.ConnectionUtil.checkConnectionResponse(Unknown Source)
  [bndtest] 	at org.apache.ace.agent.impl.UpdateHandlerBase.getAvailableVersions(Unknown Source)
  [bndtest] 	at org.apache.ace.agent.impl.AgentUpdateHandlerImpl.getAvailableVersions(Unknown
Source)
  [bndtest] 	at org.apache.ace.agent.impl.UpdateHandlerBase.getHighestAvailableVersion(Unknown
Source)
  [bndtest] 	at org.apache.ace.agent.impl.DefaultController$UpdateInstaller.installUpdate(Unknown
Source)
  [bndtest] 	at org.apache.ace.agent.impl.DefaultController.runAgentUpdate(Unknown Source)
  [bndtest] 	at org.apache.ace.agent.impl.DefaultController.run(Unknown Source)
  [bndtest] 	at java.util.concurrent.Executors$RunnableAdapter.call(Executors.java:439)
  [bndtest] 	at java.util.concurrent.FutureTask$Sync.innerRun(FutureTask.java:303)
  [bndtest] 	at java.util.concurrent.FutureTask.run(FutureTask.java:138)
  [bndtest] 	at java.util.concurrent.ScheduledThreadPoolExecutor$ScheduledFutureTask.access$301(ScheduledThreadPoolExecutor.java:98)
  [bndtest] 	at java.util.concurrent.ScheduledThreadPoolExecutor$ScheduledFutureTask.run(ScheduledThreadPoolExecutor.java:206)
  [bndtest] 	at java.util.concurrent.ThreadPoolExecutor$Worker.runTask(ThreadPoolExecutor.java:895)
  [bndtest] 	at java.util.concurrent.ThreadPoolExecutor$Worker.run(ThreadPoolExecutor.java:918)
  [bndtest] 	at java.lang.Thread.run(Thread.java:662)
  [bndtest] [ERROR] 11:55:10 (controller) Deployment update aborted due to Exception.
  [bndtest] java.io.IOException: Unable to handle server responsecode: 404, for http://localhost:8080/deployment/007/versions/
  [bndtest] 	at org.apache.ace.agent.impl.ConnectionUtil.checkConnectionResponse(Unknown Source)
  [bndtest] 	at org.apache.ace.agent.impl.UpdateHandlerBase.getAvailableVersions(Unknown Source)
  [bndtest] 	at org.apache.ace.agent.impl.DeploymentHandlerImpl.getAvailableVersions(Unknown
Source)
  [bndtest] 	at org.apache.ace.agent.impl.UpdateHandlerBase.getHighestAvailableVersion(Unknown
Source)
  [bndtest] 	at org.apache.ace.agent.impl.DefaultController$UpdateInstaller.installUpdate(Unknown
Source)
  [bndtest] 	at org.apache.ace.agent.impl.DefaultController.runDeploymentUpdate(Unknown Source)
  [bndtest] 	at org.apache.ace.agent.impl.DefaultController.run(Unknown Source)
  [bndtest] 	at java.util.concurrent.Executors$RunnableAdapter.call(Executors.java:439)
  [bndtest] 	at java.util.concurrent.FutureTask$Sync.innerRun(FutureTask.java:303)
  [bndtest] 	at java.util.concurrent.FutureTask.run(FutureTask.java:138)
  [bndtest] 	at java.util.concurrent.ScheduledThreadPoolExecutor$ScheduledFutureTask.access$301(ScheduledThreadPoolExecutor.java:98)
  [bndtest] 	at java.util.concurrent.ScheduledThreadPoolExecutor$ScheduledFutureTask.run(ScheduledThreadPoolExecutor.java:206)
  [bndtest] 	at java.util.concurrent.ThreadPoolExecutor$Worker.runTask(ThreadPoolExecutor.java:895)
  [bndtest] 	at java.util.concurrent.ThreadPoolExecutor$Worker.run(ThreadPoolExecutor.java:918)
  [bndtest] 	at java.lang.Thread.run(Thread.java:662)
  [bndtest] [WARNING] 11:55:11 (controller) Exception while sending feedback for channel:
auditlog
  [bndtest] java.io.IOException: Unable to handle server responsecode: 404, for http://localhost:8080/auditlog/send
  [bndtest] 	at org.apache.ace.agent.impl.ConnectionUtil.checkConnectionResponse(Unknown Source)
  [bndtest] 	at org.apache.ace.agent.impl.FeedbackChannelImpl.sendFeedback(Unknown Source)
  [bndtest] 	at org.apache.ace.agent.impl.DefaultController.runFeedback(Unknown Source)
  [bndtest] 	at org.apache.ace.agent.impl.DefaultController.run(Unknown Source)
  [bndtest] 	at java.util.concurrent.Executors$RunnableAdapter.call(Executors.java:439)
  [bndtest] 	at java.util.concurrent.FutureTask$Sync.innerRun(FutureTask.java:303)
  [bndtest] 	at java.util.concurrent.FutureTask.run(FutureTask.java:138)
  [bndtest] 	at java.util.concurrent.ScheduledThreadPoolExecutor$ScheduledFutureTask.access$301(ScheduledThreadPoolExecutor.java:98)
  [bndtest] 	at java.util.concurrent.ScheduledThreadPoolExecutor$ScheduledFutureTask.run(ScheduledThreadPoolExecutor.java:206)
  [bndtest] 	at java.util.concurrent.ThreadPoolExecutor$Worker.runTask(ThreadPoolExecutor.java:895)
  [bndtest] 	at java.util.concurrent.ThreadPoolExecutor$Worker.run(ThreadPoolExecutor.java:918)
  [bndtest] 	at java.lang.Thread.run(Thread.java:662)
  [bndtest] [ERROR] 11:55:11 (controller) Agent update aborted due to Exception.
  [bndtest] java.io.IOException: Unable to handle server responsecode: 404, for http://localhost:8080/agent/007/org.apache.ace.agent/versions/
  [bndtest] 	at org.apache.ace.agent.impl.ConnectionUtil.checkConnectionResponse(Unknown Source)
  [bndtest] 	at org.apache.ace.agent.impl.UpdateHandlerBase.getAvailableVersions(Unknown Source)
  [bndtest] 	at org.apache.ace.agent.impl.AgentUpdateHandlerImpl.getAvailableVersions(Unknown
Source)
  [bndtest] 	at org.apache.ace.agent.impl.UpdateHandlerBase.getHighestAvailableVersion(Unknown
Source)
  [bndtest] 	at org.apache.ace.agent.impl.DefaultController$UpdateInstaller.installUpdate(Unknown
Source)
  [bndtest] 	at org.apache.ace.agent.impl.DefaultController.runAgentUpdate(Unknown Source)
  [bndtest] 	at org.apache.ace.agent.impl.DefaultController.run(Unknown Source)
  [bndtest] 	at java.util.concurrent.Executors$RunnableAdapter.call(Executors.java:439)
  [bndtest] 	at java.util.concurrent.FutureTask$Sync.innerRun(FutureTask.java:303)
  [bndtest] 	at java.util.concurrent.FutureTask.run(FutureTask.java:138)
  [bndtest] 	at java.util.concurrent.ScheduledThreadPoolExecutor$ScheduledFutureTask.access$301(ScheduledThreadPoolExecutor.java:98)
  [bndtest] 	at java.util.concurrent.ScheduledThreadPoolExecutor$ScheduledFutureTask.run(ScheduledThreadPoolExecutor.java:206)
  [bndtest] 	at java.util.concurrent.ThreadPoolExecutor$Worker.runTask(ThreadPoolExecutor.java:895)
  [bndtest] 	at java.util.concurrent.ThreadPoolExecutor$Worker.run(ThreadPoolExecutor.java:918)
  [bndtest] 	at java.lang.Thread.run(Thread.java:662)
  [bndtest] [ERROR] 11:55:11 (controller) Deployment update aborted due to Exception.
  [bndtest] java.io.IOException: Unable to handle server responsecode: 404, for http://localhost:8080/deployment/007/versions/
  [bndtest] 	at org.apache.ace.agent.impl.ConnectionUtil.checkConnectionResponse(Unknown Source)
  [bndtest] 	at org.apache.ace.agent.impl.UpdateHandlerBase.getAvailableVersions(Unknown Source)
  [bndtest] 	at org.apache.ace.agent.impl.DeploymentHandlerImpl.getAvailableVersions(Unknown
Source)
  [bndtest] 	at org.apache.ace.agent.impl.UpdateHandlerBase.getHighestAvailableVersion(Unknown
Source)
  [bndtest] 	at org.apache.ace.agent.impl.DefaultController$UpdateInstaller.installUpdate(Unknown
Source)
  [bndtest] 	at org.apache.ace.agent.impl.DefaultController.runDeploymentUpdate(Unknown Source)
  [bndtest] 	at org.apache.ace.agent.impl.DefaultController.run(Unknown Source)
  [bndtest] 	at java.util.concurrent.Executors$RunnableAdapter.call(Executors.java:439)
  [bndtest] 	at java.util.concurrent.FutureTask$Sync.innerRun(FutureTask.java:303)
  [bndtest] 	at java.util.concurrent.FutureTask.run(FutureTask.java:138)
  [bndtest] 	at java.util.concurrent.ScheduledThreadPoolExecutor$ScheduledFutureTask.access$301(ScheduledThreadPoolExecutor.java:98)
  [bndtest] 	at java.util.concurrent.ScheduledThreadPoolExecutor$ScheduledFutureTask.run(ScheduledThreadPoolExecutor.java:206)
  [bndtest] 	at java.util.concurrent.ThreadPoolExecutor$Worker.runTask(ThreadPoolExecutor.java:895)
  [bndtest] 	at java.util.concurrent.ThreadPoolExecutor$Worker.run(ThreadPoolExecutor.java:918)
  [bndtest] 	at java.lang.Thread.run(Thread.java:662)
  [bndtest] [INFO] 11:55:17 (controller) Starting download of deployment update, 0.0.0 =>
5.0.0...
  [bndtest] [INFO] 11:55:17 (controller) Progress of deployment update download: 2818 of 2818
bytes...
  [bndtest] [INFO] 11:55:18 (controller) Installing deployment update 0.0.0 => 5.0.0...
  [bndtest] [WARNING] 11:55:18 (deployment) Could not start bundle 'test.bundle3'
  [bndtest] org.osgi.framework.BundleException: Unresolved constraint in bundle test.bundle3
[18]: Unable to resolve 18.0: missing requirement [18.0] osgi.wiring.package; (osgi.wiring.package=no.such)
  [bndtest] 	at org.apache.felix.framework.Felix.resolveBundleRevision(Felix.java:3826)
  [bndtest] 	at org.apache.felix.framework.Felix.startBundle(Felix.java:1868)
  [bndtest] 	at org.apache.felix.framework.BundleImpl.start(BundleImpl.java:944)
  [bndtest] 	at org.apache.felix.framework.BundleImpl.start(BundleImpl.java:931)
  [bndtest] 	at org.apache.felix.deploymentadmin.spi.StartBundleCommand.execute(StartBundleCommand.java:55)
  [bndtest] 	at org.apache.felix.deploymentadmin.spi.DeploymentSessionImpl.call(DeploymentSessionImpl.java:73)
  [bndtest] 	at org.apache.felix.deploymentadmin.DeploymentAdminImpl.installDeploymentPackage(DeploymentAdminImpl.java:214)
  [bndtest] 	at org.apache.ace.agent.impl.DeploymentHandlerImpl.install(Unknown Source)
  [bndtest] 	at org.apache.ace.agent.impl.DefaultController$DownloadUpdateInstaller.doInstallUpdate(Unknown
Source)
  [bndtest] 	at org.apache.ace.agent.impl.DefaultController$UpdateInstaller.installUpdate(Unknown
Source)
  [bndtest] 	at org.apache.ace.agent.impl.DefaultController.runDeploymentUpdate(Unknown Source)
  [bndtest] 	at org.apache.ace.agent.impl.DefaultController.run(Unknown Source)
  [bndtest] 	at java.util.concurrent.Executors$RunnableAdapter.call(Executors.java:439)
  [bndtest] 	at java.util.concurrent.FutureTask$Sync.innerRun(FutureTask.java:303)
  [bndtest] 	at java.util.concurrent.FutureTask.run(FutureTask.java:138)
  [bndtest] 	at java.util.concurrent.ScheduledThreadPoolExecutor$ScheduledFutureTask.access$301(ScheduledThreadPoolExecutor.java:98)
  [bndtest] 	at java.util.concurrent.ScheduledThreadPoolExecutor$ScheduledFutureTask.run(ScheduledThreadPoolExecutor.java:206)
  [bndtest] 	at java.util.concurrent.ThreadPoolExecutor$Worker.runTask(ThreadPoolExecutor.java:895)
  [bndtest] 	at java.util.concurrent.ThreadPoolExecutor$Worker.run(ThreadPoolExecutor.java:918)
  [bndtest] 	at java.lang.Thread.run(Thread.java:662)
  [bndtest] [INFO] 11:55:19 (controller) Starting download of deployment update, 5.0.0 =>
6.0.0...
  [bndtest] [INFO] 11:55:19 (controller) Progress of deployment update download: 2779 of 2779
bytes...
  [bndtest] [INFO] 11:55:20 (controller) Installing deployment update 5.0.0 => 6.0.0...
  [bndtest] [WARNING] 11:55:20 (deployment) Could not get reference to storage area of bundle
'test.bundle3'
  [bndtest] [WARNING] 11:55:20 (deployment) Could not retrieve storage area of bundle 'test.bundle3',
skipping it.
  [bndtest] [INFO] 11:55:25 (controller) Starting download of deployment update, 0.0.0 =>
6.0.0...
  [bndtest] [INFO] 11:55:25 (controller) Progress of deployment update download: 2778 of 2778
bytes...
  [bndtest] [INFO] 11:55:26 (controller) Installing deployment update 0.0.0 => 6.0.0...
  [bndtest] [INFO] 11:55:31 (controller) Starting download of deployment update, 0.0.0 =>
5.0.0...
  [bndtest] [INFO] 11:55:31 (controller) Progress of deployment update download: 1409 of 1409
bytes...
  [bndtest] [INFO] 11:55:32 (controller) Installing deployment update 0.0.0 => 5.0.0...
  [bndtest] [INFO] 11:55:32 (controller) Cancelling deployment package download for version
5.0.0 because of reset...
  [bndtest] [INFO] 11:55:38 (controller) Starting download of deployment update, 0.0.0 =>
4.0.0...
  [bndtest] [INFO] 11:55:38 (controller) Progress of deployment update download: 1951 of 1951
bytes...
  [bndtest] [INFO] 11:55:39 (controller) Installing deployment update 0.0.0 => 4.0.0...
  [bndtest] [ERROR] 11:55:39 (deployment) Stream does not contain a valid deployment package:
missing manifest!
  [bndtest] [INFO] 11:55:39 (controller) Cancelling deployment package download for version
4.0.0 because of reset...
  [bndtest] [INFO] 11:55:44 (controller) Starting download of deployment update, 0.0.0 =>
2.0.0...
  [bndtest] [WARNING] 11:55:45 (controller) Sync received retry exception from server. Rescheduled
in 1 seconds
  [bndtest] [INFO] 11:55:46 (controller) Starting download of deployment update, 0.0.0 =>
2.0.0...
  [bndtest] [INFO] 11:55:46 (controller) Progress of deployment update download: 1099 of 1099
bytes...
  [bndtest] [INFO] 11:55:47 (controller) Installing deployment update 0.0.0 => 2.0.0...
  [bndtest] [INFO] 11:55:52 (controller) Starting download of deployment update, 0.0.0 =>
3.0.0...
  [bndtest] [INFO] 11:55:53 (controller) Installing deployment update 0.0.0 => 3.0.0...
  [bndtest] [ERROR] 11:55:53 (deployment) Stream does not contain a valid deployment package:
missing manifest!
  [bndtest] [INFO] 11:55:53 (controller) Cancelling deployment package download for version
3.0.0 because of reset...
  [bndtest] [WARNING] 11:55:58 (controller) Sync received retry exception from server. Rescheduled
in 1 seconds
  [bndtest] [INFO] 11:55:59 (controller) Starting download of deployment update, 0.0.0 =>
1.0.0...
  [bndtest] [INFO] 11:55:59 (controller) Progress of deployment update download: 1096 of 1096
bytes...
  [bndtest] [INFO] 11:56:00 (controller) Installing deployment update 0.0.0 => 1.0.0...
  [bndtest] [INFO] 11:56:05 (controller) Starting download of deployment update, 0.0.0 =>
6.0.0...
  [bndtest] [INFO] 11:56:05 (controller) Progress of deployment update download: 1389 of 2779
bytes...
  [bndtest] [INFO] 11:56:05 (controller) Progress of deployment update download: 2779 of 2779
bytes...
  [bndtest] [INFO] 11:56:06 (controller) Installing deployment update 0.0.0 => 6.0.0...
  [bndtest] [INFO] 11:56:11 (controller) Installing streaming deployment update 0.0.0 =>
6.0.0
  [bndtest] [INFO] 11:56:16 (controller) Installing streaming deployment update 0.0.0 =>
5.0.0
  [bndtest] [INFO] 11:56:21 (controller) Installing streaming deployment update 0.0.0 =>
4.0.0
  [bndtest] [ERROR] 11:56:21 (deployment) Stream does not contain a valid deployment package:
missing manifest!
  [bndtest] [INFO] 11:56:26 (controller) Installing streaming deployment update 0.0.0 =>
2.0.0
  [bndtest] [WARNING] 11:56:26 (controller) Sync received retry exception from server. Rescheduled
in 1 seconds
  [bndtest] [INFO] 11:56:27 (controller) Installing streaming deployment update 0.0.0 =>
2.0.0
  [bndtest] [INFO] 11:56:32 (controller) Installing streaming deployment update 0.0.0 =>
3.0.0
  [bndtest] [ERROR] 11:56:32 (deployment) Stream does not contain a valid deployment package:
missing manifest!
  [bndtest] [WARNING] 11:56:37 (controller) Sync received retry exception from server. Rescheduled
in 1 seconds
  [bndtest] [INFO] 11:56:38 (controller) Installing streaming deployment update 0.0.0 =>
1.0.0
  [bndtest] [INFO] 11:56:43 (controller) Installing streaming deployment update 0.0.0 =>
1.0.0
  [bndtest] [INFO] 11:56:48 (controller) Installing streaming deployment update 0.0.0 =>
1.0.0
  [bndtest] [INFO] 11:56:49 (controller) Installing streaming deployment update 1.0.0 =>
6.0.0
  [bndtest] [ERROR] 11:56:49 (deployment) Stream does not contain a valid deployment package:
missing manifest!
  [bndtest] Errors: 0
  [bndtest] Failures: 2
  [bndtest] 2 Error(s)
  [bndtest] Tests failed
  [bndtest] 	at aQute.bnd.ant.TestTask.executeProject(TestTask.java:78)
  [bndtest] 	at aQute.bnd.ant.TestTask.execute(TestTask.java:49)
  [bndtest] 	at org.apache.tools.ant.UnknownElement.execute(UnknownElement.java:291)
  [bndtest] 	at sun.reflect.GeneratedMethodAccessor4.invoke(Unknown Source)
  [bndtest] 	at sun.reflect.DelegatingMethodAccessorImpl.invoke(DelegatingMethodAccessorImpl.java:25)
  [bndtest] 	at java.lang.reflect.Method.invoke(Method.java:597)
  [bndtest] 	at org.apache.tools.ant.dispatch.DispatchUtils.execute(DispatchUtils.java:106)
  [bndtest] 	at org.apache.tools.ant.Task.perform(Task.java:348)
  [bndtest] 	at org.apache.tools.ant.Target.execute(Target.java:390)
  [bndtest] 	at org.apache.tools.ant.Target.performTasks(Target.java:411)
  [bndtest] 	at org.apache.tools.ant.Project.executeSortedTargets(Project.java:1399)
  [bndtest] 	at org.apache.tools.ant.helper.SingleCheckExecutor.executeTargets(SingleCheckExecutor.java:38)
  [bndtest] 	at org.apache.tools.ant.Project.executeTargets(Project.java:1251)
  [bndtest] 	at org.apache.tools.ant.taskdefs.Ant.execute(Ant.java:442)
  [bndtest] 	at org.apache.tools.ant.taskdefs.SubAnt.execute(SubAnt.java:302)
  [bndtest] 	at org.apache.tools.ant.taskdefs.SubAnt.execute(SubAnt.java:221)
  [bndtest] 	at org.apache.tools.ant.UnknownElement.execute(UnknownElement.java:291)
  [bndtest] 	at sun.reflect.GeneratedMethodAccessor4.invoke(Unknown Source)
  [bndtest] 	at sun.reflect.DelegatingMethodAccessorImpl.invoke(DelegatingMethodAccessorImpl.java:25)
  [bndtest] 	at java.lang.reflect.Method.invoke(Method.java:597)
  [bndtest] 	at org.apache.tools.ant.dispatch.DispatchUtils.execute(DispatchUtils.java:106)
  [bndtest] 	at org.apache.tools.ant.Task.perform(Task.java:348)
  [bndtest] 	at org.apache.tools.ant.Target.execute(Target.java:390)
  [bndtest] 	at org.apache.tools.ant.Target.performTasks(Target.java:411)
  [bndtest] 	at org.apache.tools.ant.Project.executeSortedTargets(Project.java:1399)
  [bndtest] 	at org.apache.tools.ant.Project.executeTarget(Project.java:1368)
  [bndtest] 	at org.apache.tools.ant.helper.DefaultExecutor.executeTargets(DefaultExecutor.java:41)
  [bndtest] 	at org.apache.tools.ant.Project.executeTargets(Project.java:1251)
  [bndtest] 	at org.apache.tools.ant.Main.runBuild(Main.java:809)
  [bndtest] 	at org.apache.tools.ant.Main.startAnt(Main.java:217)
  [bndtest] 	at org.apache.tools.ant.launch.Launcher.run(Launcher.java:280)
  [bndtest] 	at org.apache.tools.ant.launch.Launcher.main(Launcher.java:109)

BUILD FAILED
/x1/jenkins/jenkins-slave/workspace/ACE-trunk/cnf/build.xml:55: The following error occurred
while executing this line:
/x1/jenkins/jenkins-slave/workspace/ACE-trunk/cnf/build-template.xml:67: Tests failed

Total time: 22 minutes 1 second
Build step 'Invoke Ant' marked build as failure
Recording test results
TestNG Reports Processing: START
Looking for TestNG results report in workspace using pattern: **/testng/testng-results.xml
Saving reports...
Processing '/home/hudson/hudson/jobs/ACE-trunk/builds/2013-10-16_11-34-43/testng/testng-results-1.xml'
Processing '/home/hudson/hudson/jobs/ACE-trunk/builds/2013-10-16_11-34-43/testng/testng-results-10.xml'
Processing '/home/hudson/hudson/jobs/ACE-trunk/builds/2013-10-16_11-34-43/testng/testng-results-11.xml'
Processing '/home/hudson/hudson/jobs/ACE-trunk/builds/2013-10-16_11-34-43/testng/testng-results-12.xml'
Processing '/home/hudson/hudson/jobs/ACE-trunk/builds/2013-10-16_11-34-43/testng/testng-results-13.xml'
Processing '/home/hudson/hudson/jobs/ACE-trunk/builds/2013-10-16_11-34-43/testng/testng-results-14.xml'
Processing '/home/hudson/hudson/jobs/ACE-trunk/builds/2013-10-16_11-34-43/testng/testng-results-15.xml'
Processing '/home/hudson/hudson/jobs/ACE-trunk/builds/2013-10-16_11-34-43/testng/testng-results-16.xml'
Processing '/home/hudson/hudson/jobs/ACE-trunk/builds/2013-10-16_11-34-43/testng/testng-results-17.xml'
Processing '/home/hudson/hudson/jobs/ACE-trunk/builds/2013-10-16_11-34-43/testng/testng-results-2.xml'
Processing '/home/hudson/hudson/jobs/ACE-trunk/builds/2013-10-16_11-34-43/testng/testng-results-3.xml'
Processing '/home/hudson/hudson/jobs/ACE-trunk/builds/2013-10-16_11-34-43/testng/testng-results-4.xml'
Processing '/home/hudson/hudson/jobs/ACE-trunk/builds/2013-10-16_11-34-43/testng/testng-results-5.xml'
Processing '/home/hudson/hudson/jobs/ACE-trunk/builds/2013-10-16_11-34-43/testng/testng-results-6.xml'
Processing '/home/hudson/hudson/jobs/ACE-trunk/builds/2013-10-16_11-34-43/testng/testng-results-7.xml'
Processing '/home/hudson/hudson/jobs/ACE-trunk/builds/2013-10-16_11-34-43/testng/testng-results-8.xml'
Processing '/home/hudson/hudson/jobs/ACE-trunk/builds/2013-10-16_11-34-43/testng/testng-results-9.xml'
Processing '/home/hudson/hudson/jobs/ACE-trunk/builds/2013-10-16_11-34-43/testng/testng-results.xml'
TestNG Reports Processing: FINISH

Mime
View raw message