ace-dev mailing list archives

Site index · List index
Message view « Date » · « Thread »
Top « Date » · « Thread »
From Apache Jenkins Server <jenk...@builds.apache.org>
Subject Build failed in Jenkins: ACE-trunk #122
Date Tue, 15 Oct 2013 15:42:21 GMT
See <https://builds.apache.org/job/ACE-trunk/122/changes>

Changes:

[marrs] ACE-373 Implementation now makes sure it always selects the latest version of a resource
processor, and that this triggers a change. Extended an existing test to also validate this
behaviour.

------------------------------------------
[...truncated 3219 lines...]
  [bndtest] 2013-10-15 15:42:09.464:INFO:oejsh.ContextHandler:stopped o.e.j.s.ServletContextHandler{/,null}
  [bndtest] 2013-10-15 15:42:09.516:INFO:oejs.Server:jetty-7.x.y-SNAPSHOT
  [bndtest] 2013-10-15 15:42:09.516:INFO:oejsh.ContextHandler:started o.e.j.s.ServletContextHandler{/,null}
  [bndtest] 2013-10-15 15:42:09.519:INFO:oejs.AbstractConnector:Started SelectChannelConnector@0.0.0.0:8080
  [bndtest] 2013-10-15 15:42:09.544:INFO:oejsh.ContextHandler:stopped o.e.j.s.ServletContextHandler{/,null}
  [bndtest] 2013-10-15 15:42:09.596:INFO:oejs.Server:jetty-7.x.y-SNAPSHOT
  [bndtest] 2013-10-15 15:42:09.598:INFO:oejsh.ContextHandler:started o.e.j.s.ServletContextHandler{/,null}
  [bndtest] 2013-10-15 15:42:09.601:INFO:oejs.AbstractConnector:Started SelectChannelConnector@0.0.0.0:8080
  [bndtest] Got response code 404 for http://localhost:8080/obr/repository.xml
  [bndtest] Bundle Indexer | v2.2
  [bndtest] (c) 2007 OSGi, All Rights Reserved
  [bndtest] Got response code 401 for http://localhost:8080/obr/repository.xml
  [bndtest] Log:
  [bndtest]  * Tue Oct 15 15:42:09 UTC 2013 - Error storing artifact: Error importing artifact
file:/tmp/org.apache.ace.test11773893907756671081.jar: Socket Closed - 21
  [bndtest] org.apache.felix.log.LogException: java.io.IOException: Error importing artifact
file:/tmp/org.apache.ace.test11773893907756671081.jar: Socket Closed
  [bndtest] 	at org.apache.ace.client.repository.impl.ArtifactRepositoryImpl.upload(ArtifactRepositoryImpl.java:481)
  [bndtest] 	at org.apache.ace.client.repository.impl.ArtifactRepositoryImpl.importArtifact(ArtifactRepositoryImpl.java:353)
  [bndtest] 	at org.apache.ace.client.repository.impl.ArtifactRepositoryImpl.importArtifact(ArtifactRepositoryImpl.java:296)
  [bndtest] 	at org.apache.ace.it.authentication.ObrAuthenticationTest.testImportArtifactWithCredentialsOk(ObrAuthenticationTest.java:257)
  [bndtest] 	at sun.reflect.NativeMethodAccessorImpl.invoke0(Native Method)
  [bndtest] 	at sun.reflect.NativeMethodAccessorImpl.invoke(NativeMethodAccessorImpl.java:39)
  [bndtest] 	at sun.reflect.DelegatingMethodAccessorImpl.invoke(DelegatingMethodAccessorImpl.java:25)
  [bndtest] 	at java.lang.reflect.Method.invoke(Method.java:597)
  [bndtest] 	at junit.framework.TestCase.runTest(TestCase.java:168)
  [bndtest] 	at junit.framework.TestCase.runBare(TestCase.java:134)
  [bndtest] 	at junit.framework.TestResult$1.protect(TestResult.java:110)
  [bndtest] 	at junit.framework.TestResult.runProtected(TestResult.java:128)
  [bndtest] 	at junit.framework.TestResult.run(TestResult.java:113)
  [bndtest] 	at junit.framework.TestCase.run(TestCase.java:124)
  [bndtest] 	at junit.framework.TestSuite.runTest(TestSuite.java:243)
  [bndtest] 	at junit.framework.TestSuite.run(TestSuite.java:238)
  [bndtest] 	at junit.framework.TestSuite.runTest(TestSuite.java:243)
  [bndtest] 	at junit.framework.TestSuite.run(TestSuite.java:238)
  [bndtest] 	at aQute.junit.Activator.test(Activator.java:258)
  [bndtest] 	at aQute.junit.Activator.automatic(Activator.java:149)
  [bndtest] 	at aQute.junit.Activator.run(Activator.java:83)
  [bndtest] 	at aQute.launcher.Launcher.run(Launcher.java:176)
  [bndtest] 	at aQute.launcher.Launcher.main(Launcher.java:80)
  [bndtest] Caused by: java.net.SocketException: Socket Closed
  [bndtest] 	at java.net.PlainSocketImpl.getOption(PlainSocketImpl.java:286)
  [bndtest] 	at java.net.Socket.getSoTimeout(Socket.java:1032)
  [bndtest] 	at sun.net.www.http.HttpClient.available(HttpClient.java:356)
  [bndtest] 	at sun.net.www.http.HttpClient.New(HttpClient.java:273)
  [bndtest] 	at sun.net.www.http.HttpClient.New(HttpClient.java:310)
  [bndtest] 	at sun.net.www.protocol.http.HttpURLConnection.getNewHttpClient(HttpURLConnection.java:987)
  [bndtest] 	at sun.net.www.protocol.http.HttpURLConnection.plainConnect(HttpURLConnection.java:923)
  [bndtest] 	at sun.net.www.protocol.http.HttpURLConnection.connect(HttpURLConnection.java:841)
  [bndtest] 	at sun.net.www.protocol.http.HttpURLConnection.getOutputStream(HttpURLConnection.java:1031)
  [bndtest] 	at org.apache.ace.client.repository.impl.ArtifactRepositoryImpl.upload(ArtifactRepositoryImpl.java:456)
  [bndtest] 	... 22 more
  [bndtest]  * Tue Oct 15 15:42:09 UTC 2013 - Authentication failure! - 39
  [bndtest]  * Tue Oct 15 15:42:09 UTC 2013 - Authentication failure! - 39
  [bndtest]  * Tue Oct 15 15:42:09 UTC 2013 - ServiceEvent REGISTERED - 40
  [bndtest]  * Tue Oct 15 15:42:09 UTC 2013 - ServiceEvent REGISTERED - 39
  [bndtest]  * Tue Oct 15 15:42:09 UTC 2013 - ServiceEvent REGISTERED - 23
  [bndtest]  * Tue Oct 15 15:42:09 UTC 2013 - ServiceEvent REGISTERED - 43
  [bndtest]  * Tue Oct 15 15:42:09 UTC 2013 - Started jetty 7.x.y-SNAPSHOT at port(s) HTTP:8080
on context path / - 8
  [bndtest]  * Tue Oct 15 15:42:09 UTC 2013 - ServiceEvent REGISTERED - 8
  [bndtest]  * Tue Oct 15 15:42:09 UTC 2013 - ServiceEvent REGISTERED - 8
  [bndtest]  * Tue Oct 15 15:42:09 UTC 2013 - ServiceEvent UNREGISTERING - 8
  [bndtest]  * Tue Oct 15 15:42:09 UTC 2013 - ServiceEvent UNREGISTERING - 8
  [bndtest]  * Tue Oct 15 15:42:09 UTC 2013 - Started jetty 7.x.y-SNAPSHOT at port(s) HTTP:8080
on context path / - 8
  [bndtest]  * Tue Oct 15 15:42:09 UTC 2013 - ServiceEvent REGISTERED - 8
  [bndtest]  * Tue Oct 15 15:42:09 UTC 2013 - ServiceEvent REGISTERED - 8
  [bndtest]  * Tue Oct 15 15:42:09 UTC 2013 - ServiceEvent UNREGISTERING - 8
  [bndtest]  * Tue Oct 15 15:42:09 UTC 2013 - ServiceEvent UNREGISTERING - 8
  [bndtest]  * Tue Oct 15 15:42:09 UTC 2013 - ServiceEvent UNREGISTERING - 40
  [bndtest]  * Tue Oct 15 15:42:09 UTC 2013 - ServiceEvent UNREGISTERING - 39
  [bndtest]  * Tue Oct 15 15:42:09 UTC 2013 - ServiceEvent UNREGISTERING - 43
  [bndtest]  * Tue Oct 15 15:42:09 UTC 2013 - ServiceEvent UNREGISTERING - 23
  [bndtest]  * Tue Oct 15 15:42:09 UTC 2013 - Authentication failure! - 39
  [bndtest]  * Tue Oct 15 15:42:09 UTC 2013 - Authentication failure! - 39
  [bndtest]  * Tue Oct 15 15:42:09 UTC 2013 - Authentication failure! - 39
  [bndtest]  * Tue Oct 15 15:42:09 UTC 2013 - Authentication failure! - 39
  [bndtest]  * Tue Oct 15 15:42:09 UTC 2013 - ServiceEvent REGISTERED - 40
  [bndtest]  * Tue Oct 15 15:42:09 UTC 2013 - ServiceEvent REGISTERED - 39
  [bndtest]  * Tue Oct 15 15:42:09 UTC 2013 - ServiceEvent REGISTERED - 23
  [bndtest]  * Tue Oct 15 15:42:09 UTC 2013 - ServiceEvent REGISTERED - 43
  [bndtest]  * Tue Oct 15 15:42:09 UTC 2013 - Started jetty 7.x.y-SNAPSHOT at port(s) HTTP:8080
on context path / - 8
  [bndtest]  * Tue Oct 15 15:42:09 UTC 2013 - ServiceEvent REGISTERED - 8
  [bndtest]  * Tue Oct 15 15:42:09 UTC 2013 - ServiceEvent REGISTERED - 8
  [bndtest]  * Tue Oct 15 15:42:09 UTC 2013 - ServiceEvent UNREGISTERING - 8
  [bndtest]  * Tue Oct 15 15:42:09 UTC 2013 - ServiceEvent UNREGISTERING - 8
  [bndtest]  * Tue Oct 15 15:42:09 UTC 2013 - Started jetty 7.x.y-SNAPSHOT at port(s) HTTP:8080
on context path / - 8
  [bndtest]  * Tue Oct 15 15:42:09 UTC 2013 - ServiceEvent REGISTERED - 8
  [bndtest]  * Tue Oct 15 15:42:09 UTC 2013 - ServiceEvent REGISTERED - 8
  [bndtest]  * Tue Oct 15 15:42:09 UTC 2013 - ServiceEvent UNREGISTERING - 8
  [bndtest]  * Tue Oct 15 15:42:09 UTC 2013 - ServiceEvent UNREGISTERING - 8
  [bndtest]  * Tue Oct 15 15:42:09 UTC 2013 - ServiceEvent UNREGISTERING - 40
  [bndtest]  * Tue Oct 15 15:42:09 UTC 2013 - ServiceEvent UNREGISTERING - 39
  [bndtest]  * Tue Oct 15 15:42:09 UTC 2013 - ServiceEvent UNREGISTERING - 43
  [bndtest]  * Tue Oct 15 15:42:09 UTC 2013 - ServiceEvent UNREGISTERING - 23
  [bndtest]  * Tue Oct 15 15:42:09 UTC 2013 - Authentication failure! - 39
  [bndtest]  * Tue Oct 15 15:42:09 UTC 2013 - Authentication failure! - 39
  [bndtest]  * Tue Oct 15 15:42:08 UTC 2013 - Authentication failure! - 39
  [bndtest]  * Tue Oct 15 15:42:08 UTC 2013 - Authentication failure! - 39
  [bndtest]  * Tue Oct 15 15:42:08 UTC 2013 - ServiceEvent REGISTERED - 40
  [bndtest]  * Tue Oct 15 15:42:08 UTC 2013 - ServiceEvent REGISTERED - 39
  [bndtest]  * Tue Oct 15 15:42:08 UTC 2013 - ServiceEvent REGISTERED - 23
  [bndtest]  * Tue Oct 15 15:42:08 UTC 2013 - ServiceEvent REGISTERED - 43
  [bndtest]  * Tue Oct 15 15:42:08 UTC 2013 - Started jetty 7.x.y-SNAPSHOT at port(s) HTTP:8080
on context path / - 8
  [bndtest]  * Tue Oct 15 15:42:08 UTC 2013 - ServiceEvent REGISTERED - 8
  [bndtest]  * Tue Oct 15 15:42:08 UTC 2013 - ServiceEvent REGISTERED - 8
  [bndtest]  * Tue Oct 15 15:42:08 UTC 2013 - ServiceEvent UNREGISTERING - 8
  [bndtest]  * Tue Oct 15 15:42:08 UTC 2013 - ServiceEvent UNREGISTERING - 8
  [bndtest]  * Tue Oct 15 15:42:08 UTC 2013 - Started jetty 7.x.y-SNAPSHOT at port(s) HTTP:8080
on context path / - 8
  [bndtest]  * Tue Oct 15 15:42:08 UTC 2013 - ServiceEvent REGISTERED - 8
  [bndtest]  * Tue Oct 15 15:42:08 UTC 2013 - ServiceEvent REGISTERED - 8
  [bndtest]  * Tue Oct 15 15:42:08 UTC 2013 - ServiceEvent UNREGISTERING - 8
  [bndtest]  * Tue Oct 15 15:42:08 UTC 2013 - ServiceEvent UNREGISTERING - 8
  [bndtest]  * Tue Oct 15 15:42:08 UTC 2013 - ServiceEvent UNREGISTERING - 40
  [bndtest]  * Tue Oct 15 15:42:08 UTC 2013 - ServiceEvent UNREGISTERING - 39
  [bndtest]  * Tue Oct 15 15:42:08 UTC 2013 - ServiceEvent UNREGISTERING - 43
  [bndtest]  * Tue Oct 15 15:42:08 UTC 2013 - ServiceEvent UNREGISTERING - 23
  [bndtest]  * Tue Oct 15 15:42:08 UTC 2013 - Authentication failure! - 39
  [bndtest]  * Tue Oct 15 15:42:08 UTC 2013 - Authentication failure! - 39
  [bndtest]  * Tue Oct 15 15:42:08 UTC 2013 - ServiceEvent REGISTERED - 40
  [bndtest]  * Tue Oct 15 15:42:08 UTC 2013 - ServiceEvent REGISTERED - 39
  [bndtest]  * Tue Oct 15 15:42:08 UTC 2013 - ServiceEvent REGISTERED - 23
  [bndtest]  * Tue Oct 15 15:42:08 UTC 2013 - ServiceEvent REGISTERED - 43
  [bndtest]  * Tue Oct 15 15:42:08 UTC 2013 - ServiceEvent REGISTERED - 21
  [bndtest]  * Tue Oct 15 15:42:08 UTC 2013 - ServiceEvent REGISTERED - 21
  [bndtest]  * Tue Oct 15 15:42:08 UTC 2013 - ServiceEvent REGISTERED - 21
  [bndtest]  * Tue Oct 15 15:42:08 UTC 2013 - ServiceEvent REGISTERED - 21
  [bndtest]  * Tue Oct 15 15:42:08 UTC 2013 - ServiceEvent REGISTERED - 21
  [bndtest]  * Tue Oct 15 15:42:08 UTC 2013 - ServiceEvent REGISTERED - 21
  [bndtest]  * Tue Oct 15 15:42:08 UTC 2013 - ServiceEvent REGISTERED - 21
  [bndtest]  * Tue Oct 15 15:42:08 UTC 2013 - ServiceEvent REGISTERED - 21
  [bndtest]  * Tue Oct 15 15:42:08 UTC 2013 - ServiceEvent REGISTERED - 21
  [bndtest]  * Tue Oct 15 15:42:08 UTC 2013 - ServiceEvent REGISTERED - 21
  [bndtest]  * Tue Oct 15 15:42:08 UTC 2013 - ServiceEvent REGISTERED - 21
  [bndtest]  * Tue Oct 15 15:42:08 UTC 2013 - ServiceEvent REGISTERED - 21
  [bndtest]  * Tue Oct 15 15:42:08 UTC 2013 - ServiceEvent REGISTERED - 21
  [bndtest]  * Tue Oct 15 15:42:08 UTC 2013 - ServiceEvent REGISTERED - 21
  [bndtest]  * Tue Oct 15 15:42:08 UTC 2013 - ServiceEvent REGISTERED - 21
  [bndtest]  * Tue Oct 15 15:42:08 UTC 2013 - ServiceEvent REGISTERED - 21
  [bndtest]  * Tue Oct 15 15:42:08 UTC 2013 - ServiceEvent REGISTERED - 21
  [bndtest]  * Tue Oct 15 15:42:08 UTC 2013 - ServiceEvent REGISTERED - 21
  [bndtest]  * Tue Oct 15 15:42:08 UTC 2013 - Started jetty 7.x.y-SNAPSHOT at port(s) HTTP:8080
on context path / - 8
  [bndtest]  * Tue Oct 15 15:42:08 UTC 2013 - ServiceEvent REGISTERED - 8
  [bndtest]  * Tue Oct 15 15:42:08 UTC 2013 - ServiceEvent REGISTERED - 8
  [bndtest]  * Tue Oct 15 15:42:08 UTC 2013 - ServiceEvent UNREGISTERING - 8
  [bndtest]  * Tue Oct 15 15:42:08 UTC 2013 - ServiceEvent UNREGISTERING - 8
  [bndtest]  * Tue Oct 15 15:42:08 UTC 2013 - ServiceEvent REGISTERED - 0
  [bndtest]  * Tue Oct 15 15:42:08 UTC 2013 - BundleEvent STARTED - 50
  [bndtest]  * Tue Oct 15 15:42:08 UTC 2013 - ServiceEvent REGISTERED - 0
  [bndtest]  * Tue Oct 15 15:42:08 UTC 2013 - BundleEvent STARTED - 49
  [bndtest]  * Tue Oct 15 15:42:08 UTC 2013 - BundleEvent STARTED - 48
  [bndtest]  * Tue Oct 15 15:42:08 UTC 2013 - BundleEvent STARTED - 47
  [bndtest] 2013-10-15 15:42:09.918:INFO:oejsh.ContextHandler:stopped o.e.j.s.ServletContextHandler{/,null}
  [bndtest] 2013-10-15 15:42:09.969:INFO:oejs.Server:jetty-7.x.y-SNAPSHOT
  [bndtest] 2013-10-15 15:42:09.970:INFO:oejsh.ContextHandler:started o.e.j.s.ServletContextHandler{/,null}
  [bndtest] 2013-10-15 15:42:09.972:INFO:oejs.AbstractConnector:Started SelectChannelConnector@0.0.0.0:8080
  [bndtest] 2013-10-15 15:42:09.997:INFO:oejsh.ContextHandler:stopped o.e.j.s.ServletContextHandler{/,null}
  [bndtest] 2013-10-15 15:42:10.048:INFO:oejs.Server:jetty-7.x.y-SNAPSHOT
  [bndtest] 2013-10-15 15:42:10.049:INFO:oejsh.ContextHandler:started o.e.j.s.ServletContextHandler{/,null}
  [bndtest] 2013-10-15 15:42:10.051:INFO:oejs.AbstractConnector:Started SelectChannelConnector@0.0.0.0:8080
  [bndtest] Got response code 404 for http://localhost:8080/obr/repository.xml
  [bndtest] Bundle Indexer | v2.2
  [bndtest] (c) 2007 OSGi, All Rights Reserved
  [bndtest] Got response code 401 for http://localhost:8080/obr/repository.xml
  [bndtest] 2013-10-15 15:42:10.298:INFO:oejsh.ContextHandler:stopped o.e.j.s.ServletContextHandler{/,null}
  [bndtest] 2013-10-15 15:42:10.349:INFO:oejs.Server:jetty-7.x.y-SNAPSHOT
  [bndtest] 2013-10-15 15:42:10.350:INFO:oejsh.ContextHandler:started o.e.j.s.ServletContextHandler{/,null}
  [bndtest] 2013-10-15 15:42:10.353:INFO:oejs.AbstractConnector:Started SelectChannelConnector@0.0.0.0:8080
  [bndtest] 2013-10-15 15:42:10.378:INFO:oejsh.ContextHandler:stopped o.e.j.s.ServletContextHandler{/,null}
  [bndtest] 2013-10-15 15:42:10.431:INFO:oejs.Server:jetty-7.x.y-SNAPSHOT
  [bndtest] 2013-10-15 15:42:10.431:INFO:oejsh.ContextHandler:started o.e.j.s.ServletContextHandler{/,null}
  [bndtest] 2013-10-15 15:42:10.434:INFO:oejs.AbstractConnector:Started SelectChannelConnector@0.0.0.0:8080
  [bndtest] Got response code 404 for http://localhost:8080/auditlog
  [bndtest] Got response code 401 for http://localhost:8080/auditlog
  [bndtest] 2013-10-15 15:42:17.270:INFO:oejsh.ContextHandler:stopped o.e.j.s.ServletContextHandler{/,null}
  [bndtest] 2013-10-15 15:42:17.321:INFO:oejs.Server:jetty-7.x.y-SNAPSHOT
  [bndtest] 2013-10-15 15:42:17.322:INFO:oejsh.ContextHandler:started o.e.j.s.ServletContextHandler{/,null}
  [bndtest] 2013-10-15 15:42:17.325:INFO:oejs.AbstractConnector:Started SelectChannelConnector@0.0.0.0:8080
  [bndtest] 2013-10-15 15:42:17.351:INFO:oejsh.ContextHandler:stopped o.e.j.s.ServletContextHandler{/,null}
  [bndtest] 2013-10-15 15:42:17.403:INFO:oejs.Server:jetty-7.x.y-SNAPSHOT
  [bndtest] 2013-10-15 15:42:17.404:INFO:oejsh.ContextHandler:started o.e.j.s.ServletContextHandler{/,null}
  [bndtest] 2013-10-15 15:42:17.407:INFO:oejs.AbstractConnector:Started SelectChannelConnector@0.0.0.0:8080
  [bndtest] Got response code 401 for http://localhost:8080/auditlog
  [bndtest] 2013-10-15 15:42:17.967:INFO:oejsh.ContextHandler:stopped o.e.j.s.ServletContextHandler{/,null}
  [bndtest] Tests run  : 7
  [bndtest] Passed     : 6
  [bndtest] Errors     : 1
  [bndtest] Failures   : 0
  [bndtest] 1 Error(s)
  [bndtest] Tests failed
  [bndtest] 	at aQute.bnd.ant.TestTask.executeProject(TestTask.java:78)
  [bndtest] 	at aQute.bnd.ant.TestTask.execute(TestTask.java:49)
  [bndtest] 	at org.apache.tools.ant.UnknownElement.execute(UnknownElement.java:291)
  [bndtest] 	at sun.reflect.GeneratedMethodAccessor4.invoke(Unknown Source)
  [bndtest] 	at sun.reflect.DelegatingMethodAccessorImpl.invoke(DelegatingMethodAccessorImpl.java:25)
  [bndtest] 	at java.lang.reflect.Method.invoke(Method.java:597)
  [bndtest] 	at org.apache.tools.ant.dispatch.DispatchUtils.execute(DispatchUtils.java:106)
  [bndtest] 	at org.apache.tools.ant.Task.perform(Task.java:348)
  [bndtest] 	at org.apache.tools.ant.Target.execute(Target.java:390)
  [bndtest] 	at org.apache.tools.ant.Target.performTasks(Target.java:411)
  [bndtest] 	at org.apache.tools.ant.Project.executeSortedTargets(Project.java:1399)
  [bndtest] 	at org.apache.tools.ant.helper.SingleCheckExecutor.executeTargets(SingleCheckExecutor.java:38)
  [bndtest] 	at org.apache.tools.ant.Project.executeTargets(Project.java:1251)
  [bndtest] 	at org.apache.tools.ant.taskdefs.Ant.execute(Ant.java:442)
  [bndtest] 	at org.apache.tools.ant.taskdefs.SubAnt.execute(SubAnt.java:302)
  [bndtest] 	at org.apache.tools.ant.taskdefs.SubAnt.execute(SubAnt.java:221)
  [bndtest] 	at org.apache.tools.ant.UnknownElement.execute(UnknownElement.java:291)
  [bndtest] 	at sun.reflect.GeneratedMethodAccessor4.invoke(Unknown Source)
  [bndtest] 	at sun.reflect.DelegatingMethodAccessorImpl.invoke(DelegatingMethodAccessorImpl.java:25)
  [bndtest] 	at java.lang.reflect.Method.invoke(Method.java:597)
  [bndtest] 	at org.apache.tools.ant.dispatch.DispatchUtils.execute(DispatchUtils.java:106)
  [bndtest] 	at org.apache.tools.ant.Task.perform(Task.java:348)
  [bndtest] 	at org.apache.tools.ant.Target.execute(Target.java:390)
  [bndtest] 	at org.apache.tools.ant.Target.performTasks(Target.java:411)
  [bndtest] 	at org.apache.tools.ant.Project.executeSortedTargets(Project.java:1399)
  [bndtest] 	at org.apache.tools.ant.Project.executeTarget(Project.java:1368)
  [bndtest] 	at org.apache.tools.ant.helper.DefaultExecutor.executeTargets(DefaultExecutor.java:41)
  [bndtest] 	at org.apache.tools.ant.Project.executeTargets(Project.java:1251)
  [bndtest] 	at org.apache.tools.ant.Main.runBuild(Main.java:809)
  [bndtest] 	at org.apache.tools.ant.Main.startAnt(Main.java:217)
  [bndtest] 	at org.apache.tools.ant.launch.Launcher.run(Launcher.java:280)
  [bndtest] 	at org.apache.tools.ant.launch.Launcher.main(Launcher.java:109)

BUILD FAILED
/home/hudson/jenkins-slave/workspace/ACE-trunk/cnf/build.xml:55: The following error occurred
while executing this line:
/home/hudson/jenkins-slave/workspace/ACE-trunk/cnf/build-template.xml:67: Tests failed

Total time: 6 minutes 37 seconds
Build step 'Invoke Ant' marked build as failure
Recording test results
TestNG Reports Processing: START
Looking for TestNG results report in workspace using pattern: **/testng/testng-results.xml
Saving reports...
Processing '/home/hudson/hudson/jobs/ACE-trunk/builds/2013-10-15_15-33-54/testng/testng-results-1.xml'
Processing '/home/hudson/hudson/jobs/ACE-trunk/builds/2013-10-15_15-33-54/testng/testng-results-10.xml'
Processing '/home/hudson/hudson/jobs/ACE-trunk/builds/2013-10-15_15-33-54/testng/testng-results-11.xml'
Processing '/home/hudson/hudson/jobs/ACE-trunk/builds/2013-10-15_15-33-54/testng/testng-results-12.xml'
Processing '/home/hudson/hudson/jobs/ACE-trunk/builds/2013-10-15_15-33-54/testng/testng-results-13.xml'
Processing '/home/hudson/hudson/jobs/ACE-trunk/builds/2013-10-15_15-33-54/testng/testng-results-14.xml'
Processing '/home/hudson/hudson/jobs/ACE-trunk/builds/2013-10-15_15-33-54/testng/testng-results-15.xml'
Processing '/home/hudson/hudson/jobs/ACE-trunk/builds/2013-10-15_15-33-54/testng/testng-results-16.xml'
Processing '/home/hudson/hudson/jobs/ACE-trunk/builds/2013-10-15_15-33-54/testng/testng-results-17.xml'
Processing '/home/hudson/hudson/jobs/ACE-trunk/builds/2013-10-15_15-33-54/testng/testng-results-2.xml'
Processing '/home/hudson/hudson/jobs/ACE-trunk/builds/2013-10-15_15-33-54/testng/testng-results-3.xml'
Processing '/home/hudson/hudson/jobs/ACE-trunk/builds/2013-10-15_15-33-54/testng/testng-results-4.xml'
Processing '/home/hudson/hudson/jobs/ACE-trunk/builds/2013-10-15_15-33-54/testng/testng-results-5.xml'
Processing '/home/hudson/hudson/jobs/ACE-trunk/builds/2013-10-15_15-33-54/testng/testng-results-6.xml'
Processing '/home/hudson/hudson/jobs/ACE-trunk/builds/2013-10-15_15-33-54/testng/testng-results-7.xml'
Processing '/home/hudson/hudson/jobs/ACE-trunk/builds/2013-10-15_15-33-54/testng/testng-results-8.xml'
Processing '/home/hudson/hudson/jobs/ACE-trunk/builds/2013-10-15_15-33-54/testng/testng-results-9.xml'
Processing '/home/hudson/hudson/jobs/ACE-trunk/builds/2013-10-15_15-33-54/testng/testng-results.xml'
TestNG Reports Processing: FINISH

Mime
View raw message