ace-dev mailing list archives

Site index · List index
Message view « Date » · « Thread »
Top « Date » · « Thread »
From Apache Jenkins Server <jenk...@builds.apache.org>
Subject Build failed in Jenkins: ACE-trunk #119
Date Fri, 11 Oct 2013 14:41:14 GMT
See <https://builds.apache.org/job/ACE-trunk/119/changes>

Changes:

[marrs] ACE-418 Cleaned up some unused imports.

[marrs] ACE-418 Slight change in API and implementation, we no longer create streams of zero
bytes but return null instead.

------------------------------------------
[...truncated 3278 lines...]
  [bndtest] Got response code 401 for http://localhost:8080/obr/repository.xml
  [bndtest] 2013-10-11 14:40:58.434:INFO:oejsh.ContextHandler:stopped o.e.j.s.ServletContextHandler{/,null}
  [bndtest] 2013-10-11 14:40:58.485:INFO:oejs.Server:jetty-7.x.y-SNAPSHOT
  [bndtest] 2013-10-11 14:40:58.486:INFO:oejsh.ContextHandler:started o.e.j.s.ServletContextHandler{/,null}
  [bndtest] 2013-10-11 14:40:58.489:INFO:oejs.AbstractConnector:Started SelectChannelConnector@0.0.0.0:8080
  [bndtest] 2013-10-11 14:40:58.517:INFO:oejsh.ContextHandler:stopped o.e.j.s.ServletContextHandler{/,null}
  [bndtest] 2013-10-11 14:40:58.568:INFO:oejs.Server:jetty-7.x.y-SNAPSHOT
  [bndtest] 2013-10-11 14:40:58.569:INFO:oejsh.ContextHandler:started o.e.j.s.ServletContextHandler{/,null}
  [bndtest] 2013-10-11 14:40:58.572:INFO:oejs.AbstractConnector:Started SelectChannelConnector@0.0.0.0:8080
  [bndtest] Got response code 404 for http://localhost:8080/obr/repository.xml
  [bndtest] Bundle Indexer | v2.2
  [bndtest] (c) 2007 OSGi, All Rights Reserved
  [bndtest] Got response code 401 for http://localhost:8080/obr/repository.xml
  [bndtest] 2013-10-11 14:40:58.864:INFO:oejsh.ContextHandler:stopped o.e.j.s.ServletContextHandler{/,null}
  [bndtest] 2013-10-11 14:40:58.917:INFO:oejs.Server:jetty-7.x.y-SNAPSHOT
  [bndtest] 2013-10-11 14:40:58.918:INFO:oejsh.ContextHandler:started o.e.j.s.ServletContextHandler{/,null}
  [bndtest] 2013-10-11 14:40:58.922:INFO:oejs.AbstractConnector:Started SelectChannelConnector@0.0.0.0:8080
  [bndtest] 2013-10-11 14:40:58.949:INFO:oejsh.ContextHandler:stopped o.e.j.s.ServletContextHandler{/,null}
  [bndtest] 2013-10-11 14:40:59.001:INFO:oejs.Server:jetty-7.x.y-SNAPSHOT
  [bndtest] 2013-10-11 14:40:59.001:INFO:oejsh.ContextHandler:started o.e.j.s.ServletContextHandler{/,null}
  [bndtest] 2013-10-11 14:40:59.005:INFO:oejs.AbstractConnector:Started SelectChannelConnector@0.0.0.0:8080
  [bndtest] Got response code 404 for http://localhost:8080/obr/repository.xml
  [bndtest] Bundle Indexer | v2.2
  [bndtest] (c) 2007 OSGi, All Rights Reserved
  [bndtest] Got response code 401 for http://localhost:8080/obr/repository.xml
  [bndtest] Log:
  [bndtest]  * Fri Oct 11 14:40:59 UTC 2013 - Error storing artifact: Error importing artifact
file:/tmp/org.apache.ace.test14583574112823094954.jar: Socket Closed - 21
  [bndtest] org.apache.felix.log.LogException: java.io.IOException: Error importing artifact
file:/tmp/org.apache.ace.test14583574112823094954.jar: Socket Closed
  [bndtest] 	at org.apache.ace.client.repository.impl.ArtifactRepositoryImpl.upload(ArtifactRepositoryImpl.java:481)
  [bndtest] 	at org.apache.ace.client.repository.impl.ArtifactRepositoryImpl.importArtifact(ArtifactRepositoryImpl.java:353)
  [bndtest] 	at org.apache.ace.client.repository.impl.ArtifactRepositoryImpl.importArtifact(ArtifactRepositoryImpl.java:296)
  [bndtest] 	at org.apache.ace.it.authentication.ObrAuthenticationTest.testImportArtifactWithCredentialsOk(ObrAuthenticationTest.java:257)
  [bndtest] 	at sun.reflect.NativeMethodAccessorImpl.invoke0(Native Method)
  [bndtest] 	at sun.reflect.NativeMethodAccessorImpl.invoke(NativeMethodAccessorImpl.java:39)
  [bndtest] 	at sun.reflect.DelegatingMethodAccessorImpl.invoke(DelegatingMethodAccessorImpl.java:25)
  [bndtest] 	at java.lang.reflect.Method.invoke(Method.java:597)
  [bndtest] 	at junit.framework.TestCase.runTest(TestCase.java:168)
  [bndtest] 	at junit.framework.TestCase.runBare(TestCase.java:134)
  [bndtest] 	at junit.framework.TestResult$1.protect(TestResult.java:110)
  [bndtest] 	at junit.framework.TestResult.runProtected(TestResult.java:128)
  [bndtest] 	at junit.framework.TestResult.run(TestResult.java:113)
  [bndtest] 	at junit.framework.TestCase.run(TestCase.java:124)
  [bndtest] 	at junit.framework.TestSuite.runTest(TestSuite.java:243)
  [bndtest] 	at junit.framework.TestSuite.run(TestSuite.java:238)
  [bndtest] 	at junit.framework.TestSuite.runTest(TestSuite.java:243)
  [bndtest] 	at junit.framework.TestSuite.run(TestSuite.java:238)
  [bndtest] 	at aQute.junit.Activator.test(Activator.java:258)
  [bndtest] 	at aQute.junit.Activator.automatic(Activator.java:149)
  [bndtest] 	at aQute.junit.Activator.run(Activator.java:83)
  [bndtest] 	at aQute.launcher.Launcher.run(Launcher.java:176)
  [bndtest] 	at aQute.launcher.Launcher.main(Launcher.java:80)
  [bndtest] Caused by: java.net.SocketException: Socket Closed
  [bndtest] 	at java.net.PlainSocketImpl.getOption(PlainSocketImpl.java:286)
  [bndtest] 	at java.net.Socket.getSoTimeout(Socket.java:1032)
  [bndtest] 	at sun.net.www.http.HttpClient.available(HttpClient.java:356)
  [bndtest] 	at sun.net.www.http.HttpClient.New(HttpClient.java:273)
  [bndtest] 	at sun.net.www.http.HttpClient.New(HttpClient.java:310)
  [bndtest] 	at sun.net.www.protocol.http.HttpURLConnection.getNewHttpClient(HttpURLConnection.java:987)
  [bndtest] 	at sun.net.www.protocol.http.HttpURLConnection.plainConnect(HttpURLConnection.java:923)
  [bndtest] 	at sun.net.www.protocol.http.HttpURLConnection.connect(HttpURLConnection.java:841)
  [bndtest] 	at sun.net.www.protocol.http.HttpURLConnection.getOutputStream(HttpURLConnection.java:1031)
  [bndtest] 	at org.apache.ace.client.repository.impl.ArtifactRepositoryImpl.upload(ArtifactRepositoryImpl.java:456)
  [bndtest] 	... 22 more
  [bndtest]  * Fri Oct 11 14:40:59 UTC 2013 - Authentication failure! - 39
  [bndtest]  * Fri Oct 11 14:40:59 UTC 2013 - Authentication failure! - 39
  [bndtest]  * Fri Oct 11 14:40:59 UTC 2013 - ServiceEvent REGISTERED - 39
  [bndtest]  * Fri Oct 11 14:40:59 UTC 2013 - ServiceEvent REGISTERED - 40
  [bndtest]  * Fri Oct 11 14:40:59 UTC 2013 - ServiceEvent REGISTERED - 23
  [bndtest]  * Fri Oct 11 14:40:59 UTC 2013 - ServiceEvent REGISTERED - 43
  [bndtest]  * Fri Oct 11 14:40:59 UTC 2013 - Started jetty 7.x.y-SNAPSHOT at port(s) HTTP:8080
on context path / - 8
  [bndtest]  * Fri Oct 11 14:40:59 UTC 2013 - ServiceEvent REGISTERED - 8
  [bndtest]  * Fri Oct 11 14:40:59 UTC 2013 - ServiceEvent REGISTERED - 8
  [bndtest]  * Fri Oct 11 14:40:58 UTC 2013 - ServiceEvent UNREGISTERING - 8
  [bndtest]  * Fri Oct 11 14:40:58 UTC 2013 - ServiceEvent UNREGISTERING - 8
  [bndtest]  * Fri Oct 11 14:40:58 UTC 2013 - Started jetty 7.x.y-SNAPSHOT at port(s) HTTP:8080
on context path / - 8
  [bndtest]  * Fri Oct 11 14:40:58 UTC 2013 - ServiceEvent REGISTERED - 8
  [bndtest]  * Fri Oct 11 14:40:58 UTC 2013 - ServiceEvent REGISTERED - 8
  [bndtest]  * Fri Oct 11 14:40:58 UTC 2013 - ServiceEvent UNREGISTERING - 8
  [bndtest]  * Fri Oct 11 14:40:58 UTC 2013 - ServiceEvent UNREGISTERING - 8
  [bndtest]  * Fri Oct 11 14:40:58 UTC 2013 - ServiceEvent UNREGISTERING - 40
  [bndtest]  * Fri Oct 11 14:40:58 UTC 2013 - ServiceEvent UNREGISTERING - 39
  [bndtest]  * Fri Oct 11 14:40:58 UTC 2013 - ServiceEvent UNREGISTERING - 43
  [bndtest]  * Fri Oct 11 14:40:58 UTC 2013 - ServiceEvent UNREGISTERING - 23
  [bndtest]  * Fri Oct 11 14:40:58 UTC 2013 - Authentication failure! - 39
  [bndtest]  * Fri Oct 11 14:40:58 UTC 2013 - Authentication failure! - 39
  [bndtest]  * Fri Oct 11 14:40:58 UTC 2013 - Authentication failure! - 39
  [bndtest]  * Fri Oct 11 14:40:58 UTC 2013 - Authentication failure! - 39
  [bndtest]  * Fri Oct 11 14:40:58 UTC 2013 - ServiceEvent REGISTERED - 39
  [bndtest]  * Fri Oct 11 14:40:58 UTC 2013 - ServiceEvent REGISTERED - 40
  [bndtest]  * Fri Oct 11 14:40:58 UTC 2013 - ServiceEvent REGISTERED - 23
  [bndtest]  * Fri Oct 11 14:40:58 UTC 2013 - ServiceEvent REGISTERED - 43
  [bndtest]  * Fri Oct 11 14:40:58 UTC 2013 - Started jetty 7.x.y-SNAPSHOT at port(s) HTTP:8080
on context path / - 8
  [bndtest]  * Fri Oct 11 14:40:58 UTC 2013 - ServiceEvent REGISTERED - 8
  [bndtest]  * Fri Oct 11 14:40:58 UTC 2013 - ServiceEvent REGISTERED - 8
  [bndtest]  * Fri Oct 11 14:40:58 UTC 2013 - ServiceEvent UNREGISTERING - 8
  [bndtest]  * Fri Oct 11 14:40:58 UTC 2013 - ServiceEvent UNREGISTERING - 8
  [bndtest]  * Fri Oct 11 14:40:58 UTC 2013 - Started jetty 7.x.y-SNAPSHOT at port(s) HTTP:8080
on context path / - 8
  [bndtest]  * Fri Oct 11 14:40:58 UTC 2013 - ServiceEvent REGISTERED - 8
  [bndtest]  * Fri Oct 11 14:40:58 UTC 2013 - ServiceEvent REGISTERED - 8
  [bndtest]  * Fri Oct 11 14:40:58 UTC 2013 - ServiceEvent UNREGISTERING - 8
  [bndtest]  * Fri Oct 11 14:40:58 UTC 2013 - ServiceEvent UNREGISTERING - 8
  [bndtest]  * Fri Oct 11 14:40:58 UTC 2013 - ServiceEvent UNREGISTERING - 40
  [bndtest]  * Fri Oct 11 14:40:58 UTC 2013 - ServiceEvent UNREGISTERING - 39
  [bndtest]  * Fri Oct 11 14:40:58 UTC 2013 - ServiceEvent UNREGISTERING - 43
  [bndtest]  * Fri Oct 11 14:40:58 UTC 2013 - ServiceEvent UNREGISTERING - 23
  [bndtest]  * Fri Oct 11 14:40:58 UTC 2013 - Authentication failure! - 39
  [bndtest]  * Fri Oct 11 14:40:58 UTC 2013 - Authentication failure! - 39
  [bndtest]  * Fri Oct 11 14:40:58 UTC 2013 - Authentication failure! - 39
  [bndtest]  * Fri Oct 11 14:40:58 UTC 2013 - Authentication failure! - 39
  [bndtest]  * Fri Oct 11 14:40:58 UTC 2013 - ServiceEvent REGISTERED - 39
  [bndtest]  * Fri Oct 11 14:40:58 UTC 2013 - ServiceEvent REGISTERED - 40
  [bndtest]  * Fri Oct 11 14:40:58 UTC 2013 - ServiceEvent REGISTERED - 23
  [bndtest]  * Fri Oct 11 14:40:58 UTC 2013 - ServiceEvent REGISTERED - 43
  [bndtest]  * Fri Oct 11 14:40:58 UTC 2013 - Started jetty 7.x.y-SNAPSHOT at port(s) HTTP:8080
on context path / - 8
  [bndtest]  * Fri Oct 11 14:40:58 UTC 2013 - ServiceEvent REGISTERED - 8
  [bndtest]  * Fri Oct 11 14:40:58 UTC 2013 - ServiceEvent REGISTERED - 8
  [bndtest]  * Fri Oct 11 14:40:58 UTC 2013 - ServiceEvent UNREGISTERING - 8
  [bndtest]  * Fri Oct 11 14:40:58 UTC 2013 - ServiceEvent UNREGISTERING - 8
  [bndtest]  * Fri Oct 11 14:40:58 UTC 2013 - Started jetty 7.x.y-SNAPSHOT at port(s) HTTP:8080
on context path / - 8
  [bndtest]  * Fri Oct 11 14:40:58 UTC 2013 - ServiceEvent REGISTERED - 8
  [bndtest]  * Fri Oct 11 14:40:58 UTC 2013 - ServiceEvent REGISTERED - 8
  [bndtest]  * Fri Oct 11 14:40:58 UTC 2013 - ServiceEvent UNREGISTERING - 8
  [bndtest]  * Fri Oct 11 14:40:58 UTC 2013 - ServiceEvent UNREGISTERING - 8
  [bndtest]  * Fri Oct 11 14:40:57 UTC 2013 - ServiceEvent UNREGISTERING - 40
  [bndtest]  * Fri Oct 11 14:40:57 UTC 2013 - ServiceEvent UNREGISTERING - 39
  [bndtest]  * Fri Oct 11 14:40:57 UTC 2013 - ServiceEvent UNREGISTERING - 43
  [bndtest]  * Fri Oct 11 14:40:57 UTC 2013 - ServiceEvent UNREGISTERING - 23
  [bndtest]  * Fri Oct 11 14:40:57 UTC 2013 - Authentication failure! - 39
  [bndtest]  * Fri Oct 11 14:40:57 UTC 2013 - Authentication failure! - 39
  [bndtest]  * Fri Oct 11 14:40:57 UTC 2013 - ServiceEvent REGISTERED - 39
  [bndtest]  * Fri Oct 11 14:40:57 UTC 2013 - ServiceEvent REGISTERED - 40
  [bndtest]  * Fri Oct 11 14:40:57 UTC 2013 - ServiceEvent REGISTERED - 23
  [bndtest]  * Fri Oct 11 14:40:57 UTC 2013 - ServiceEvent REGISTERED - 43
  [bndtest]  * Fri Oct 11 14:40:57 UTC 2013 - Started jetty 7.x.y-SNAPSHOT at port(s) HTTP:8080
on context path / - 8
  [bndtest]  * Fri Oct 11 14:40:57 UTC 2013 - ServiceEvent REGISTERED - 8
  [bndtest]  * Fri Oct 11 14:40:57 UTC 2013 - ServiceEvent REGISTERED - 8
  [bndtest]  * Fri Oct 11 14:40:57 UTC 2013 - ServiceEvent UNREGISTERING - 8
  [bndtest]  * Fri Oct 11 14:40:57 UTC 2013 - ServiceEvent UNREGISTERING - 8
  [bndtest]  * Fri Oct 11 14:40:57 UTC 2013 - Started jetty 7.x.y-SNAPSHOT at port(s) HTTP:8080
on context path / - 8
  [bndtest]  * Fri Oct 11 14:40:57 UTC 2013 - ServiceEvent REGISTERED - 8
  [bndtest]  * Fri Oct 11 14:40:57 UTC 2013 - ServiceEvent REGISTERED - 8
  [bndtest]  * Fri Oct 11 14:40:57 UTC 2013 - ServiceEvent UNREGISTERING - 8
  [bndtest]  * Fri Oct 11 14:40:57 UTC 2013 - ServiceEvent UNREGISTERING - 8
  [bndtest]  * Fri Oct 11 14:40:57 UTC 2013 - ServiceEvent UNREGISTERING - 33
  [bndtest]  * Fri Oct 11 14:40:57 UTC 2013 - ServiceEvent UNREGISTERING - 34
  [bndtest]  * Fri Oct 11 14:40:57 UTC 2013 - ServiceEvent UNREGISTERING - 35
  [bndtest]  * Fri Oct 11 14:40:57 UTC 2013 - ServiceEvent UNREGISTERING - 36
  [bndtest]  * Fri Oct 11 14:40:57 UTC 2013 - ServiceEvent UNREGISTERING - 30
  [bndtest]  * Fri Oct 11 14:40:57 UTC 2013 - ServiceEvent UNREGISTERING - 35
  [bndtest]  * Fri Oct 11 14:40:57 UTC 2013 - ServiceEvent UNREGISTERING - 27
  [bndtest]  * Fri Oct 11 14:40:57 UTC 2013 - ServiceEvent UNREGISTERING - 43
  [bndtest]  * Fri Oct 11 14:40:57 UTC 2013 - ServiceEvent UNREGISTERING - 23
  [bndtest]  * Fri Oct 11 14:40:56 UTC 2013 - Authentication failure! - 34
  [bndtest]  * Fri Oct 11 14:40:56 UTC 2013 - Authentication failure! - 34
  [bndtest]  * Fri Oct 11 14:40:56 UTC 2013 - ServiceEvent REGISTERED - 33
  [bndtest]  * Fri Oct 11 14:40:56 UTC 2013 - ServiceEvent REGISTERED - 34
  [bndtest]  * Fri Oct 11 14:40:56 UTC 2013 - Unable to (fully) synchronize log with remote
(endpoint=auditlog) - 35
  [bndtest] java.io.FileNotFoundException: http://localhost:8080/auditlog/query?tid=target-id&logid=1381502456531
  [bndtest] 	at sun.net.www.protocol.http.HttpURLConnection.getInputStream(HttpURLConnection.java:1457)
  [bndtest] 	at org.apache.ace.log.target.task.LogSyncTask.run(LogSyncTask.java:103)
  [bndtest] 	at org.apache.ace.scheduler.Executer.run(Executer.java:92)
  [bndtest] 	at java.util.TimerThread.mainLoop(Timer.java:512)
  [bndtest] 	at java.util.TimerThread.run(Timer.java:462)
  [bndtest]  * Fri Oct 11 14:40:56 UTC 2013 - ServiceEvent REGISTERED - 35
  [bndtest]  * Fri Oct 11 14:40:56 UTC 2013 - ServiceEvent REGISTERED - 35
  [bndtest]  * Fri Oct 11 14:40:56 UTC 2013 - ServiceEvent REGISTERED - 36
  [bndtest]  * Fri Oct 11 14:40:56 UTC 2013 - ServiceEvent REGISTERED - 30
  [bndtest]  * Fri Oct 11 14:40:56 UTC 2013 - ServiceEvent REGISTERED - 27
  [bndtest] 2013-10-11 14:40:59.320:INFO:oejsh.ContextHandler:stopped o.e.j.s.ServletContextHandler{/,null}
  [bndtest] 2013-10-11 14:40:59.372:INFO:oejs.Server:jetty-7.x.y-SNAPSHOT
  [bndtest] 2013-10-11 14:40:59.373:INFO:oejsh.ContextHandler:started o.e.j.s.ServletContextHandler{/,null}
  [bndtest] 2013-10-11 14:40:59.376:INFO:oejs.AbstractConnector:Started SelectChannelConnector@0.0.0.0:8080
  [bndtest] 2013-10-11 14:40:59.403:INFO:oejsh.ContextHandler:stopped o.e.j.s.ServletContextHandler{/,null}
  [bndtest] 2013-10-11 14:40:59.454:INFO:oejs.Server:jetty-7.x.y-SNAPSHOT
  [bndtest] 2013-10-11 14:40:59.455:INFO:oejsh.ContextHandler:started o.e.j.s.ServletContextHandler{/,null}
  [bndtest] 2013-10-11 14:40:59.458:INFO:oejs.AbstractConnector:Started SelectChannelConnector@0.0.0.0:8080
  [bndtest] Got response code 404 for http://localhost:8080/obr/repository.xml
  [bndtest] Bundle Indexer | v2.2
  [bndtest] (c) 2007 OSGi, All Rights Reserved
  [bndtest] Got response code 401 for http://localhost:8080/obr/repository.xml
  [bndtest] 2013-10-11 14:40:59.756:INFO:oejsh.ContextHandler:stopped o.e.j.s.ServletContextHandler{/,null}
  [bndtest] Tests run  : 7
  [bndtest] Passed     : 6
  [bndtest] Errors     : 1
  [bndtest] Failures   : 0
  [bndtest] 1 Error(s)
  [bndtest] Tests failed
  [bndtest] 	at aQute.bnd.ant.TestTask.executeProject(TestTask.java:78)
  [bndtest] 	at aQute.bnd.ant.TestTask.execute(TestTask.java:49)
  [bndtest] 	at org.apache.tools.ant.UnknownElement.execute(UnknownElement.java:291)
  [bndtest] 	at sun.reflect.GeneratedMethodAccessor4.invoke(Unknown Source)
  [bndtest] 	at sun.reflect.DelegatingMethodAccessorImpl.invoke(DelegatingMethodAccessorImpl.java:25)
  [bndtest] 	at java.lang.reflect.Method.invoke(Method.java:597)
  [bndtest] 	at org.apache.tools.ant.dispatch.DispatchUtils.execute(DispatchUtils.java:106)
  [bndtest] 	at org.apache.tools.ant.Task.perform(Task.java:348)
  [bndtest] 	at org.apache.tools.ant.Target.execute(Target.java:390)
  [bndtest] 	at org.apache.tools.ant.Target.performTasks(Target.java:411)
  [bndtest] 	at org.apache.tools.ant.Project.executeSortedTargets(Project.java:1399)
  [bndtest] 	at org.apache.tools.ant.helper.SingleCheckExecutor.executeTargets(SingleCheckExecutor.java:38)
  [bndtest] 	at org.apache.tools.ant.Project.executeTargets(Project.java:1251)
  [bndtest] 	at org.apache.tools.ant.taskdefs.Ant.execute(Ant.java:442)
  [bndtest] 	at org.apache.tools.ant.taskdefs.SubAnt.execute(SubAnt.java:302)
  [bndtest] 	at org.apache.tools.ant.taskdefs.SubAnt.execute(SubAnt.java:221)
  [bndtest] 	at org.apache.tools.ant.UnknownElement.execute(UnknownElement.java:291)
  [bndtest] 	at sun.reflect.GeneratedMethodAccessor4.invoke(Unknown Source)
  [bndtest] 	at sun.reflect.DelegatingMethodAccessorImpl.invoke(DelegatingMethodAccessorImpl.java:25)
  [bndtest] 	at java.lang.reflect.Method.invoke(Method.java:597)
  [bndtest] 	at org.apache.tools.ant.dispatch.DispatchUtils.execute(DispatchUtils.java:106)
  [bndtest] 	at org.apache.tools.ant.Task.perform(Task.java:348)
  [bndtest] 	at org.apache.tools.ant.Target.execute(Target.java:390)
  [bndtest] 	at org.apache.tools.ant.Target.performTasks(Target.java:411)
  [bndtest] 	at org.apache.tools.ant.Project.executeSortedTargets(Project.java:1399)
  [bndtest] 	at org.apache.tools.ant.Project.executeTarget(Project.java:1368)
  [bndtest] 	at org.apache.tools.ant.helper.DefaultExecutor.executeTargets(DefaultExecutor.java:41)
  [bndtest] 	at org.apache.tools.ant.Project.executeTargets(Project.java:1251)
  [bndtest] 	at org.apache.tools.ant.Main.runBuild(Main.java:809)
  [bndtest] 	at org.apache.tools.ant.Main.startAnt(Main.java:217)
  [bndtest] 	at org.apache.tools.ant.launch.Launcher.run(Launcher.java:280)
  [bndtest] 	at org.apache.tools.ant.launch.Launcher.main(Launcher.java:109)

BUILD FAILED
<https://builds.apache.org/job/ACE-trunk/ws/cnf/build.xml>:55: The following error occurred
while executing this line:
<https://builds.apache.org/job/ACE-trunk/ws/cnf/build-template.xml>:67: Tests failed

Total time: 6 minutes 22 seconds
Build step 'Invoke Ant' marked build as failure
Recording test results
TestNG Reports Processing: START
Looking for TestNG results report in workspace using pattern: **/testng/testng-results.xml
Saving reports...
Processing '/home/hudson/hudson/jobs/ACE-trunk/builds/2013-10-11_14-33-54/testng/testng-results-1.xml'
Processing '/home/hudson/hudson/jobs/ACE-trunk/builds/2013-10-11_14-33-54/testng/testng-results-10.xml'
Processing '/home/hudson/hudson/jobs/ACE-trunk/builds/2013-10-11_14-33-54/testng/testng-results-11.xml'
Processing '/home/hudson/hudson/jobs/ACE-trunk/builds/2013-10-11_14-33-54/testng/testng-results-12.xml'
Processing '/home/hudson/hudson/jobs/ACE-trunk/builds/2013-10-11_14-33-54/testng/testng-results-13.xml'
Processing '/home/hudson/hudson/jobs/ACE-trunk/builds/2013-10-11_14-33-54/testng/testng-results-14.xml'
Processing '/home/hudson/hudson/jobs/ACE-trunk/builds/2013-10-11_14-33-54/testng/testng-results-15.xml'
Processing '/home/hudson/hudson/jobs/ACE-trunk/builds/2013-10-11_14-33-54/testng/testng-results-16.xml'
Processing '/home/hudson/hudson/jobs/ACE-trunk/builds/2013-10-11_14-33-54/testng/testng-results-17.xml'
Processing '/home/hudson/hudson/jobs/ACE-trunk/builds/2013-10-11_14-33-54/testng/testng-results-2.xml'
Processing '/home/hudson/hudson/jobs/ACE-trunk/builds/2013-10-11_14-33-54/testng/testng-results-3.xml'
Processing '/home/hudson/hudson/jobs/ACE-trunk/builds/2013-10-11_14-33-54/testng/testng-results-4.xml'
Processing '/home/hudson/hudson/jobs/ACE-trunk/builds/2013-10-11_14-33-54/testng/testng-results-5.xml'
Processing '/home/hudson/hudson/jobs/ACE-trunk/builds/2013-10-11_14-33-54/testng/testng-results-6.xml'
Processing '/home/hudson/hudson/jobs/ACE-trunk/builds/2013-10-11_14-33-54/testng/testng-results-7.xml'
Processing '/home/hudson/hudson/jobs/ACE-trunk/builds/2013-10-11_14-33-54/testng/testng-results-8.xml'
Processing '/home/hudson/hudson/jobs/ACE-trunk/builds/2013-10-11_14-33-54/testng/testng-results-9.xml'
Processing '/home/hudson/hudson/jobs/ACE-trunk/builds/2013-10-11_14-33-54/testng/testng-results.xml'
TestNG Reports Processing: FINISH

Mime
View raw message