ace-dev mailing list archives

Site index · List index
Message view « Date » · « Thread »
Top « Date » · « Thread »
From Apache Jenkins Server <jenk...@builds.apache.org>
Subject Build failed in Jenkins: ACE-trunk #105
Date Mon, 23 Sep 2013 17:49:33 GMT
See <https://builds.apache.org/job/ACE-trunk/105/changes>

Changes:

[bramk] ACE-379 - Completed multiple serverURL support for default discovery handler

* Update configuration javadoc

[bramk] ACE-379 - Completed multiple serverURL support for default discovery handler

* Simplified/optimized code
* Updated javadoc
* Fix small empty config bug

------------------------------------------
[...truncated 2816 lines...]
  [bndtest] [WARNING] 17:47:26 (controller) Sync received retry exception from server. Rescheduled
in 1 seconds
  [bndtest] [INFO] 17:47:27 (controller) Installing streaming deployment update 0.0.0 =>
1.0.0
  [bndtest] ERROR: Bundle org.apache.ace.agent [2] EventDispatcher: Error during dispatch.
(java.lang.NullPointerException)
  [bndtest] java.lang.NullPointerException
  [bndtest] 	at org.apache.ace.agent.impl.FeedbackStoreManager.isCurrentStoreMaximumFileSizeReached(Unknown
Source)
  [bndtest] 	at org.apache.ace.agent.impl.FeedbackStoreManager.write(Unknown Source)
  [bndtest] 	at org.apache.ace.agent.impl.FeedbackChannelImpl.write(Unknown Source)
  [bndtest] 	at org.apache.ace.agent.impl.EventLoggerImpl.writeAuditEvent(Unknown Source)
  [bndtest] 	at org.apache.ace.agent.impl.EventLoggerImpl.bundleChanged(Unknown Source)
  [bndtest] 	at org.apache.felix.framework.util.EventDispatcher.invokeBundleListenerCallback(EventDispatcher.java:868)
  [bndtest] 	at org.apache.felix.framework.util.EventDispatcher.fireEventImmediately(EventDispatcher.java:789)
  [bndtest] 	at org.apache.felix.framework.util.EventDispatcher.run(EventDispatcher.java:1088)
  [bndtest] 	at org.apache.felix.framework.util.EventDispatcher.access$000(EventDispatcher.java:54)
  [bndtest] 	at org.apache.felix.framework.util.EventDispatcher$1.run(EventDispatcher.java:101)
  [bndtest] 	at java.lang.Thread.run(Thread.java:662)
  [bndtest] [INFO] 17:47:33 (controller) Installing streaming deployment update 0.0.0 =>
1.0.0
  [bndtest] ERROR: Bundle org.apache.ace.agent [2] EventDispatcher: Error during dispatch.
(java.lang.NullPointerException)
  [bndtest] java.lang.NullPointerException
  [bndtest] 	at org.apache.ace.agent.impl.FeedbackStoreManager.isCurrentStoreMaximumFileSizeReached(Unknown
Source)
  [bndtest] 	at org.apache.ace.agent.impl.FeedbackStoreManager.write(Unknown Source)
  [bndtest] 	at org.apache.ace.agent.impl.FeedbackChannelImpl.write(Unknown Source)
  [bndtest] 	at org.apache.ace.agent.impl.EventLoggerImpl.writeAuditEvent(Unknown Source)
  [bndtest] 	at org.apache.ace.agent.impl.EventLoggerImpl.bundleChanged(Unknown Source)
  [bndtest] 	at org.apache.felix.framework.util.EventDispatcher.invokeBundleListenerCallback(EventDispatcher.java:868)
  [bndtest] 	at org.apache.felix.framework.util.EventDispatcher.fireEventImmediately(EventDispatcher.java:789)
  [bndtest] 	at org.apache.felix.framework.util.EventDispatcher.run(EventDispatcher.java:1088)
  [bndtest] 	at org.apache.felix.framework.util.EventDispatcher.access$000(EventDispatcher.java:54)
  [bndtest] 	at org.apache.felix.framework.util.EventDispatcher$1.run(EventDispatcher.java:101)
  [bndtest] 	at java.lang.Thread.run(Thread.java:662)
  [bndtest] ERROR: Bundle org.apache.ace.agent [2] EventDispatcher: Error during dispatch.
(java.lang.NullPointerException)
  [bndtest] java.lang.NullPointerException
  [bndtest] 	at org.apache.ace.agent.impl.FeedbackStoreManager.isCurrentStoreMaximumFileSizeReached(Unknown
Source)
  [bndtest] 	at org.apache.ace.agent.impl.FeedbackStoreManager.write(Unknown Source)
  [bndtest] 	at org.apache.ace.agent.impl.FeedbackChannelImpl.write(Unknown Source)
  [bndtest] 	at org.apache.ace.agent.impl.EventLoggerImpl.writeAuditEvent(Unknown Source)
  [bndtest] 	at org.apache.ace.agent.impl.EventLoggerImpl.bundleChanged(Unknown Source)
  [bndtest] 	at org.apache.felix.framework.util.EventDispatcher.invokeBundleListenerCallback(EventDispatcher.java:868)
  [bndtest] 	at org.apache.felix.framework.util.EventDispatcher.fireEventImmediately(EventDispatcher.java:789)
  [bndtest] 	at org.apache.felix.framework.util.EventDispatcher.run(EventDispatcher.java:1088)
  [bndtest] 	at org.apache.felix.framework.util.EventDispatcher.access$000(EventDispatcher.java:54)
  [bndtest] 	at org.apache.felix.framework.util.EventDispatcher$1.run(EventDispatcher.java:101)
  [bndtest] 	at java.lang.Thread.run(Thread.java:662)
  [bndtest] [INFO] 17:47:39 (controller) Installing streaming deployment update 0.0.0 =>
1.0.0
  [bndtest] [INFO] 17:47:40 (controller) Installing streaming deployment update 1.0.0 =>
6.0.0
  [bndtest] [ERROR] 17:47:40 (deployment) Stream does not contain a valid deployment package:
missing manifest!
  [bndtest] ERROR: Bundle org.apache.ace.agent [2] EventDispatcher: Error during dispatch.
(java.lang.NullPointerException)
  [bndtest] java.lang.NullPointerException
  [bndtest] 	at org.apache.ace.agent.impl.FeedbackStoreManager.isCurrentStoreMaximumFileSizeReached(Unknown
Source)
  [bndtest] 	at org.apache.ace.agent.impl.FeedbackStoreManager.write(Unknown Source)
  [bndtest] 	at org.apache.ace.agent.impl.FeedbackChannelImpl.write(Unknown Source)
  [bndtest] 	at org.apache.ace.agent.impl.EventLoggerImpl.writeAuditEvent(Unknown Source)
  [bndtest] 	at org.apache.ace.agent.impl.EventLoggerImpl.bundleChanged(Unknown Source)
  [bndtest] 	at org.apache.felix.framework.util.EventDispatcher.invokeBundleListenerCallback(EventDispatcher.java:868)
  [bndtest] 	at org.apache.felix.framework.util.EventDispatcher.fireEventImmediately(EventDispatcher.java:789)
  [bndtest] 	at org.apache.felix.framework.util.EventDispatcher.run(EventDispatcher.java:1088)
  [bndtest] 	at org.apache.felix.framework.util.EventDispatcher.access$000(EventDispatcher.java:54)
  [bndtest] 	at org.apache.felix.framework.util.EventDispatcher$1.run(EventDispatcher.java:101)
  [bndtest] 	at java.lang.Thread.run(Thread.java:662)
  [bndtest] Errors: 0
  [bndtest] Failures: 0
  [bndtest] All tests passed

template.init:
     [echo] Enter project org.apache.ace.agent.launcher

init:

dependencies:

compile:

test:

template.init:
     [echo] Enter project org.apache.ace.repository

init:

dependencies:

compile:

test:

template.init:
     [echo] Enter project org.apache.ace.deployment

init:

dependencies:

compile:

test:

template.init:
     [echo] Enter project org.apache.ace.resourceprocessor.useradmin

init:

dependencies:

compile:

test:

template.init:
     [echo] Enter project org.apache.ace.configurator

init:

dependencies:

compile:

test:

template.init:
     [echo] Enter project org.apache.ace.http

init:

dependencies:

compile:

test:

template.init:
     [echo] Enter project org.apache.ace.agent.update.itest

init:

dependencies:

compile:

test:
  [bndtest] Testing /zonestorage/hudson_solaris/home/hudson/hudson-slave/workspace/ACE-trunk/org.apache.ace.agent.update.itest/bnd.bnd
  [bndtest] 2013-09-23 17:47:58.913:INFO:oejs.Server:jetty-7.x.y-SNAPSHOT
  [bndtest] 2013-09-23 17:47:58.949:INFO:oejsh.ContextHandler:started o.e.j.s.ServletContextHandler{/,null}
  [bndtest] 2013-09-23 17:47:58.983:INFO:oejs.AbstractConnector:Started SelectChannelConnector@0.0.0.0:8080
  [bndtest] [INFO] Started jetty 7.x.y-SNAPSHOT at port(s) HTTP:8080 on context path /
  [bndtest] ____________________________
  [bndtest] Welcome to Apache Felix Gogo
  [bndtest] 
  [bndtest] 2013-09-23 17:47:59.358:INFO:oejsh.ContextHandler:stopped o.e.j.s.ServletContextHandler{/,null}
  [bndtest] 2013-09-23 17:47:59.424:INFO:oejs.Server:jetty-7.x.y-SNAPSHOT
  [bndtest] 2013-09-23 17:47:59.425:INFO:oejsh.ContextHandler:started o.e.j.s.ServletContextHandler{/,null}
  [bndtest] 2013-09-23 17:47:59.436:INFO:oejs.AbstractConnector:Started SelectChannelConnector@0.0.0.0:8080
  [bndtest] g! [INFO] Started jetty 7.x.y-SNAPSHOT at port(s) HTTP:8080 on context path /
  [bndtest] Updating in phase: CORRUPT_STREAM
  [bndtest] [WARNING] 17:48:03 (controller) Exception while sending feedback for channel:
auditlog
  [bndtest] java.io.FileNotFoundException: http://localhost:8080/auditlog/query?tid=defaultTargetID&logid=1379958478532
  [bndtest] 	at sun.net.www.protocol.http.HttpURLConnection.getInputStream(HttpURLConnection.java:1434)
  [bndtest] 	at org.apache.ace.agent.impl.FeedbackChannelImpl.sendFeedback(Unknown Source)
  [bndtest] 	at org.apache.ace.agent.impl.DefaultController.runFeedback(Unknown Source)
  [bndtest] 	at org.apache.ace.agent.impl.DefaultController.run(Unknown Source)
  [bndtest] 	at java.util.concurrent.Executors$RunnableAdapter.call(Executors.java:441)
  [bndtest] 	at java.util.concurrent.FutureTask$Sync.innerRun(FutureTask.java:303)
  [bndtest] 	at java.util.concurrent.FutureTask.run(FutureTask.java:138)
  [bndtest] 	at java.util.concurrent.ScheduledThreadPoolExecutor$ScheduledFutureTask.access$301(ScheduledThreadPoolExecutor.java:98)
  [bndtest] 	at java.util.concurrent.ScheduledThreadPoolExecutor$ScheduledFutureTask.run(ScheduledThreadPoolExecutor.java:206)
  [bndtest] 	at java.util.concurrent.ThreadPoolExecutor$Worker.runTask(ThreadPoolExecutor.java:886)
  [bndtest] 	at java.util.concurrent.ThreadPoolExecutor$Worker.run(ThreadPoolExecutor.java:908)
  [bndtest] 	at java.lang.Thread.run(Thread.java:662)
  [bndtest] [ERROR] 17:48:03 (controller) Sync aborted due to Exception.
  [bndtest] java.io.IOException: Unable to handle server responsecode: 500, for http://localhost:8080/agent/defaultTargetID/org.apache.ace.agent/versions/
  [bndtest] 	at org.apache.ace.agent.impl.ConnectionUtil.checkConnectionResponse(Unknown Source)
  [bndtest] 	at org.apache.ace.agent.impl.UpdateHandlerBase.getAvailableVersions(Unknown Source)
  [bndtest] 	at org.apache.ace.agent.impl.AgentUpdateHandlerImpl.getAvailableVersions(Unknown
Source)
  [bndtest] 	at org.apache.ace.agent.impl.UpdateHandlerBase.getHighestAvailableVersion(Unknown
Source)
  [bndtest] 	at org.apache.ace.agent.impl.DefaultController$UpdateInstaller.installUpdate(Unknown
Source)
  [bndtest] 	at org.apache.ace.agent.impl.DefaultController.runAgentUpdate(Unknown Source)
  [bndtest] 	at org.apache.ace.agent.impl.DefaultController.run(Unknown Source)
  [bndtest] 	at java.util.concurrent.Executors$RunnableAdapter.call(Executors.java:441)
  [bndtest] 	at java.util.concurrent.FutureTask$Sync.innerRun(FutureTask.java:303)
  [bndtest] 	at java.util.concurrent.FutureTask.run(FutureTask.java:138)
  [bndtest] 	at java.util.concurrent.ScheduledThreadPoolExecutor$ScheduledFutureTask.access$301(ScheduledThreadPoolExecutor.java:98)
  [bndtest] 	at java.util.concurrent.ScheduledThreadPoolExecutor$ScheduledFutureTask.run(ScheduledThreadPoolExecutor.java:206)
  [bndtest] 	at java.util.concurrent.ThreadPoolExecutor$Worker.runTask(ThreadPoolExecutor.java:886)
  [bndtest] 	at java.util.concurrent.ThreadPoolExecutor$Worker.run(ThreadPoolExecutor.java:908)
  [bndtest] 	at java.lang.Thread.run(Thread.java:662)
  [bndtest] Errors: 0
  [bndtest] Failures: 1
  [bndtest] 1 Error(s)
  [bndtest] Tests failed
  [bndtest] 	at aQute.bnd.ant.TestTask.executeProject(TestTask.java:78)
  [bndtest] 	at aQute.bnd.ant.TestTask.execute(TestTask.java:49)
  [bndtest] 	at org.apache.tools.ant.UnknownElement.execute(UnknownElement.java:291)
  [bndtest] 	at sun.reflect.GeneratedMethodAccessor4.invoke(Unknown Source)
  [bndtest] 	at sun.reflect.DelegatingMethodAccessorImpl.invoke(DelegatingMethodAccessorImpl.java:25)
  [bndtest] 	at java.lang.reflect.Method.invoke(Method.java:597)
  [bndtest] 	at org.apache.tools.ant.dispatch.DispatchUtils.execute(DispatchUtils.java:106)
  [bndtest] 	at org.apache.tools.ant.Task.perform(Task.java:348)
  [bndtest] 	at org.apache.tools.ant.Target.execute(Target.java:390)
  [bndtest] 	at org.apache.tools.ant.Target.performTasks(Target.java:411)
  [bndtest] 	at org.apache.tools.ant.Project.executeSortedTargets(Project.java:1399)
  [bndtest] 	at org.apache.tools.ant.helper.SingleCheckExecutor.executeTargets(SingleCheckExecutor.java:38)
  [bndtest] 	at org.apache.tools.ant.Project.executeTargets(Project.java:1251)
  [bndtest] 	at org.apache.tools.ant.taskdefs.Ant.execute(Ant.java:442)
  [bndtest] 	at org.apache.tools.ant.taskdefs.SubAnt.execute(SubAnt.java:302)
  [bndtest] 	at org.apache.tools.ant.taskdefs.SubAnt.execute(SubAnt.java:221)
  [bndtest] 	at org.apache.tools.ant.UnknownElement.execute(UnknownElement.java:291)
  [bndtest] 	at sun.reflect.GeneratedMethodAccessor4.invoke(Unknown Source)
  [bndtest] 	at sun.reflect.DelegatingMethodAccessorImpl.invoke(DelegatingMethodAccessorImpl.java:25)
  [bndtest] 	at java.lang.reflect.Method.invoke(Method.java:597)
  [bndtest] 	at org.apache.tools.ant.dispatch.DispatchUtils.execute(DispatchUtils.java:106)
  [bndtest] 	at org.apache.tools.ant.Task.perform(Task.java:348)
  [bndtest] 	at org.apache.tools.ant.Target.execute(Target.java:390)
  [bndtest] 	at org.apache.tools.ant.Target.performTasks(Target.java:411)
  [bndtest] 	at org.apache.tools.ant.Project.executeSortedTargets(Project.java:1399)
  [bndtest] 	at org.apache.tools.ant.Project.executeTarget(Project.java:1368)
  [bndtest] 	at org.apache.tools.ant.helper.DefaultExecutor.executeTargets(DefaultExecutor.java:41)
  [bndtest] 	at org.apache.tools.ant.Project.executeTargets(Project.java:1251)
  [bndtest] 	at org.apache.tools.ant.Main.runBuild(Main.java:809)
  [bndtest] 	at org.apache.tools.ant.Main.startAnt(Main.java:217)
  [bndtest] 	at org.apache.tools.ant.launch.Launcher.run(Launcher.java:280)
  [bndtest] 	at org.apache.tools.ant.launch.Launcher.main(Launcher.java:109)

BUILD FAILED
/zonestorage/hudson_solaris/home/hudson/hudson-slave/workspace/ACE-trunk/cnf/build.xml:55:
The following error occurred while executing this line:
/zonestorage/hudson_solaris/home/hudson/hudson-slave/workspace/ACE-trunk/cnf/build-template.xml:67:
Tests failed

Total time: 14 minutes 20 seconds
Build step 'Invoke Ant' marked build as failure
Recording test results
TestNG Reports Processing: START
Looking for TestNG results report in workspace using pattern: **/testng/testng-results.xml
Saving reports...
Processing '/home/hudson/hudson/jobs/ACE-trunk/builds/2013-09-23_17-32-50/testng/testng-results-1.xml'
Processing '/home/hudson/hudson/jobs/ACE-trunk/builds/2013-09-23_17-32-50/testng/testng-results-10.xml'
Processing '/home/hudson/hudson/jobs/ACE-trunk/builds/2013-09-23_17-32-50/testng/testng-results-11.xml'
Processing '/home/hudson/hudson/jobs/ACE-trunk/builds/2013-09-23_17-32-50/testng/testng-results-12.xml'
Processing '/home/hudson/hudson/jobs/ACE-trunk/builds/2013-09-23_17-32-50/testng/testng-results-13.xml'
Processing '/home/hudson/hudson/jobs/ACE-trunk/builds/2013-09-23_17-32-50/testng/testng-results-14.xml'
Processing '/home/hudson/hudson/jobs/ACE-trunk/builds/2013-09-23_17-32-50/testng/testng-results-15.xml'
Processing '/home/hudson/hudson/jobs/ACE-trunk/builds/2013-09-23_17-32-50/testng/testng-results-16.xml'
Processing '/home/hudson/hudson/jobs/ACE-trunk/builds/2013-09-23_17-32-50/testng/testng-results-17.xml'
Processing '/home/hudson/hudson/jobs/ACE-trunk/builds/2013-09-23_17-32-50/testng/testng-results-2.xml'
Processing '/home/hudson/hudson/jobs/ACE-trunk/builds/2013-09-23_17-32-50/testng/testng-results-3.xml'
Processing '/home/hudson/hudson/jobs/ACE-trunk/builds/2013-09-23_17-32-50/testng/testng-results-4.xml'
Processing '/home/hudson/hudson/jobs/ACE-trunk/builds/2013-09-23_17-32-50/testng/testng-results-5.xml'
Processing '/home/hudson/hudson/jobs/ACE-trunk/builds/2013-09-23_17-32-50/testng/testng-results-6.xml'
Processing '/home/hudson/hudson/jobs/ACE-trunk/builds/2013-09-23_17-32-50/testng/testng-results-7.xml'
Processing '/home/hudson/hudson/jobs/ACE-trunk/builds/2013-09-23_17-32-50/testng/testng-results-8.xml'
Processing '/home/hudson/hudson/jobs/ACE-trunk/builds/2013-09-23_17-32-50/testng/testng-results-9.xml'
Processing '/home/hudson/hudson/jobs/ACE-trunk/builds/2013-09-23_17-32-50/testng/testng-results.xml'
TestNG Reports Processing: FINISH

Mime
View raw message