ace-dev mailing list archives

Site index · List index
Message view « Date » · « Thread »
Top « Date » · « Thread »
From Apache Jenkins Server <jenk...@builds.apache.org>
Subject Build failed in Jenkins: ACE-trunk #102
Date Thu, 19 Sep 2013 15:47:46 GMT
See <https://builds.apache.org/job/ACE-trunk/102/changes>

Changes:

[bramk] ACE-386 - Added tests for byte range support

[jawi] Download a little more in the hope something is actually written to disk on Solaris.

------------------------------------------
[...truncated 5104 lines...]
  [bndtest] 	at java.lang.Thread.run(Thread.java:662)
  [bndtest] Updating in phase: BUNDLE_DOES_NOT_RESOLVE
  [bndtest] [ERROR] 15:47:16 (feedbackChannel(auditlog)) Exception caught while accessing
feedback channel store #1379605631167
  [bndtest] java.io.IOException: Unexpected end of file
  [bndtest] 	at org.apache.ace.agent.impl.FeedbackStore.skip(Unknown Source)
  [bndtest] 	at org.apache.ace.agent.impl.FeedbackStore.init(Unknown Source)
  [bndtest] 	at org.apache.ace.agent.impl.FeedbackStoreManager.<init>(Unknown Source)
  [bndtest] 	at org.apache.ace.agent.impl.FeedbackStoreManager.<init>(Unknown Source)
  [bndtest] 	at org.apache.ace.agent.impl.FeedbackChannelImpl.<init>(Unknown Source)
  [bndtest] 	at org.apache.ace.agent.impl.FeedbackHandlerImpl.registerFeedbackChannel(Unknown
Source)
  [bndtest] 	at org.apache.ace.agent.impl.FeedbackHandlerImpl.onStart(Unknown Source)
  [bndtest] 	at org.apache.ace.agent.impl.ComponentBase.start(Unknown Source)
  [bndtest] 	at org.apache.ace.agent.impl.AgentContextImpl.startAgentContextAware(Unknown
Source)
  [bndtest] java.io.IOException: Unexpected end of file
  [bndtest] 	at org.apache.ace.agent.impl.AgentContextImpl.start(Unknown Source)
  [bndtest] 	at org.apache.ace.agent.impl.FeedbackStore.skip(Unknown Source)
  [bndtest] 	at org.apache.ace.agent.impl.Activator.componentStarted(Unknown Source)
  [bndtest] 	at org.apache.ace.agent.impl.FeedbackStore.init(Unknown Source)
  [bndtest] 	at org.apache.ace.agent.impl.DependencyTrackerImpl.startComponent(Unknown Source)
  [bndtest] 	at org.apache.ace.agent.impl.FeedbackStoreManager.<init>(Unknown Source)
  [bndtest] 	at org.apache.ace.agent.impl.DependencyTrackerImpl.update(Unknown Source)
  [bndtest] 	at org.apache.ace.agent.impl.FeedbackStoreManager.<init>(Unknown Source)
  [bndtest] 	at org.apache.ace.agent.impl.DependencyTrackerImpl$ServiceDependency.changed(Unknown
Source)
  [bndtest] 	at org.apache.ace.agent.impl.FeedbackChannelImpl.<init>(Unknown Source)
  [bndtest] 	at org.apache.ace.agent.impl.FeedbackHandlerImpl.registerFeedbackChannel(Unknown
Source)
  [bndtest] 	at org.apache.ace.agent.impl.FeedbackHandlerImpl.onStart(Unknown Source)
  [bndtest] 	at org.apache.ace.agent.impl.ComponentBase.start(Unknown Source)
  [bndtest] 	at org.apache.ace.agent.impl.AgentContextImpl.startAgentContextAware(Unknown
Source)
  [bndtest] 	at org.apache.ace.agent.impl.AgentContextImpl.start(Unknown Source)
  [bndtest] 	at org.apache.ace.agent.impl.Activator.componentStarted(Unknown Source)
  [bndtest] 	at org.apache.ace.agent.impl.DependencyTrackerImpl$ServiceDependencyTracker.checkForUpdate(Unknown
Source)
  [bndtest] 	at org.apache.ace.agent.impl.DependencyTrackerImpl.startComponent(Unknown Source)
  [bndtest] 	at org.apache.ace.agent.impl.DependencyTrackerImpl$ServiceDependencyTracker.addingService(Unknown
Source)
  [bndtest] 	at org.apache.ace.agent.impl.DependencyTrackerImpl.update(Unknown Source)
  [bndtest] 	at org.osgi.util.tracker.ServiceTracker$Tracked.customizerAdding(ServiceTracker.java:896)
  [bndtest] 	at org.apache.ace.agent.impl.DependencyTrackerImpl$ServiceDependency.changed(Unknown
Source)
  [bndtest] 	at org.osgi.util.tracker.AbstractTracked.trackAdding(AbstractTracked.java:261)
  [bndtest] 	at org.osgi.util.tracker.AbstractTracked.trackInitial(AbstractTracked.java:184)
  [bndtest] 	at org.apache.ace.agent.impl.DependencyTrackerImpl$ServiceDependencyTracker.checkForUpdate(Unknown
Source)
  [bndtest] 	at org.osgi.util.tracker.ServiceTracker.open(ServiceTracker.java:339)
  [bndtest] 	at org.osgi.util.tracker.ServiceTracker.open(ServiceTracker.java:273)
  [bndtest] 	at org.apache.ace.agent.impl.DependencyTrackerImpl$ServiceDependencyTracker.addingService(Unknown
Source)
  [bndtest] 	at org.apache.ace.agent.impl.DependencyTrackerImpl$ServiceDependency.startTracking(Unknown
Source)
  [bndtest] 	at org.osgi.util.tracker.ServiceTracker$Tracked.customizerAdding(ServiceTracker.java:896)
  [bndtest] 	at org.apache.ace.agent.impl.DependencyTrackerImpl.startTracking(Unknown Source)
  [bndtest] 	at org.osgi.util.tracker.AbstractTracked.trackAdding(AbstractTracked.java:261)
  [bndtest] 	at org.apache.ace.agent.impl.Activator.start(Unknown Source)
  [bndtest] 	at org.osgi.util.tracker.AbstractTracked.trackInitial(AbstractTracked.java:184)
  [bndtest] 	at org.apache.felix.framework.util.SecureAction.startActivator(SecureAction.java:645)
  [bndtest] 	at org.osgi.util.tracker.ServiceTracker.open(ServiceTracker.java:339)
  [bndtest] 	at org.apache.felix.framework.Felix.activateBundle(Felix.java:1977)
  [bndtest] 	at org.osgi.util.tracker.ServiceTracker.open(ServiceTracker.java:273)
  [bndtest] 	at org.apache.felix.framework.Felix.startBundle(Felix.java:1895)
  [bndtest] 	at org.apache.felix.framework.BundleImpl.start(BundleImpl.java:944)
  [bndtest] 	at org.apache.ace.agent.impl.DependencyTrackerImpl$ServiceDependency.startTracking(Unknown
Source)
  [bndtest] 	at org.apache.felix.framework.BundleImpl.start(BundleImpl.java:931)
  [bndtest] 	at org.apache.ace.agent.impl.DependencyTrackerImpl.startTracking(Unknown Source)
  [bndtest] 	at org.apache.ace.agent.updater.Activator.run(Unknown Source)
  [bndtest] 	at java.lang.Thread.run(Thread.java:662)
  [bndtest] 	at org.apache.ace.agent.impl.Activator.start(Unknown Source)
  [bndtest] 	at org.apache.felix.framework.util.SecureAction.startActivator(SecureAction.java:645)
  [bndtest] ERROR: Bundle org.apache.ace.agent [2] EventDispatcher: Error during dispatch.
(java.lang.NullPointerException)
  [bndtest] 	at org.apache.felix.framework.Felix.activateBundle(Felix.java:1977)
  [bndtest] 	at org.apache.felix.framework.Felix.startBundle(Felix.java:1895)
  [bndtest] 	at org.apache.felix.framework.BundleImpl.start(BundleImpl.java:944)
  [bndtest] 	at org.apache.felix.framework.BundleImpl.start(BundleImpl.java:931)
  [bndtest] 	at org.apache.ace.agent.updater.Activator.run(Unknown Source)
  [bndtest] 	at java.lang.Thread.run(Thread.java:662)
  [bndtest] java.lang.NullPointerException
  [bndtest] 	at org.apache.ace.agent.impl.FeedbackStoreManager.handleException(Unknown Source)
  [bndtest] 	at org.apache.ace.agent.impl.FeedbackStoreManager.write(Unknown Source)
  [bndtest] 	at org.apache.ace.agent.impl.FeedbackChannelImpl.write(Unknown Source)
  [bndtest] 	at org.apache.ace.agent.impl.EventLoggerImpl.writeAuditEvent(Unknown Source)
  [bndtest] 	at org.apache.ace.agent.impl.EventLoggerImpl.bundleChanged(Unknown Source)
  [bndtest] 	at org.apache.felix.framework.util.EventDispatcher.invokeBundleListenerCallback(EventDispatcher.java:868)
  [bndtest] 	at org.apache.felix.framework.util.EventDispatcher.fireEventImmediately(EventDispatcher.java:789)
  [bndtest] 	at org.apache.felix.framework.util.EventDispatcher.run(EventDispatcher.java:1088)
  [bndtest] 	at org.apache.felix.framework.util.EventDispatcher.access$000(EventDispatcher.java:54)
  [bndtest] 	at org.apache.felix.framework.util.EventDispatcher$1.run(EventDispatcher.java:101)
  [bndtest] 	at java.lang.Thread.run(Thread.java:662)
  [bndtest] Updating in phase: BUNDLE_DOES_NOT_START
  [bndtest] [WARNING] 15:47:26 (controller) Exception while sending feedback for channel:
auditlog
  [bndtest] java.io.FileNotFoundException: http://localhost:8080/auditlog/query?tid=defaultTargetID&logid=1379605631167
  [bndtest] 	at sun.net.www.protocol.http.HttpURLConnection.getInputStream(HttpURLConnection.java:1457)
  [bndtest] 	at org.apache.ace.agent.impl.FeedbackChannelImpl.sendFeedback(Unknown Source)
  [bndtest] 	at org.apache.ace.agent.impl.DefaultController.runFeedback(Unknown Source)
  [bndtest] 	at org.apache.ace.agent.impl.DefaultController.run(Unknown Source)
  [bndtest] 	at java.util.concurrent.Executors$RunnableAdapter.call(Executors.java:439)
  [bndtest] 	at java.util.concurrent.FutureTask$Sync.innerRun(FutureTask.java:303)
  [bndtest] 	at java.util.concurrent.FutureTask.run(FutureTask.java:138)
  [bndtest] 	at java.util.concurrent.ScheduledThreadPoolExecutor$ScheduledFutureTask.access$301(ScheduledThreadPoolExecutor.java:98)
  [bndtest] 	at java.util.concurrent.ScheduledThreadPoolExecutor$ScheduledFutureTask.run(ScheduledThreadPoolExecutor.java:206)
  [bndtest] 	at java.util.concurrent.ThreadPoolExecutor$Worker.runTask(ThreadPoolExecutor.java:895)
  [bndtest] 	at java.util.concurrent.ThreadPoolExecutor$Worker.run(ThreadPoolExecutor.java:918)
  [bndtest] 	at java.lang.Thread.run(Thread.java:662)
  [bndtest] Updating in phase: BUNDLE_WORKS
  [bndtest] java.lang.NullPointerException
  [bndtest] ERROR: Bundle org.apache.ace.agent [2] EventDispatcher: Error during dispatch.
(java.lang.NullPointerException)
  [bndtest] 	at org.apache.ace.agent.impl.FeedbackStoreManager.handleException(Unknown Source)
  [bndtest] 	at org.apache.ace.agent.impl.FeedbackStoreManager.write(Unknown Source)
  [bndtest] 	at org.apache.ace.agent.impl.FeedbackChannelImpl.write(Unknown Source)
  [bndtest] 	at org.apache.ace.agent.impl.EventLoggerImpl.writeAuditEvent(Unknown Source)
  [bndtest] 	at org.apache.ace.agent.impl.EventLoggerImpl.bundleChanged(Unknown Source)
  [bndtest] 	at org.apache.felix.framework.util.EventDispatcher.invokeBundleListenerCallback(EventDispatcher.java:868)
  [bndtest] 	at org.apache.felix.framework.util.EventDispatcher.fireEventImmediately(EventDispatcher.java:789)
  [bndtest] 	at org.apache.felix.framework.util.EventDispatcher.run(EventDispatcher.java:1088)
  [bndtest] 	at org.apache.felix.framework.util.EventDispatcher.access$000(EventDispatcher.java:54)
  [bndtest] 	at org.apache.felix.framework.util.EventDispatcher$1.run(EventDispatcher.java:101)
  [bndtest] 	at java.lang.Thread.run(Thread.java:662)
  [bndtest] Tests run  : 1
  [bndtest] Passed     : 1
  [bndtest] Errors     : 0
  [bndtest] Failures   : 0
  [bndtest] All tests passed

template.init:
     [echo] Enter project org.apache.ace.ant.tasks

init:

dependencies:

compile:

test:

template.init:
     [echo] Enter project org.apache.ace.client.repository

init:

dependencies:

compile:

test:

template.init:
     [echo] Enter project org.apache.ace.obr

init:

dependencies:

compile:

test:

template.init:
     [echo] Enter project org.apache.ace.authentication.itest

init:

dependencies:

compile:

test:
  [bndtest] Testing <https://builds.apache.org/job/ACE-trunk/ws/org.apache.ace.authentication.itest/bnd.bnd>
  [bndtest] 2013-09-19 15:47:29.589:INFO:oejs.Server:jetty-7.x.y-SNAPSHOT
  [bndtest] 2013-09-19 15:47:29.629:INFO:oejsh.ContextHandler:started o.e.j.s.ServletContextHandler{/,null}
  [bndtest] 2013-09-19 15:47:29.660:INFO:oejs.AbstractConnector:Started SelectChannelConnector@0.0.0.0:8080
  [bndtest] ____________________________
  [bndtest] Welcome to Apache Felix Gogo
  [bndtest] 
  [bndtest] Bundle Indexer | v2.2
  [bndtest] (c) 2007 OSGi, All Rights Reserved
  [bndtest] Got response code 401 for http://localhost:8080/obr/repository.xml
  [bndtest] Got response code 401 for http://localhost:8080/obr/repository.xml
  [bndtest] Bundle Indexer | v2.2
  [bndtest] (c) 2007 OSGi, All Rights Reserved
  [bndtest] Got response code 401 for http://localhost:8080/obr/repository.xml
  [bndtest] Bundle Indexer | v2.2
  [bndtest] (c) 2007 OSGi, All Rights Reserved
  [bndtest] Got response code 401 for http://localhost:8080/obr/repository.xml
  [bndtest] Bundle Indexer | v2.2
  [bndtest] (c) 2007 OSGi, All Rights Reserved
  [bndtest] Got response code 401 for http://localhost:8080/obr/repository.xml
  [bndtest] Bundle Indexer | v2.2
  [bndtest] (c) 2007 OSGi, All Rights Reserved
  [bndtest] Got response code 401 for http://localhost:8080/auditlog
  [bndtest] Tests run  : 7
  [bndtest] Passed     : 6
  [bndtest] Errors     : 0
  [bndtest] Failures   : 1
  [bndtest] 1 Error(s)
  [bndtest] Tests failed
  [bndtest] 	at aQute.bnd.ant.TestTask.executeProject(TestTask.java:78)
  [bndtest] 	at aQute.bnd.ant.TestTask.execute(TestTask.java:49)
  [bndtest] 	at org.apache.tools.ant.UnknownElement.execute(UnknownElement.java:291)
  [bndtest] 	at sun.reflect.GeneratedMethodAccessor4.invoke(Unknown Source)
  [bndtest] 	at sun.reflect.DelegatingMethodAccessorImpl.invoke(DelegatingMethodAccessorImpl.java:25)
  [bndtest] 	at java.lang.reflect.Method.invoke(Method.java:597)
  [bndtest] 	at org.apache.tools.ant.dispatch.DispatchUtils.execute(DispatchUtils.java:106)
  [bndtest] 	at org.apache.tools.ant.Task.perform(Task.java:348)
  [bndtest] 	at org.apache.tools.ant.Target.execute(Target.java:390)
  [bndtest] 	at org.apache.tools.ant.Target.performTasks(Target.java:411)
  [bndtest] 	at org.apache.tools.ant.Project.executeSortedTargets(Project.java:1399)
  [bndtest] 	at org.apache.tools.ant.helper.SingleCheckExecutor.executeTargets(SingleCheckExecutor.java:38)
  [bndtest] 	at org.apache.tools.ant.Project.executeTargets(Project.java:1251)
  [bndtest] 	at org.apache.tools.ant.taskdefs.Ant.execute(Ant.java:442)
  [bndtest] 	at org.apache.tools.ant.taskdefs.SubAnt.execute(SubAnt.java:302)
  [bndtest] 	at org.apache.tools.ant.taskdefs.SubAnt.execute(SubAnt.java:221)
  [bndtest] 	at org.apache.tools.ant.UnknownElement.execute(UnknownElement.java:291)
  [bndtest] 	at sun.reflect.GeneratedMethodAccessor4.invoke(Unknown Source)
  [bndtest] 	at sun.reflect.DelegatingMethodAccessorImpl.invoke(DelegatingMethodAccessorImpl.java:25)
  [bndtest] 	at java.lang.reflect.Method.invoke(Method.java:597)
  [bndtest] 	at org.apache.tools.ant.dispatch.DispatchUtils.execute(DispatchUtils.java:106)
  [bndtest] 	at org.apache.tools.ant.Task.perform(Task.java:348)
  [bndtest] 	at org.apache.tools.ant.Target.execute(Target.java:390)
  [bndtest] 	at org.apache.tools.ant.Target.performTasks(Target.java:411)
  [bndtest] 	at org.apache.tools.ant.Project.executeSortedTargets(Project.java:1399)
  [bndtest] 	at org.apache.tools.ant.Project.executeTarget(Project.java:1368)
  [bndtest] 	at org.apache.tools.ant.helper.DefaultExecutor.executeTargets(DefaultExecutor.java:41)
  [bndtest] 	at org.apache.tools.ant.Project.executeTargets(Project.java:1251)
  [bndtest] 	at org.apache.tools.ant.Main.runBuild(Main.java:809)
  [bndtest] 	at org.apache.tools.ant.Main.startAnt(Main.java:217)
  [bndtest] 	at org.apache.tools.ant.launch.Launcher.run(Launcher.java:280)
  [bndtest] 	at org.apache.tools.ant.launch.Launcher.main(Launcher.java:109)

BUILD FAILED
<https://builds.apache.org/job/ACE-trunk/ws/cnf/build.xml>:55: The following error occurred
while executing this line:
<https://builds.apache.org/job/ACE-trunk/ws/cnf/build-template.xml>:67: Tests failed

Total time: 13 minutes 42 seconds
Build step 'Invoke Ant' marked build as failure
Recording test results
TestNG Reports Processing: START
Looking for TestNG results report in workspace using pattern: **/testng/testng-results.xml
Saving reports...
Processing '/home/hudson/hudson/jobs/ACE-trunk/builds/2013-09-19_15-32-50/testng/testng-results-1.xml'
Processing '/home/hudson/hudson/jobs/ACE-trunk/builds/2013-09-19_15-32-50/testng/testng-results-10.xml'
Processing '/home/hudson/hudson/jobs/ACE-trunk/builds/2013-09-19_15-32-50/testng/testng-results-11.xml'
Processing '/home/hudson/hudson/jobs/ACE-trunk/builds/2013-09-19_15-32-50/testng/testng-results-12.xml'
Processing '/home/hudson/hudson/jobs/ACE-trunk/builds/2013-09-19_15-32-50/testng/testng-results-13.xml'
Processing '/home/hudson/hudson/jobs/ACE-trunk/builds/2013-09-19_15-32-50/testng/testng-results-14.xml'
Processing '/home/hudson/hudson/jobs/ACE-trunk/builds/2013-09-19_15-32-50/testng/testng-results-15.xml'
Processing '/home/hudson/hudson/jobs/ACE-trunk/builds/2013-09-19_15-32-50/testng/testng-results-16.xml'
Processing '/home/hudson/hudson/jobs/ACE-trunk/builds/2013-09-19_15-32-50/testng/testng-results-17.xml'
Processing '/home/hudson/hudson/jobs/ACE-trunk/builds/2013-09-19_15-32-50/testng/testng-results-2.xml'
Processing '/home/hudson/hudson/jobs/ACE-trunk/builds/2013-09-19_15-32-50/testng/testng-results-3.xml'
Processing '/home/hudson/hudson/jobs/ACE-trunk/builds/2013-09-19_15-32-50/testng/testng-results-4.xml'
Processing '/home/hudson/hudson/jobs/ACE-trunk/builds/2013-09-19_15-32-50/testng/testng-results-5.xml'
Processing '/home/hudson/hudson/jobs/ACE-trunk/builds/2013-09-19_15-32-50/testng/testng-results-6.xml'
Processing '/home/hudson/hudson/jobs/ACE-trunk/builds/2013-09-19_15-32-50/testng/testng-results-7.xml'
Processing '/home/hudson/hudson/jobs/ACE-trunk/builds/2013-09-19_15-32-50/testng/testng-results-8.xml'
Processing '/home/hudson/hudson/jobs/ACE-trunk/builds/2013-09-19_15-32-50/testng/testng-results-9.xml'
Processing '/home/hudson/hudson/jobs/ACE-trunk/builds/2013-09-19_15-32-50/testng/testng-results.xml'
TestNG Reports Processing: FINISH

Mime
View raw message