ace-dev mailing list archives

Site index · List index
Message view « Date » · « Thread »
Top « Date » · « Thread »
From Apache Jenkins Server <jenk...@builds.apache.org>
Subject Build failed in Jenkins: ACE-trunk #104
Date Fri, 20 Sep 2013 11:44:42 GMT
See <https://builds.apache.org/job/ACE-trunk/104/changes>

Changes:

[jawi] ACE-381 - do not close current store.

------------------------------------------
[...truncated 2603 lines...]
  [bndtest] 	at org.apache.felix.deploymentadmin.DeploymentAdminImpl.installDeploymentPackage(DeploymentAdminImpl.java:214)
  [bndtest] 	at org.apache.ace.agent.impl.DeploymentHandlerImpl.install(Unknown Source)
  [bndtest] 	at org.apache.ace.agent.impl.DefaultController$DownloadUpdateInstaller.doInstallUpdate(Unknown
Source)
  [bndtest] 	at org.apache.ace.agent.impl.DefaultController$UpdateInstaller.installUpdate(Unknown
Source)
  [bndtest] 	at org.apache.ace.agent.impl.DefaultController.runDeploymentUpdate(Unknown Source)
  [bndtest] 	at org.apache.ace.agent.impl.DefaultController.run(Unknown Source)
  [bndtest] 	at java.util.concurrent.Executors$RunnableAdapter.call(Executors.java:439)
  [bndtest] 	at java.util.concurrent.FutureTask$Sync.innerRun(FutureTask.java:303)
  [bndtest] 	at java.util.concurrent.FutureTask.run(FutureTask.java:138)
  [bndtest] 	at java.util.concurrent.ScheduledThreadPoolExecutor$ScheduledFutureTask.access$301(ScheduledThreadPoolExecutor.java:98)
  [bndtest] 	at java.util.concurrent.ScheduledThreadPoolExecutor$ScheduledFutureTask.run(ScheduledThreadPoolExecutor.java:206)
  [bndtest] 	at java.util.concurrent.ThreadPoolExecutor$Worker.runTask(ThreadPoolExecutor.java:895)
  [bndtest] 	at java.util.concurrent.ThreadPoolExecutor$Worker.run(ThreadPoolExecutor.java:918)
  [bndtest] 	at java.lang.Thread.run(Thread.java:662)
  [bndtest] [INFO] 11:42:06 (controller) Cancelling download of deployment update for 2.0.0
because a newer version is available...
  [bndtest] [INFO] 11:42:06 (controller) Starting download of deployment update, 1.0.0 =>
6.0.0...
  [bndtest] [INFO] 11:42:06 (controller) Progress of deployment update download: 2772 of 2772
bytes...
  [bndtest] [INFO] 11:42:07 (controller) Installing deployment update 1.0.0 => 6.0.0...
  [bndtest] java.lang.NullPointerException
  [bndtest] ERROR: Bundle org.apache.ace.agent [2] EventDispatcher: Error during dispatch.
(java.lang.NullPointerException)
  [bndtest] 	at org.apache.ace.agent.impl.FeedbackStoreManager.isCurrentStoreMaximumFileSizeReached(Unknown
Source)
  [bndtest] 	at org.apache.ace.agent.impl.FeedbackStoreManager.write(Unknown Source)
  [bndtest] 	at org.apache.ace.agent.impl.FeedbackChannelImpl.write(Unknown Source)
  [bndtest] 	at org.apache.ace.agent.impl.EventLoggerImpl.writeAuditEvent(Unknown Source)
  [bndtest] 	at org.apache.ace.agent.impl.EventLoggerImpl.bundleChanged(Unknown Source)
  [bndtest] 	at org.apache.felix.framework.util.EventDispatcher.invokeBundleListenerCallback(EventDispatcher.java:868)
  [bndtest] 	at org.apache.felix.framework.util.EventDispatcher.fireEventImmediately(EventDispatcher.java:789)
  [bndtest] 	at org.apache.felix.framework.util.EventDispatcher.run(EventDispatcher.java:1088)
  [bndtest] 	at org.apache.felix.framework.util.EventDispatcher.access$000(EventDispatcher.java:54)
  [bndtest] 	at org.apache.felix.framework.util.EventDispatcher$1.run(EventDispatcher.java:101)
  [bndtest] 	at java.lang.Thread.run(Thread.java:662)
  [bndtest] [INFO] 11:42:17 (controller) Starting download of deployment update, 0.0.0 =>
5.0.0...
  [bndtest] [INFO] 11:42:17 (controller) Progress of deployment update download: 2814 of 2814
bytes...
  [bndtest] [INFO] 11:42:18 (controller) Installing deployment update 0.0.0 => 5.0.0...
  [bndtest] [WARNING] 11:42:19 (deployment) Could not start bundle 'test.bundle3'
  [bndtest] org.osgi.framework.BundleException: Unresolved constraint in bundle test.bundle3
[19]: Unable to resolve 19.0: missing requirement [19.0] osgi.wiring.package; (osgi.wiring.package=no.such)
  [bndtest] 	at org.apache.felix.framework.Felix.resolveBundleRevision(Felix.java:3826)
  [bndtest] 	at org.apache.felix.framework.Felix.startBundle(Felix.java:1868)
  [bndtest] 	at org.apache.felix.framework.BundleImpl.start(BundleImpl.java:944)
  [bndtest] 	at org.apache.felix.framework.BundleImpl.start(BundleImpl.java:931)
  [bndtest] 	at org.apache.felix.deploymentadmin.spi.StartBundleCommand.execute(StartBundleCommand.java:55)
  [bndtest] 	at org.apache.felix.deploymentadmin.spi.DeploymentSessionImpl.call(DeploymentSessionImpl.java:73)
  [bndtest] 	at org.apache.felix.deploymentadmin.DeploymentAdminImpl.installDeploymentPackage(DeploymentAdminImpl.java:214)
  [bndtest] 	at org.apache.ace.agent.impl.DeploymentHandlerImpl.install(Unknown Source)
  [bndtest] 	at org.apache.ace.agent.impl.DefaultController$DownloadUpdateInstaller.doInstallUpdate(Unknown
Source)
  [bndtest] 	at org.apache.ace.agent.impl.DefaultController$UpdateInstaller.installUpdate(Unknown
Source)
  [bndtest] 	at org.apache.ace.agent.impl.DefaultController.runDeploymentUpdate(Unknown Source)
  [bndtest] 	at org.apache.ace.agent.impl.DefaultController.run(Unknown Source)
  [bndtest] 	at java.util.concurrent.Executors$RunnableAdapter.call(Executors.java:439)
  [bndtest] 	at java.util.concurrent.FutureTask$Sync.innerRun(FutureTask.java:303)
  [bndtest] 	at java.util.concurrent.FutureTask.run(FutureTask.java:138)
  [bndtest] 	at java.util.concurrent.ScheduledThreadPoolExecutor$ScheduledFutureTask.access$301(ScheduledThreadPoolExecutor.java:98)
  [bndtest] 	at java.util.concurrent.ScheduledThreadPoolExecutor$ScheduledFutureTask.run(ScheduledThreadPoolExecutor.java:206)
  [bndtest] 	at java.util.concurrent.ThreadPoolExecutor$Worker.runTask(ThreadPoolExecutor.java:895)
  [bndtest] 	at java.util.concurrent.ThreadPoolExecutor$Worker.run(ThreadPoolExecutor.java:918)
  [bndtest] 	at java.lang.Thread.run(Thread.java:662)
  [bndtest] [INFO] 11:42:22 (controller) Starting download of deployment update, 5.0.0 =>
6.0.0...
  [bndtest] [INFO] 11:42:22 (controller) Progress of deployment update download: 2776 of 2776
bytes...
  [bndtest] [INFO] 11:42:23 (controller) Installing deployment update 5.0.0 => 6.0.0...
  [bndtest] [WARNING] 11:42:23 (deployment) Could not get reference to storage area of bundle
'test.bundle3'
  [bndtest] [WARNING] 11:42:23 (deployment) Could not retrieve storage area of bundle 'test.bundle3',
skipping it.
  [bndtest] [INFO] 11:42:31 (controller) Starting download of deployment update, 0.0.0 =>
6.0.0...
  [bndtest] [INFO] 11:42:31 (controller) Progress of deployment update download: 2780 of 2780
bytes...
  [bndtest] [INFO] 11:42:32 (controller) Installing deployment update 0.0.0 => 6.0.0...
  [bndtest] [INFO] 11:42:41 (controller) Starting download of deployment update, 0.0.0 =>
5.0.0...
  [bndtest] [INFO] 11:42:41 (controller) Progress of deployment update download: 1409 of 1409
bytes...
  [bndtest] [INFO] 11:42:42 (controller) Installing deployment update 0.0.0 => 5.0.0...
  [bndtest] [INFO] 11:42:45 (controller) Cancelling deployment package download for version
5.0.0 because of reset...
  [bndtest] [INFO] 11:42:50 (controller) Starting download of deployment update, 0.0.0 =>
4.0.0...
  [bndtest] [INFO] 11:42:50 (controller) Progress of deployment update download: 1943 of 1943
bytes...
  [bndtest] [INFO] 11:42:51 (controller) Installing deployment update 0.0.0 => 4.0.0...
  [bndtest] [ERROR] 11:42:51 (deployment) Stream does not contain a valid deployment package:
missing manifest!
  [bndtest] [INFO] 11:42:52 (controller) Cancelling deployment package download for version
4.0.0 because of reset...
  [bndtest] [INFO] 11:42:57 (controller) Starting download of deployment update, 0.0.0 =>
2.0.0...
  [bndtest] [WARNING] 11:42:58 (controller) Sync received retry exception from server. Rescheduled
in 1 seconds
  [bndtest] [INFO] 11:42:59 (controller) Starting download of deployment update, 0.0.0 =>
2.0.0...
  [bndtest] [INFO] 11:42:59 (controller) Progress of deployment update download: 1096 of 1096
bytes...
  [bndtest] [INFO] 11:43:00 (controller) Installing deployment update 0.0.0 => 2.0.0...
  [bndtest] java.lang.NullPointerException
  [bndtest] ERROR: Bundle org.apache.ace.agent [2] EventDispatcher: Error during dispatch.
(java.lang.NullPointerException)
  [bndtest] 	at org.apache.ace.agent.impl.FeedbackStoreManager.isCurrentStoreMaximumFileSizeReached(Unknown
Source)
  [bndtest] 	at org.apache.ace.agent.impl.FeedbackStoreManager.write(Unknown Source)
  [bndtest] 	at org.apache.ace.agent.impl.FeedbackChannelImpl.write(Unknown Source)
  [bndtest] 	at org.apache.ace.agent.impl.EventLoggerImpl.writeAuditEvent(Unknown Source)
  [bndtest] 	at org.apache.ace.agent.impl.EventLoggerImpl.bundleChanged(Unknown Source)
  [bndtest] 	at org.apache.felix.framework.util.EventDispatcher.invokeBundleListenerCallback(EventDispatcher.java:868)
  [bndtest] 	at org.apache.felix.framework.util.EventDispatcher.fireEventImmediately(EventDispatcher.java:789)
  [bndtest] 	at org.apache.felix.framework.util.EventDispatcher.run(EventDispatcher.java:1088)
  [bndtest] 	at org.apache.felix.framework.util.EventDispatcher.access$000(EventDispatcher.java:54)
  [bndtest] 	at org.apache.felix.framework.util.EventDispatcher$1.run(EventDispatcher.java:101)
  [bndtest] 	at java.lang.Thread.run(Thread.java:662)
  [bndtest] [INFO] 11:43:09 (controller) Starting download of deployment update, 0.0.0 =>
3.0.0...
  [bndtest] [INFO] 11:43:10 (controller) Installing deployment update 0.0.0 => 3.0.0...
  [bndtest] [ERROR] 11:43:10 (deployment) Stream does not contain a valid deployment package:
missing manifest!
  [bndtest] [INFO] 11:43:10 (controller) Cancelling deployment package download for version
3.0.0 because of reset...
  [bndtest] [WARNING] 11:43:16 (controller) Sync received retry exception from server. Rescheduled
in 1 seconds
  [bndtest] [INFO] 11:43:17 (controller) Starting download of deployment update, 0.0.0 =>
1.0.0...
  [bndtest] [INFO] 11:43:17 (controller) Progress of deployment update download: 1096 of 1096
bytes...
  [bndtest] [INFO] 11:43:18 (controller) Installing deployment update 0.0.0 => 1.0.0...
  [bndtest] ERROR: Bundle org.apache.ace.agent [2] EventDispatcher: Error during dispatch.
(java.lang.NullPointerException)
  [bndtest] java.lang.NullPointerException
  [bndtest] 	at org.apache.ace.agent.impl.FeedbackStoreManager.isCurrentStoreMaximumFileSizeReached(Unknown
Source)
  [bndtest] 	at org.apache.ace.agent.impl.FeedbackStoreManager.write(Unknown Source)
  [bndtest] 	at org.apache.ace.agent.impl.FeedbackChannelImpl.write(Unknown Source)
  [bndtest] 	at org.apache.ace.agent.impl.EventLoggerImpl.writeAuditEvent(Unknown Source)
  [bndtest] 	at org.apache.ace.agent.impl.EventLoggerImpl.bundleChanged(Unknown Source)
  [bndtest] 	at org.apache.felix.framework.util.EventDispatcher.invokeBundleListenerCallback(EventDispatcher.java:868)
  [bndtest] 	at org.apache.felix.framework.util.EventDispatcher.fireEventImmediately(EventDispatcher.java:789)
  [bndtest] 	at org.apache.felix.framework.util.EventDispatcher.run(EventDispatcher.java:1088)
  [bndtest] 	at org.apache.felix.framework.util.EventDispatcher.access$000(EventDispatcher.java:54)
  [bndtest] 	at org.apache.felix.framework.util.EventDispatcher$1.run(EventDispatcher.java:101)
  [bndtest] 	at java.lang.Thread.run(Thread.java:662)
  [bndtest] [INFO] 11:43:26 (controller) Starting download of deployment update, 0.0.0 =>
6.0.0...
  [bndtest] [INFO] 11:43:26 (controller) Progress of deployment update download: 1390 of 2780
bytes...
  [bndtest] [INFO] 11:43:26 (controller) Progress of deployment update download: 2780 of 2780
bytes...
  [bndtest] [INFO] 11:43:27 (controller) Installing deployment update 0.0.0 => 6.0.0...
  [bndtest] [INFO] 11:43:36 (controller) Installing streaming deployment update 0.0.0 =>
6.0.0
  [bndtest] [INFO] 11:43:45 (controller) Installing streaming deployment update 0.0.0 =>
5.0.0
  [bndtest] [INFO] 11:43:53 (controller) Installing streaming deployment update 0.0.0 =>
4.0.0
  [bndtest] [ERROR] 11:43:53 (deployment) Stream does not contain a valid deployment package:
missing manifest!
  [bndtest] [INFO] 11:43:59 (controller) Installing streaming deployment update 0.0.0 =>
2.0.0
  [bndtest] [WARNING] 11:43:59 (controller) Sync received retry exception from server. Rescheduled
in 1 seconds
  [bndtest] [INFO] 11:44:00 (controller) Installing streaming deployment update 0.0.0 =>
2.0.0
  [bndtest] ERROR: Bundle org.apache.ace.agent [2] EventDispatcher: Error during dispatch.
(java.lang.NullPointerException)
  [bndtest] java.lang.NullPointerException
  [bndtest] 	at org.apache.ace.agent.impl.FeedbackStoreManager.isCurrentStoreMaximumFileSizeReached(Unknown
Source)
  [bndtest] 	at org.apache.ace.agent.impl.FeedbackStoreManager.write(Unknown Source)
  [bndtest] 	at org.apache.ace.agent.impl.FeedbackChannelImpl.write(Unknown Source)
  [bndtest] 	at org.apache.ace.agent.impl.EventLoggerImpl.writeAuditEvent(Unknown Source)
  [bndtest] 	at org.apache.ace.agent.impl.EventLoggerImpl.bundleChanged(Unknown Source)
  [bndtest] 	at org.apache.felix.framework.util.EventDispatcher.invokeBundleListenerCallback(EventDispatcher.java:868)
  [bndtest] 	at org.apache.felix.framework.util.EventDispatcher.fireEventImmediately(EventDispatcher.java:789)
  [bndtest] 	at org.apache.felix.framework.util.EventDispatcher.run(EventDispatcher.java:1088)
  [bndtest] 	at org.apache.felix.framework.util.EventDispatcher.access$000(EventDispatcher.java:54)
  [bndtest] 	at org.apache.felix.framework.util.EventDispatcher$1.run(EventDispatcher.java:101)
  [bndtest] 	at java.lang.Thread.run(Thread.java:662)
  [bndtest] [INFO] 11:44:08 (controller) Installing streaming deployment update 0.0.0 =>
3.0.0
  [bndtest] [ERROR] 11:44:08 (deployment) Stream does not contain a valid deployment package:
missing manifest!
  [bndtest] [WARNING] 11:44:15 (controller) Sync received retry exception from server. Rescheduled
in 1 seconds
  [bndtest] [INFO] 11:44:16 (controller) Installing streaming deployment update 0.0.0 =>
1.0.0
  [bndtest] java.lang.NullPointerException
  [bndtest] 	at org.apache.ace.agent.impl.FeedbackStoreManager.isCurrentStoreMaximumFileSizeReached(Unknown
Source)
  [bndtest] 	at org.apache.ace.agent.impl.FeedbackStoreManager.write(Unknown Source)
  [bndtest] ERROR: Bundle org.apache.ace.agent [2] EventDispatcher: Error during dispatch.
(java.lang.NullPointerException)
  [bndtest] 	at org.apache.ace.agent.impl.FeedbackChannelImpl.write(Unknown Source)
  [bndtest] 	at org.apache.ace.agent.impl.EventLoggerImpl.writeAuditEvent(Unknown Source)
  [bndtest] 	at org.apache.ace.agent.impl.EventLoggerImpl.bundleChanged(Unknown Source)
  [bndtest] 	at org.apache.felix.framework.util.EventDispatcher.invokeBundleListenerCallback(EventDispatcher.java:868)
  [bndtest] 	at org.apache.felix.framework.util.EventDispatcher.fireEventImmediately(EventDispatcher.java:789)
  [bndtest] 	at org.apache.felix.framework.util.EventDispatcher.run(EventDispatcher.java:1088)
  [bndtest] 	at org.apache.felix.framework.util.EventDispatcher.access$000(EventDispatcher.java:54)
  [bndtest] 	at org.apache.felix.framework.util.EventDispatcher$1.run(EventDispatcher.java:101)
  [bndtest] 	at java.lang.Thread.run(Thread.java:662)
  [bndtest] [INFO] 11:44:24 (controller) Installing streaming deployment update 0.0.0 =>
1.0.0
  [bndtest] ERROR: Bundle org.apache.ace.agent [2] EventDispatcher: Error during dispatch.
(java.lang.NullPointerException)
  [bndtest] java.lang.NullPointerException
  [bndtest] 	at org.apache.ace.agent.impl.FeedbackStoreManager.isCurrentStoreMaximumFileSizeReached(Unknown
Source)
  [bndtest] 	at org.apache.ace.agent.impl.FeedbackStoreManager.write(Unknown Source)
  [bndtest] 	at org.apache.ace.agent.impl.FeedbackChannelImpl.write(Unknown Source)
  [bndtest] 	at org.apache.ace.agent.impl.EventLoggerImpl.writeAuditEvent(Unknown Source)
  [bndtest] 	at org.apache.ace.agent.impl.EventLoggerImpl.bundleChanged(Unknown Source)
  [bndtest] 	at org.apache.felix.framework.util.EventDispatcher.invokeBundleListenerCallback(EventDispatcher.java:868)
  [bndtest] 	at org.apache.felix.framework.util.EventDispatcher.fireEventImmediately(EventDispatcher.java:789)
  [bndtest] 	at org.apache.felix.framework.util.EventDispatcher.run(EventDispatcher.java:1088)
  [bndtest] 	at org.apache.felix.framework.util.EventDispatcher.access$000(EventDispatcher.java:54)
  [bndtest] 	at org.apache.felix.framework.util.EventDispatcher$1.run(EventDispatcher.java:101)
  [bndtest] 	at java.lang.Thread.run(Thread.java:662)
  [bndtest] [INFO] 11:44:32 (controller) Installing streaming deployment update 0.0.0 =>
1.0.0
  [bndtest] [INFO] 11:44:35 (controller) Installing streaming deployment update 1.0.0 =>
6.0.0
  [bndtest] [ERROR] 11:44:35 (deployment) Stream does not contain a valid deployment package:
missing manifest!
  [bndtest] ERROR: Bundle org.apache.ace.agent [2] EventDispatcher: Error during dispatch.
(java.lang.NullPointerException)
  [bndtest] java.lang.NullPointerException
  [bndtest] 	at org.apache.ace.agent.impl.FeedbackStoreManager.isCurrentStoreMaximumFileSizeReached(Unknown
Source)
  [bndtest] 	at org.apache.ace.agent.impl.FeedbackStoreManager.write(Unknown Source)
  [bndtest] 	at org.apache.ace.agent.impl.FeedbackChannelImpl.write(Unknown Source)
  [bndtest] 	at org.apache.ace.agent.impl.EventLoggerImpl.writeAuditEvent(Unknown Source)
  [bndtest] 	at org.apache.ace.agent.impl.EventLoggerImpl.bundleChanged(Unknown Source)
  [bndtest] 	at org.apache.felix.framework.util.EventDispatcher.invokeBundleListenerCallback(EventDispatcher.java:868)
  [bndtest] 	at org.apache.felix.framework.util.EventDispatcher.fireEventImmediately(EventDispatcher.java:789)
  [bndtest] 	at org.apache.felix.framework.util.EventDispatcher.run(EventDispatcher.java:1088)
  [bndtest] 	at org.apache.felix.framework.util.EventDispatcher.access$000(EventDispatcher.java:54)
  [bndtest] 	at org.apache.felix.framework.util.EventDispatcher$1.run(EventDispatcher.java:101)
  [bndtest] 	at java.lang.Thread.run(Thread.java:662)
  [bndtest] Errors: 0
  [bndtest] Failures: 1
  [bndtest] 1 Error(s)
  [bndtest] Tests failed
  [bndtest] 	at aQute.bnd.ant.TestTask.executeProject(TestTask.java:78)
  [bndtest] 	at aQute.bnd.ant.TestTask.execute(TestTask.java:49)
  [bndtest] 	at org.apache.tools.ant.UnknownElement.execute(UnknownElement.java:291)
  [bndtest] 	at sun.reflect.GeneratedMethodAccessor4.invoke(Unknown Source)
  [bndtest] 	at sun.reflect.DelegatingMethodAccessorImpl.invoke(DelegatingMethodAccessorImpl.java:25)
  [bndtest] 	at java.lang.reflect.Method.invoke(Method.java:597)
  [bndtest] 	at org.apache.tools.ant.dispatch.DispatchUtils.execute(DispatchUtils.java:106)
  [bndtest] 	at org.apache.tools.ant.Task.perform(Task.java:348)
  [bndtest] 	at org.apache.tools.ant.Target.execute(Target.java:390)
  [bndtest] 	at org.apache.tools.ant.Target.performTasks(Target.java:411)
  [bndtest] 	at org.apache.tools.ant.Project.executeSortedTargets(Project.java:1399)
  [bndtest] 	at org.apache.tools.ant.helper.SingleCheckExecutor.executeTargets(SingleCheckExecutor.java:38)
  [bndtest] 	at org.apache.tools.ant.Project.executeTargets(Project.java:1251)
  [bndtest] 	at org.apache.tools.ant.taskdefs.Ant.execute(Ant.java:442)
  [bndtest] 	at org.apache.tools.ant.taskdefs.SubAnt.execute(SubAnt.java:302)
  [bndtest] 	at org.apache.tools.ant.taskdefs.SubAnt.execute(SubAnt.java:221)
  [bndtest] 	at org.apache.tools.ant.UnknownElement.execute(UnknownElement.java:291)
  [bndtest] 	at sun.reflect.GeneratedMethodAccessor4.invoke(Unknown Source)
  [bndtest] 	at sun.reflect.DelegatingMethodAccessorImpl.invoke(DelegatingMethodAccessorImpl.java:25)
  [bndtest] 	at java.lang.reflect.Method.invoke(Method.java:597)
  [bndtest] 	at org.apache.tools.ant.dispatch.DispatchUtils.execute(DispatchUtils.java:106)
  [bndtest] 	at org.apache.tools.ant.Task.perform(Task.java:348)
  [bndtest] 	at org.apache.tools.ant.Target.execute(Target.java:390)
  [bndtest] 	at org.apache.tools.ant.Target.performTasks(Target.java:411)
  [bndtest] 	at org.apache.tools.ant.Project.executeSortedTargets(Project.java:1399)
  [bndtest] 	at org.apache.tools.ant.Project.executeTarget(Project.java:1368)
  [bndtest] 	at org.apache.tools.ant.helper.DefaultExecutor.executeTargets(DefaultExecutor.java:41)
  [bndtest] 	at org.apache.tools.ant.Project.executeTargets(Project.java:1251)
  [bndtest] 	at org.apache.tools.ant.Main.runBuild(Main.java:809)
  [bndtest] 	at org.apache.tools.ant.Main.startAnt(Main.java:217)
  [bndtest] 	at org.apache.tools.ant.launch.Launcher.run(Launcher.java:280)
  [bndtest] 	at org.apache.tools.ant.launch.Launcher.main(Launcher.java:109)

BUILD FAILED
<https://builds.apache.org/job/ACE-trunk/ws/cnf/build.xml>:55: The following error occurred
while executing this line:
<https://builds.apache.org/job/ACE-trunk/ws/cnf/build-template.xml>:67: Tests failed

Total time: 11 minutes 25 seconds
Build step 'Invoke Ant' marked build as failure
Recording test results
TestNG Reports Processing: START
Looking for TestNG results report in workspace using pattern: **/testng/testng-results.xml
Saving reports...
Processing '/home/hudson/hudson/jobs/ACE-trunk/builds/2013-09-20_11-32-55/testng/testng-results-1.xml'
Processing '/home/hudson/hudson/jobs/ACE-trunk/builds/2013-09-20_11-32-55/testng/testng-results-10.xml'
Processing '/home/hudson/hudson/jobs/ACE-trunk/builds/2013-09-20_11-32-55/testng/testng-results-11.xml'
Processing '/home/hudson/hudson/jobs/ACE-trunk/builds/2013-09-20_11-32-55/testng/testng-results-12.xml'
Processing '/home/hudson/hudson/jobs/ACE-trunk/builds/2013-09-20_11-32-55/testng/testng-results-13.xml'
Processing '/home/hudson/hudson/jobs/ACE-trunk/builds/2013-09-20_11-32-55/testng/testng-results-14.xml'
Processing '/home/hudson/hudson/jobs/ACE-trunk/builds/2013-09-20_11-32-55/testng/testng-results-15.xml'
Processing '/home/hudson/hudson/jobs/ACE-trunk/builds/2013-09-20_11-32-55/testng/testng-results-16.xml'
Processing '/home/hudson/hudson/jobs/ACE-trunk/builds/2013-09-20_11-32-55/testng/testng-results-17.xml'
Processing '/home/hudson/hudson/jobs/ACE-trunk/builds/2013-09-20_11-32-55/testng/testng-results-2.xml'
Processing '/home/hudson/hudson/jobs/ACE-trunk/builds/2013-09-20_11-32-55/testng/testng-results-3.xml'
Processing '/home/hudson/hudson/jobs/ACE-trunk/builds/2013-09-20_11-32-55/testng/testng-results-4.xml'
Processing '/home/hudson/hudson/jobs/ACE-trunk/builds/2013-09-20_11-32-55/testng/testng-results-5.xml'
Processing '/home/hudson/hudson/jobs/ACE-trunk/builds/2013-09-20_11-32-55/testng/testng-results-6.xml'
Processing '/home/hudson/hudson/jobs/ACE-trunk/builds/2013-09-20_11-32-55/testng/testng-results-7.xml'
Processing '/home/hudson/hudson/jobs/ACE-trunk/builds/2013-09-20_11-32-55/testng/testng-results-8.xml'
Processing '/home/hudson/hudson/jobs/ACE-trunk/builds/2013-09-20_11-32-55/testng/testng-results-9.xml'
Processing '/home/hudson/hudson/jobs/ACE-trunk/builds/2013-09-20_11-32-55/testng/testng-results.xml'
TestNG Reports Processing: FINISH

Mime
View raw message