ace-dev mailing list archives

Site index · List index
Message view « Date » · « Thread »
Top « Date » · « Thread »
From Apache Jenkins Server <jenk...@builds.apache.org>
Subject Build failed in Jenkins: ACE-trunk #98
Date Thu, 19 Sep 2013 08:51:22 GMT
See <https://builds.apache.org/job/ACE-trunk/98/changes>

Changes:

[bramk] ACE-323 - Added sleep in itest to wait for events before assert

------------------------------------------
[...truncated 2644 lines...]
  [bndtest] 	at java.util.concurrent.Executors$RunnableAdapter.call(Executors.java:439)
  [bndtest] 	at java.util.concurrent.FutureTask$Sync.innerRun(FutureTask.java:303)
  [bndtest] 	at java.util.concurrent.FutureTask.run(FutureTask.java:138)
  [bndtest] 	at java.util.concurrent.ScheduledThreadPoolExecutor$ScheduledFutureTask.access$301(ScheduledThreadPoolExecutor.java:98)
  [bndtest] 	at java.util.concurrent.ScheduledThreadPoolExecutor$ScheduledFutureTask.run(ScheduledThreadPoolExecutor.java:206)
  [bndtest] 	at java.util.concurrent.ThreadPoolExecutor$Worker.runTask(ThreadPoolExecutor.java:895)
  [bndtest] 	at java.util.concurrent.ThreadPoolExecutor$Worker.run(ThreadPoolExecutor.java:918)
  [bndtest] 	at java.lang.Thread.run(Thread.java:662)
  [bndtest] [INFO] 08:49:29 (controller) Starting download of deployment update, 5.0.0 =>
6.0.0...
  [bndtest] [INFO] 08:49:29 (controller) Progress of deployment update download: 2778 of 2778
bytes...
  [bndtest] [INFO] 08:49:30 (controller) Installing deployment update 5.0.0 => 6.0.0...
  [bndtest] [WARNING] 08:49:30 (deployment) Could not get reference to storage area of bundle
'test.bundle3'
  [bndtest] [WARNING] 08:49:30 (deployment) Could not retrieve storage area of bundle 'test.bundle3',
skipping it.
  [bndtest] [INFO] 08:49:35 (controller) Starting download of deployment update, 0.0.0 =>
6.0.0...
  [bndtest] [INFO] 08:49:35 (controller) Progress of deployment update download: 2779 of 2779
bytes...
  [bndtest] [INFO] 08:49:36 (controller) Installing deployment update 0.0.0 => 6.0.0...
  [bndtest] [INFO] 08:49:43 (controller) Starting download of deployment update, 0.0.0 =>
5.0.0...
  [bndtest] [INFO] 08:49:43 (controller) Progress of deployment update download: 1407 of 1407
bytes...
  [bndtest] [INFO] 08:49:44 (controller) Installing deployment update 0.0.0 => 5.0.0...
  [bndtest] [INFO] 08:49:44 (controller) Cancelling deployment package download for version
5.0.0 because of reset...
  [bndtest] [INFO] 08:49:49 (controller) Starting download of deployment update, 0.0.0 =>
4.0.0...
  [bndtest] [INFO] 08:49:49 (controller) Progress of deployment update download: 1942 of 1942
bytes...
  [bndtest] [INFO] 08:49:50 (controller) Installing deployment update 0.0.0 => 4.0.0...
  [bndtest] [ERROR] 08:49:50 (deployment) Stream does not contain a valid deployment package:
missing manifest!
  [bndtest] [INFO] 08:49:50 (controller) Cancelling deployment package download for version
4.0.0 because of reset...
  [bndtest] [INFO] 08:49:55 (controller) Starting download of deployment update, 0.0.0 =>
2.0.0...
  [bndtest] [WARNING] 08:49:56 (controller) Sync received retry exception from server. Rescheduled
in 1 seconds
  [bndtest] [INFO] 08:49:57 (controller) Starting download of deployment update, 0.0.0 =>
2.0.0...
  [bndtest] [INFO] 08:49:57 (controller) Progress of deployment update download: 1101 of 1101
bytes...
  [bndtest] [INFO] 08:49:58 (controller) Installing deployment update 0.0.0 => 2.0.0...
  [bndtest] [INFO] 08:50:03 (controller) Starting download of deployment update, 0.0.0 =>
3.0.0...
  [bndtest] [INFO] 08:50:04 (controller) Installing deployment update 0.0.0 => 3.0.0...
  [bndtest] [ERROR] 08:50:04 (deployment) Stream does not contain a valid deployment package:
missing manifest!
  [bndtest] [INFO] 08:50:04 (controller) Cancelling deployment package download for version
3.0.0 because of reset...
  [bndtest] [WARNING] 08:50:09 (controller) Sync received retry exception from server. Rescheduled
in 1 seconds
  [bndtest] [INFO] 08:50:10 (controller) Starting download of deployment update, 0.0.0 =>
1.0.0...
  [bndtest] [INFO] 08:50:10 (controller) Progress of deployment update download: 1098 of 1098
bytes...
  [bndtest] [INFO] 08:50:11 (controller) Installing deployment update 0.0.0 => 1.0.0...
  [bndtest] [INFO] 08:50:16 (controller) Starting download of deployment update, 0.0.0 =>
6.0.0...
  [bndtest] [INFO] 08:50:16 (controller) Progress of deployment update download: 1387 of 2774
bytes...
  [bndtest] [INFO] 08:50:16 (controller) Progress of deployment update download: 2774 of 2774
bytes...
  [bndtest] [INFO] 08:50:17 (controller) Installing deployment update 0.0.0 => 6.0.0...
  [bndtest] [INFO] 08:50:23 (controller) Installing streaming deployment update 0.0.0 =>
6.0.0
  [bndtest] [INFO] 08:50:28 (controller) Installing streaming deployment update 0.0.0 =>
5.0.0
  [bndtest] [INFO] 08:50:33 (controller) Installing streaming deployment update 0.0.0 =>
4.0.0
  [bndtest] [ERROR] 08:50:33 (deployment) Stream does not contain a valid deployment package:
missing manifest!
  [bndtest] [INFO] 08:50:38 (controller) Installing streaming deployment update 0.0.0 =>
2.0.0
  [bndtest] [WARNING] 08:50:38 (controller) Sync received retry exception from server. Rescheduled
in 1 seconds
  [bndtest] [INFO] 08:50:39 (controller) Installing streaming deployment update 0.0.0 =>
2.0.0
  [bndtest] [INFO] 08:50:44 (controller) Installing streaming deployment update 0.0.0 =>
3.0.0
  [bndtest] [ERROR] 08:50:44 (deployment) Stream does not contain a valid deployment package:
missing manifest!
  [bndtest] [WARNING] 08:50:49 (controller) Sync received retry exception from server. Rescheduled
in 1 seconds
  [bndtest] [INFO] 08:50:50 (controller) Installing streaming deployment update 0.0.0 =>
1.0.0
  [bndtest] [INFO] 08:50:56 (controller) Installing streaming deployment update 0.0.0 =>
1.0.0
  [bndtest] [INFO] 08:51:01 (controller) Installing streaming deployment update 0.0.0 =>
1.0.0
  [bndtest] [INFO] 08:51:02 (controller) Installing streaming deployment update 1.0.0 =>
6.0.0
  [bndtest] [ERROR] 08:51:02 (deployment) Stream does not contain a valid deployment package:
missing manifest!
  [bndtest] Errors: 0
  [bndtest] Failures: 0
  [bndtest] All tests passed

template.init:
     [echo] Enter project org.apache.ace.agent.launcher

init:

dependencies:

compile:

test:

template.init:
     [echo] Enter project org.apache.ace.repository

init:

dependencies:

compile:

test:

template.init:
     [echo] Enter project org.apache.ace.deployment

init:

dependencies:

compile:

test:

template.init:
     [echo] Enter project org.apache.ace.resourceprocessor.useradmin

init:

dependencies:

compile:

test:

template.init:
     [echo] Enter project org.apache.ace.configurator

init:

dependencies:

compile:

test:

template.init:
     [echo] Enter project org.apache.ace.http

init:

dependencies:

compile:

test:

template.init:
     [echo] Enter project org.apache.ace.agent.update.itest

init:

dependencies:

compile:

test:
  [bndtest] Testing /x1/jenkins/jenkins-slave/workspace/ACE-trunk/org.apache.ace.agent.update.itest/bnd.bnd
  [bndtest] 2013-09-19 08:51:05.250:INFO:oejs.Server:jetty-7.x.y-SNAPSHOT
  [bndtest] 2013-09-19 08:51:05.276:INFO:oejsh.ContextHandler:started o.e.j.s.ServletContextHandler{/,null}
  [bndtest] [INFO] Started jetty 7.x.y-SNAPSHOT at port(s) HTTP:8080 on context path /
  [bndtest] 2013-09-19 08:51:05.302:INFO:oejs.AbstractConnector:Started SelectChannelConnector@0.0.0.0:8080
  [bndtest] ! Failed to start bundle org.apache.ace.configurator.impl-1.0.0, exception activator
error Bad arguments; either not an existing directory or an invalid interval. from: org.apache.ace.configurator.Configurator:<init>#83
  [bndtest] 2013-09-19 08:51:05.414:INFO:oejsh.ContextHandler:stopped o.e.j.s.ServletContextHandler{/,null}
  [bndtest] ____________________________
  [bndtest] Welcome to Apache Felix Gogo
  [bndtest] 
  [bndtest] 2013-09-19 08:51:05.467:INFO:oejs.Server:jetty-7.x.y-SNAPSHOT
  [bndtest] 2013-09-19 08:51:05.468:INFO:oejsh.ContextHandler:started o.e.j.s.ServletContextHandler{/,null}
  [bndtest] g! [INFO] Started jetty 7.x.y-SNAPSHOT at port(s) HTTP:8080 on context path /
  [bndtest] 2013-09-19 08:51:05.473:INFO:oejs.AbstractConnector:Started SelectChannelConnector@0.0.0.0:8080
  [bndtest] Updating in phase: CORRUPT_STREAM
  [bndtest] [WARNING] 08:51:10 (controller) Exception while sending feedback for channel:
auditlog
  [bndtest] java.io.FileNotFoundException: http://localhost:8080/auditlog/query?tid=defaultTargetID&logid=1379580665123
  [bndtest] 	at sun.net.www.protocol.http.HttpURLConnection.getInputStream(HttpURLConnection.java:1457)
  [bndtest] 	at org.apache.ace.agent.impl.FeedbackChannelImpl.sendFeedback(Unknown Source)
  [bndtest] 	at org.apache.ace.agent.impl.DefaultController.runFeedback(Unknown Source)
  [bndtest] 	at org.apache.ace.agent.impl.DefaultController.run(Unknown Source)
  [bndtest] 	at java.util.concurrent.Executors$RunnableAdapter.call(Executors.java:439)
  [bndtest] 	at java.util.concurrent.FutureTask$Sync.innerRun(FutureTask.java:303)
  [bndtest] 	at java.util.concurrent.FutureTask.run(FutureTask.java:138)
  [bndtest] 	at java.util.concurrent.ScheduledThreadPoolExecutor$ScheduledFutureTask.access$301(ScheduledThreadPoolExecutor.java:98)
  [bndtest] 	at java.util.concurrent.ScheduledThreadPoolExecutor$ScheduledFutureTask.run(ScheduledThreadPoolExecutor.java:206)
  [bndtest] 	at java.util.concurrent.ThreadPoolExecutor$Worker.runTask(ThreadPoolExecutor.java:895)
  [bndtest] 	at java.util.concurrent.ThreadPoolExecutor$Worker.run(ThreadPoolExecutor.java:918)
  [bndtest] 	at java.lang.Thread.run(Thread.java:662)
  [bndtest] [ERROR] 08:51:10 (controller) Sync aborted due to Exception.
  [bndtest] java.io.IOException: Unable to handle server responsecode: 404, for http://localhost:8080/agent/defaultTargetID/org.apache.ace.agent/versions/
  [bndtest] 	at org.apache.ace.agent.impl.ConnectionUtil.checkConnectionResponse(Unknown Source)
  [bndtest] 	at org.apache.ace.agent.impl.UpdateHandlerBase.getAvailableVersions(Unknown Source)
  [bndtest] 	at org.apache.ace.agent.impl.AgentUpdateHandlerImpl.getAvailableVersions(Unknown
Source)
  [bndtest] 	at org.apache.ace.agent.impl.UpdateHandlerBase.getHighestAvailableVersion(Unknown
Source)
  [bndtest] 	at org.apache.ace.agent.impl.DefaultController$UpdateInstaller.installUpdate(Unknown
Source)
  [bndtest] 	at org.apache.ace.agent.impl.DefaultController.runAgentUpdate(Unknown Source)
  [bndtest] 	at org.apache.ace.agent.impl.DefaultController.run(Unknown Source)
  [bndtest] 	at java.util.concurrent.Executors$RunnableAdapter.call(Executors.java:439)
  [bndtest] 	at java.util.concurrent.FutureTask$Sync.innerRun(FutureTask.java:303)
  [bndtest] 	at java.util.concurrent.FutureTask.run(FutureTask.java:138)
  [bndtest] 	at java.util.concurrent.ScheduledThreadPoolExecutor$ScheduledFutureTask.access$301(ScheduledThreadPoolExecutor.java:98)
  [bndtest] 	at java.util.concurrent.ScheduledThreadPoolExecutor$ScheduledFutureTask.run(ScheduledThreadPoolExecutor.java:206)
  [bndtest] 	at java.util.concurrent.ThreadPoolExecutor$Worker.runTask(ThreadPoolExecutor.java:895)
  [bndtest] 	at java.util.concurrent.ThreadPoolExecutor$Worker.run(ThreadPoolExecutor.java:918)
  [bndtest] 	at java.lang.Thread.run(Thread.java:662)
  [bndtest] Errors: 0
  [bndtest] Failures: 1
  [bndtest] 1 Error(s)
  [bndtest] Tests failed
  [bndtest] 	at aQute.bnd.ant.TestTask.executeProject(TestTask.java:78)
  [bndtest] 	at aQute.bnd.ant.TestTask.execute(TestTask.java:49)
  [bndtest] 	at org.apache.tools.ant.UnknownElement.execute(UnknownElement.java:291)
  [bndtest] 	at sun.reflect.GeneratedMethodAccessor4.invoke(Unknown Source)
  [bndtest] 	at sun.reflect.DelegatingMethodAccessorImpl.invoke(DelegatingMethodAccessorImpl.java:25)
  [bndtest] 	at java.lang.reflect.Method.invoke(Method.java:597)
  [bndtest] 	at org.apache.tools.ant.dispatch.DispatchUtils.execute(DispatchUtils.java:106)
  [bndtest] 	at org.apache.tools.ant.Task.perform(Task.java:348)
  [bndtest] 	at org.apache.tools.ant.Target.execute(Target.java:390)
  [bndtest] 	at org.apache.tools.ant.Target.performTasks(Target.java:411)
  [bndtest] 	at org.apache.tools.ant.Project.executeSortedTargets(Project.java:1399)
  [bndtest] 	at org.apache.tools.ant.helper.SingleCheckExecutor.executeTargets(SingleCheckExecutor.java:38)
  [bndtest] 	at org.apache.tools.ant.Project.executeTargets(Project.java:1251)
  [bndtest] 	at org.apache.tools.ant.taskdefs.Ant.execute(Ant.java:442)
  [bndtest] 	at org.apache.tools.ant.taskdefs.SubAnt.execute(SubAnt.java:302)
  [bndtest] 	at org.apache.tools.ant.taskdefs.SubAnt.execute(SubAnt.java:221)
  [bndtest] 	at org.apache.tools.ant.UnknownElement.execute(UnknownElement.java:291)
  [bndtest] 	at sun.reflect.GeneratedMethodAccessor4.invoke(Unknown Source)
  [bndtest] 	at sun.reflect.DelegatingMethodAccessorImpl.invoke(DelegatingMethodAccessorImpl.java:25)
  [bndtest] 	at java.lang.reflect.Method.invoke(Method.java:597)
  [bndtest] 	at org.apache.tools.ant.dispatch.DispatchUtils.execute(DispatchUtils.java:106)
  [bndtest] 	at org.apache.tools.ant.Task.perform(Task.java:348)
  [bndtest] 	at org.apache.tools.ant.Target.execute(Target.java:390)
  [bndtest] 	at org.apache.tools.ant.Target.performTasks(Target.java:411)
  [bndtest] 	at org.apache.tools.ant.Project.executeSortedTargets(Project.java:1399)
  [bndtest] 	at org.apache.tools.ant.Project.executeTarget(Project.java:1368)
  [bndtest] 	at org.apache.tools.ant.helper.DefaultExecutor.executeTargets(DefaultExecutor.java:41)
  [bndtest] 	at org.apache.tools.ant.Project.executeTargets(Project.java:1251)
  [bndtest] 	at org.apache.tools.ant.Main.runBuild(Main.java:809)
  [bndtest] 	at org.apache.tools.ant.Main.startAnt(Main.java:217)
  [bndtest] 	at org.apache.tools.ant.launch.Launcher.run(Launcher.java:280)
  [bndtest] 	at org.apache.tools.ant.launch.Launcher.main(Launcher.java:109)

BUILD FAILED
/x1/jenkins/jenkins-slave/workspace/ACE-trunk/cnf/build.xml:55: The following error occurred
while executing this line:
/x1/jenkins/jenkins-slave/workspace/ACE-trunk/cnf/build-template.xml:67: Tests failed

Total time: 4 minutes 53 seconds
Build step 'Invoke Ant' marked build as failure
Recording test results
TestNG Reports Processing: START
Looking for TestNG results report in workspace using pattern: **/testng/testng-results.xml
Saving reports...
Processing '/home/hudson/hudson/jobs/ACE-trunk/builds/2013-09-19_08-46-16/testng/testng-results-1.xml'
Processing '/home/hudson/hudson/jobs/ACE-trunk/builds/2013-09-19_08-46-16/testng/testng-results-10.xml'
Processing '/home/hudson/hudson/jobs/ACE-trunk/builds/2013-09-19_08-46-16/testng/testng-results-11.xml'
Processing '/home/hudson/hudson/jobs/ACE-trunk/builds/2013-09-19_08-46-16/testng/testng-results-12.xml'
Processing '/home/hudson/hudson/jobs/ACE-trunk/builds/2013-09-19_08-46-16/testng/testng-results-13.xml'
Processing '/home/hudson/hudson/jobs/ACE-trunk/builds/2013-09-19_08-46-16/testng/testng-results-14.xml'
Processing '/home/hudson/hudson/jobs/ACE-trunk/builds/2013-09-19_08-46-16/testng/testng-results-15.xml'
Processing '/home/hudson/hudson/jobs/ACE-trunk/builds/2013-09-19_08-46-16/testng/testng-results-16.xml'
Processing '/home/hudson/hudson/jobs/ACE-trunk/builds/2013-09-19_08-46-16/testng/testng-results-17.xml'
Processing '/home/hudson/hudson/jobs/ACE-trunk/builds/2013-09-19_08-46-16/testng/testng-results-2.xml'
Processing '/home/hudson/hudson/jobs/ACE-trunk/builds/2013-09-19_08-46-16/testng/testng-results-3.xml'
Processing '/home/hudson/hudson/jobs/ACE-trunk/builds/2013-09-19_08-46-16/testng/testng-results-4.xml'
Processing '/home/hudson/hudson/jobs/ACE-trunk/builds/2013-09-19_08-46-16/testng/testng-results-5.xml'
Processing '/home/hudson/hudson/jobs/ACE-trunk/builds/2013-09-19_08-46-16/testng/testng-results-6.xml'
Processing '/home/hudson/hudson/jobs/ACE-trunk/builds/2013-09-19_08-46-16/testng/testng-results-7.xml'
Processing '/home/hudson/hudson/jobs/ACE-trunk/builds/2013-09-19_08-46-16/testng/testng-results-8.xml'
Processing '/home/hudson/hudson/jobs/ACE-trunk/builds/2013-09-19_08-46-16/testng/testng-results-9.xml'
Processing '/home/hudson/hudson/jobs/ACE-trunk/builds/2013-09-19_08-46-16/testng/testng-results.xml'
TestNG Reports Processing: FINISH

Mime
View raw message