ace-dev mailing list archives

Site index · List index
Message view « Date » · « Thread »
Top « Date » · « Thread »
From Apache Jenkins Server <jenk...@builds.apache.org>
Subject Build failed in Jenkins: ACE-trunk #64
Date Mon, 19 Aug 2013 15:36:16 GMT
See <https://builds.apache.org/job/ACE-trunk/64/changes>

Changes:

[marrs] ACE-342 Added an integration test for agent updates.

[marrs] ACE-342 Cleaned up the code, some bugfixes, and now caches agents in the bundle cache
before attempting an update.

------------------------------------------
[...truncated 2344 lines...]
  [bndtest] 	at java.util.TimerThread.mainLoop(Timer.java:512)
  [bndtest] 	at java.util.TimerThread.run(Timer.java:462)
  [bndtest]  * Mon Aug 19 15:36:14 UTC 2013 - Authentication failure! - 40 - null
  [bndtest]  * Mon Aug 19 15:36:14 UTC 2013 - ServiceEvent REGISTERED - 44 - null
  [bndtest]  * Mon Aug 19 15:36:14 UTC 2013 - Authentication failure! - 40 - null
  [bndtest]  * Mon Aug 19 15:36:14 UTC 2013 - Authentication failure! - 40 - null
  [bndtest]  * Mon Aug 19 15:36:14 UTC 2013 - Authentication failure! - 40 - null
  [bndtest]  * Mon Aug 19 15:36:13 UTC 2013 - Error running update UserAdmin task. - 23 -
java.io.IOException: No version has yet been checked in to the repository.
  [bndtest] java.io.IOException: No version has yet been checked in to the repository.
  [bndtest] 	at org.apache.ace.repository.ext.impl.CachedRepositoryImpl.checkout(CachedRepositoryImpl.java:64)
  [bndtest] 	at org.apache.ace.configurator.useradmin.task.UpdateUserAdminTask.run(UpdateUserAdminTask.java:99)
  [bndtest] 	at org.apache.ace.scheduler.Executer.run(Executer.java:92)
  [bndtest] 	at java.util.TimerThread.mainLoop(Timer.java:512)
  [bndtest] 	at java.util.TimerThread.run(Timer.java:462)
  [bndtest]  * Mon Aug 19 15:36:13 UTC 2013 - Authentication failure! - 40 - null
  [bndtest]  * Mon Aug 19 15:36:13 UTC 2013 - Authentication failure! - 40 - null
  [bndtest]  * Mon Aug 19 15:36:13 UTC 2013 - ServiceEvent REGISTERED - 44 - null
  [bndtest]  * Mon Aug 19 15:36:13 UTC 2013 - Authentication failure! - 40 - null
  [bndtest]  * Mon Aug 19 15:36:13 UTC 2013 - Authentication failure! - 40 - null
  [bndtest]  * Mon Aug 19 15:36:12 UTC 2013 - Error running update UserAdmin task. - 23 -
java.io.IOException: No version has yet been checked in to the repository.
  [bndtest] java.io.IOException: No version has yet been checked in to the repository.
  [bndtest] 	at org.apache.ace.repository.ext.impl.CachedRepositoryImpl.checkout(CachedRepositoryImpl.java:64)
  [bndtest] 	at org.apache.ace.configurator.useradmin.task.UpdateUserAdminTask.run(UpdateUserAdminTask.java:99)
  [bndtest] 	at org.apache.ace.scheduler.Executer.run(Executer.java:92)
  [bndtest] 	at java.util.TimerThread.mainLoop(Timer.java:512)
  [bndtest] 	at java.util.TimerThread.run(Timer.java:462)
  [bndtest]  * Mon Aug 19 15:36:12 UTC 2013 - Authentication failure! - 40 - null
  [bndtest]  * Mon Aug 19 15:36:12 UTC 2013 - Authentication failure! - 40 - null
  [bndtest]  * Mon Aug 19 15:36:12 UTC 2013 - ServiceEvent REGISTERED - 44 - null
  [bndtest]  * Mon Aug 19 15:36:12 UTC 2013 - Unable to (fully) synchronize log with remote
(endpoint=auditlog) - 36 - java.io.IOException: Server returned HTTP response code: 401 for
URL: http://localhost:8080/auditlog/query?tid=target-id&logid=1376926570474
  [bndtest] java.io.IOException: Server returned HTTP response code: 401 for URL: http://localhost:8080/auditlog/query?tid=target-id&logid=1376926570474
  [bndtest] 	at sun.net.www.protocol.http.HttpURLConnection.getInputStream(HttpURLConnection.java:1459)
  [bndtest] 	at org.apache.ace.log.target.task.LogSyncTask.run(LogSyncTask.java:103)
  [bndtest] 	at org.apache.ace.scheduler.Executer.run(Executer.java:92)
  [bndtest] 	at java.util.TimerThread.mainLoop(Timer.java:512)
  [bndtest] 	at java.util.TimerThread.run(Timer.java:462)
  [bndtest]  * Mon Aug 19 15:36:12 UTC 2013 - Authentication failure! - 35 - null
  [bndtest]  * Mon Aug 19 15:36:12 UTC 2013 - Authentication failure! - 40 - null
  [bndtest]  * Mon Aug 19 15:36:12 UTC 2013 - Authentication failure! - 40 - null
  [bndtest]  * Mon Aug 19 15:36:12 UTC 2013 - Error running update UserAdmin task. - 23 -
java.io.IOException: No version has yet been checked in to the repository.
  [bndtest] java.io.IOException: No version has yet been checked in to the repository.
  [bndtest] 	at org.apache.ace.repository.ext.impl.CachedRepositoryImpl.checkout(CachedRepositoryImpl.java:64)
  [bndtest] 	at org.apache.ace.configurator.useradmin.task.UpdateUserAdminTask.run(UpdateUserAdminTask.java:99)
  [bndtest] 	at org.apache.ace.scheduler.Executer.run(Executer.java:92)
  [bndtest] 	at java.util.TimerThread.mainLoop(Timer.java:512)
  [bndtest] 	at java.util.TimerThread.run(Timer.java:462)
  [bndtest]  * Mon Aug 19 15:36:12 UTC 2013 - ServiceEvent REGISTERED - 40 - null
  [bndtest]  * Mon Aug 19 15:36:12 UTC 2013 - ServiceEvent REGISTERED - 41 - null
  [bndtest]  * Mon Aug 19 15:36:12 UTC 2013 - ServiceEvent REGISTERED - 44 - null
  [bndtest]  * Mon Aug 19 15:36:11 UTC 2013 - Error running update UserAdmin task. - 23 -
java.io.IOException: No version has yet been checked in to the repository.
  [bndtest] java.io.IOException: No version has yet been checked in to the repository.
  [bndtest] 	at org.apache.ace.repository.ext.impl.CachedRepositoryImpl.checkout(CachedRepositoryImpl.java:64)
  [bndtest] 	at org.apache.ace.configurator.useradmin.task.UpdateUserAdminTask.run(UpdateUserAdminTask.java:99)
  [bndtest] 	at org.apache.ace.scheduler.Executer.run(Executer.java:92)
  [bndtest] 	at java.util.TimerThread.mainLoop(Timer.java:512)
  [bndtest] 	at java.util.TimerThread.run(Timer.java:462)
  [bndtest]  * Mon Aug 19 15:36:11 UTC 2013 - ServiceEvent REGISTERED - 34 - null
  [bndtest]  * Mon Aug 19 15:36:11 UTC 2013 - Already registered under existing endpoint -
28 - org.apache.felix.log.LogException: org.osgi.service.http.NamespaceException: Servlet
with alias already registered
  [bndtest] org.apache.felix.log.LogException: org.osgi.service.http.NamespaceException: Servlet
with alias already registered
  [bndtest] 	at org.apache.felix.http.base.internal.handler.HandlerRegistry.addServlet(HandlerRegistry.java:62)
  [bndtest] 	at org.apache.felix.http.base.internal.service.HttpServiceImpl.registerServlet(HttpServiceImpl.java:95)
  [bndtest] 	at org.apache.ace.http.listener.Activator.addServlet(Activator.java:88)
  [bndtest] 	at sun.reflect.NativeMethodAccessorImpl.invoke0(Native Method)
  [bndtest] 	at sun.reflect.NativeMethodAccessorImpl.invoke(NativeMethodAccessorImpl.java:39)
  [bndtest] 	at sun.reflect.DelegatingMethodAccessorImpl.invoke(DelegatingMethodAccessorImpl.java:25)
  [bndtest] 	at java.lang.reflect.Method.invoke(Method.java:597)
  [bndtest] 	at org.apache.felix.dm.InvocationUtil.invokeMethod(InvocationUtil.java:111)
  [bndtest] 	at org.apache.felix.dm.InvocationUtil.invokeCallbackMethod(InvocationUtil.java:66)
  [bndtest] 	at org.apache.felix.dm.impl.ComponentImpl.invokeCallbackMethod(ComponentImpl.java:688)
  [bndtest] 	at org.apache.felix.dm.impl.dependencies.ServiceDependencyImpl.invoke(ServiceDependencyImpl.java:704)
  [bndtest] 	at org.apache.felix.dm.impl.dependencies.ServiceDependencyImpl.invokeAdded(ServiceDependencyImpl.java:544)
  [bndtest] 	at org.apache.felix.dm.impl.dependencies.ServiceDependencyImpl.addedService(ServiceDependencyImpl.java:482)
  [bndtest] 	at org.apache.felix.dm.tracker.ServiceTracker$Tracked.customizerAdded(ServiceTracker.java:1325)
  [bndtest] 	at org.apache.felix.dm.tracker.AbstractTracked.trackAdding(AbstractTracked.java:290)
  [bndtest] 	at org.apache.felix.dm.tracker.AbstractTracked.track(AbstractTracked.java:236)
  [bndtest] 	at org.apache.felix.dm.tracker.ServiceTracker$Tracked.serviceChangedHideAspects(ServiceTracker.java:1206)
  [bndtest] 	at org.apache.felix.dm.tracker.ServiceTracker$Tracked.serviceChanged(ServiceTracker.java:1101)
  [bndtest] 	at org.apache.felix.framework.util.EventDispatcher.invokeServiceListenerCallback(EventDispatcher.java:932)
  [bndtest] 	at org.apache.felix.framework.util.EventDispatcher.fireEventImmediately(EventDispatcher.java:793)
  [bndtest] 	at org.apache.felix.framework.util.EventDispatcher.fireServiceEvent(EventDispatcher.java:543)
  [bndtest] 	at org.apache.felix.framework.Felix.fireServiceEvent(Felix.java:4260)
  [bndtest] 	at org.apache.felix.framework.Felix.registerService(Felix.java:3275)
  [bndtest] 	at org.apache.felix.framework.BundleContextImpl.registerService(BundleContextImpl.java:346)
  [bndtest] 	at org.apache.felix.framework.BundleContextImpl.registerService(BundleContextImpl.java:320)
  [bndtest] 	at org.apache.felix.dm.impl.ComponentImpl.registerService(ComponentImpl.java:864)
  [bndtest] 	at org.apache.felix.dm.impl.ComponentImpl.bindService(ComponentImpl.java:628)
  [bndtest] 	at org.apache.felix.dm.impl.ComponentImpl.access$400(ComponentImpl.java:52)
  [bndtest] 	at org.apache.felix.dm.impl.ComponentImpl$7.run(ComponentImpl.java:181)
  [bndtest] 	at org.apache.felix.dm.impl.SerialExecutor$1.run(SerialExecutor.java:47)
  [bndtest] 	at org.apache.felix.dm.impl.SerialExecutor.scheduleNext(SerialExecutor.java:84)
  [bndtest] 	at org.apache.felix.dm.impl.SerialExecutor.access$000(SerialExecutor.java:33)
  [bndtest] 	at org.apache.felix.dm.impl.SerialExecutor$1.run(SerialExecutor.java:50)
  [bndtest] 	at org.apache.felix.dm.impl.SerialExecutor.scheduleNext(SerialExecutor.java:84)
  [bndtest] 	at org.apache.felix.dm.impl.SerialExecutor.access$000(SerialExecutor.java:33)
  [bndtest] 	at org.apache.felix.dm.impl.SerialExecutor$1.run(SerialExecutor.java:50)
  [bndtest] 	at org.apache.felix.dm.impl.SerialExecutor.scheduleNext(SerialExecutor.java:84)
  [bndtest] 	at org.apache.felix.dm.impl.SerialExecutor.execute(SerialExecutor.java:68)
  [bndtest] 	at org.apache.felix.dm.impl.ComponentImpl.calculateStateChanges(ComponentImpl.java:231)
  [bndtest] 	at org.apache.felix.dm.impl.ComponentImpl.start(ComponentImpl.java:399)
  [bndtest] 	at org.apache.felix.dm.DependencyManager.add(DependencyManager.java:169)
  [bndtest] 	at org.apache.ace.log.server.servlet.Activator.updated(Activator.java:99)
  [bndtest] 	at org.apache.felix.cm.impl.helper.ManagedServiceFactoryTracker.provideConfiguration(ManagedServiceFactoryTracker.java:88)
  [bndtest] 	at org.apache.felix.cm.impl.ConfigurationManager$UpdateConfiguration.run(ConfigurationManager.java:1723)
  [bndtest] 	at org.apache.felix.cm.impl.UpdateThread.run(UpdateThread.java:103)
  [bndtest] 	at java.lang.Thread.run(Thread.java:662)
  [bndtest]  * Mon Aug 19 15:36:11 UTC 2013 - ServiceEvent REGISTERED - 35 - null
  [bndtest]  * Mon Aug 19 15:36:11 UTC 2013 - ServiceEvent REGISTERED - 36 - null
  [bndtest]  * Mon Aug 19 15:36:11 UTC 2013 - ServiceEvent REGISTERED - 36 - null
  [bndtest]  * Mon Aug 19 15:36:11 UTC 2013 - ServiceEvent REGISTERED - 37 - null
  [bndtest]  * Mon Aug 19 15:36:11 UTC 2013 - Target ID is being changed from target-id to
target-id - 30 - null
  [bndtest]  * Mon Aug 19 15:36:11 UTC 2013 - Authentication failure! - 35 - null
  [bndtest]  * Mon Aug 19 15:36:11 UTC 2013 - Authentication failure! - 35 - null
  [bndtest]  * Mon Aug 19 15:36:11 UTC 2013 - ServiceEvent REGISTERED - 44 - null
  [bndtest]  * Mon Aug 19 15:36:10 UTC 2013 - Authentication failure! - 35 - null
  [bndtest]  * Mon Aug 19 15:36:10 UTC 2013 - Unable to (fully) synchronize log with remote
(endpoint=auditlog) - 36 - java.io.IOException: Server returned HTTP response code: 401 for
URL: http://localhost:8080/auditlog/query?tid=target-id&logid=1376926570474
  [bndtest] java.io.IOException: Server returned HTTP response code: 401 for URL: http://localhost:8080/auditlog/query?tid=target-id&logid=1376926570474
  [bndtest] 	at sun.net.www.protocol.http.HttpURLConnection.getInputStream(HttpURLConnection.java:1459)
  [bndtest] 	at org.apache.ace.log.target.task.LogSyncTask.run(LogSyncTask.java:103)
  [bndtest] 	at org.apache.ace.scheduler.Executer.run(Executer.java:92)
  [bndtest] 	at java.util.TimerThread.mainLoop(Timer.java:512)
  [bndtest] 	at java.util.TimerThread.run(Timer.java:462)
  [bndtest]  * Mon Aug 19 15:36:10 UTC 2013 - Authentication failure! - 35 - null
  [bndtest]  * Mon Aug 19 15:36:10 UTC 2013 - Authentication failure! - 35 - null
  [bndtest]  * Mon Aug 19 15:36:10 UTC 2013 - ServiceEvent REGISTERED - 34 - null
  [bndtest]  * Mon Aug 19 15:36:10 UTC 2013 - ServiceEvent REGISTERED - 35 - null
  [bndtest]  * Mon Aug 19 15:36:10 UTC 2013 - ServiceEvent REGISTERED - 36 - null
  [bndtest]  * Mon Aug 19 15:36:10 UTC 2013 - ServiceEvent REGISTERED - 36 - null
  [bndtest]  * Mon Aug 19 15:36:10 UTC 2013 - ServiceEvent REGISTERED - 37 - null
  [bndtest]  * Mon Aug 19 15:36:10 UTC 2013 - ServiceEvent REGISTERED - 30 - null
  [bndtest]  * Mon Aug 19 15:36:10 UTC 2013 - ServiceEvent REGISTERED - 27 - null
  [bndtest]  * Mon Aug 19 15:36:10 UTC 2013 - ServiceEvent REGISTERED - 23 - null
  [bndtest]  * Mon Aug 19 15:36:10 UTC 2013 - ServiceEvent REGISTERED - 44 - null
  [bndtest]  * Mon Aug 19 15:36:10 UTC 2013 - ServiceEvent REGISTERED - 21 - null
  [bndtest]  * Mon Aug 19 15:36:10 UTC 2013 - ServiceEvent REGISTERED - 21 - null
  [bndtest]  * Mon Aug 19 15:36:10 UTC 2013 - ServiceEvent REGISTERED - 21 - null
  [bndtest]  * Mon Aug 19 15:36:10 UTC 2013 - ServiceEvent REGISTERED - 21 - null
  [bndtest]  * Mon Aug 19 15:36:10 UTC 2013 - ServiceEvent REGISTERED - 21 - null
  [bndtest]  * Mon Aug 19 15:36:10 UTC 2013 - ServiceEvent REGISTERED - 21 - null
  [bndtest]  * Mon Aug 19 15:36:10 UTC 2013 - ServiceEvent REGISTERED - 21 - null
  [bndtest]  * Mon Aug 19 15:36:10 UTC 2013 - ServiceEvent REGISTERED - 21 - null
  [bndtest]  * Mon Aug 19 15:36:10 UTC 2013 - ServiceEvent REGISTERED - 21 - null
  [bndtest]  * Mon Aug 19 15:36:10 UTC 2013 - ServiceEvent REGISTERED - 21 - null
  [bndtest]  * Mon Aug 19 15:36:10 UTC 2013 - ServiceEvent REGISTERED - 21 - null
  [bndtest]  * Mon Aug 19 15:36:10 UTC 2013 - ServiceEvent REGISTERED - 21 - null
  [bndtest]  * Mon Aug 19 15:36:10 UTC 2013 - ServiceEvent REGISTERED - 21 - null
  [bndtest]  * Mon Aug 19 15:36:10 UTC 2013 - ServiceEvent REGISTERED - 21 - null
  [bndtest]  * Mon Aug 19 15:36:10 UTC 2013 - ServiceEvent REGISTERED - 21 - null
  [bndtest]  * Mon Aug 19 15:36:10 UTC 2013 - ServiceEvent REGISTERED - 21 - null
  [bndtest]  * Mon Aug 19 15:36:10 UTC 2013 - ServiceEvent REGISTERED - 21 - null
  [bndtest]  * Mon Aug 19 15:36:10 UTC 2013 - ServiceEvent REGISTERED - 21 - null
  [bndtest]  * Mon Aug 19 15:36:10 UTC 2013 - ServiceEvent REGISTERED - 0 - null
  [bndtest]  * Mon Aug 19 15:36:10 UTC 2013 - BundleEvent STARTED - 49 - null
  [bndtest]  * Mon Aug 19 15:36:10 UTC 2013 - BundleEvent STARTED - 48 - null
  [bndtest]  * Mon Aug 19 15:36:10 UTC 2013 - BundleEvent STARTED - 47 - null
  [bndtest]  * Mon Aug 19 15:36:10 UTC 2013 - ServiceEvent REGISTERED - 47 - null
  [bndtest]  * Mon Aug 19 15:36:10 UTC 2013 - BundleEvent STARTED - 46 - null
  [bndtest]  * Mon Aug 19 15:36:10 UTC 2013 - ServiceEvent REGISTERED - 46 - null
  [bndtest]  * Mon Aug 19 15:36:10 UTC 2013 - ServiceEvent REGISTERED - 46 - null
  [bndtest]  * Mon Aug 19 15:36:10 UTC 2013 - BundleEvent STARTED - 45 - null
  [bndtest]  * Mon Aug 19 15:36:10 UTC 2013 - ServiceEvent REGISTERED - 45 - null
  [bndtest]  * Mon Aug 19 15:36:10 UTC 2013 - ServiceEvent REGISTERED - 45 - null
  [bndtest]  * Mon Aug 19 15:36:10 UTC 2013 - BundleEvent STARTED - 44 - null
  [bndtest]  * Mon Aug 19 15:36:10 UTC 2013 - ServiceEvent REGISTERED - 44 - null
  [bndtest]  * Mon Aug 19 15:36:10 UTC 2013 - BundleEvent STARTED - 43 - null
  [bndtest]  * Mon Aug 19 15:36:10 UTC 2013 - BundleEvent STARTED - 42 - null
  [bndtest]  * Mon Aug 19 15:36:10 UTC 2013 - BundleEvent STARTED - 41 - null
  [bndtest]  * Mon Aug 19 15:36:10 UTC 2013 - ServiceEvent REGISTERED - 41 - null
  [bndtest]  * Mon Aug 19 15:36:10 UTC 2013 - BundleEvent STARTED - 40 - null
  [bndtest]  * Mon Aug 19 15:36:10 UTC 2013 - ServiceEvent REGISTERED - 40 - null
  [bndtest]  * Mon Aug 19 15:36:10 UTC 2013 - BundleEvent STARTED - 39 - null
  [bndtest]  * Mon Aug 19 15:36:10 UTC 2013 - ServiceEvent REGISTERED - 39 - null
  [bndtest]  * Mon Aug 19 15:36:10 UTC 2013 - BundleEvent STARTED - 38 - null
  [bndtest]  * Mon Aug 19 15:36:10 UTC 2013 - ServiceEvent REGISTERED - 38 - null
  [bndtest]  * Mon Aug 19 15:36:10 UTC 2013 - BundleEvent STARTED - 37 - null
  [bndtest]  * Mon Aug 19 15:36:10 UTC 2013 - ServiceEvent REGISTERED - 37 - null
  [bndtest]  * Mon Aug 19 15:36:10 UTC 2013 - BundleEvent STARTED - 36 - null
  [bndtest]  * Mon Aug 19 15:36:10 UTC 2013 - ServiceEvent REGISTERED - 36 - null
  [bndtest]  * Mon Aug 19 15:36:10 UTC 2013 - ServiceEvent REGISTERED - 36 - null
  [bndtest]  * Mon Aug 19 15:36:10 UTC 2013 - BundleEvent STARTED - 35 - null
  [bndtest]  * Mon Aug 19 15:36:10 UTC 2013 - ServiceEvent REGISTERED - 35 - null
  [bndtest]  * Mon Aug 19 15:36:10 UTC 2013 - BundleEvent STARTED - 34 - null
  [bndtest] Got response code 401 for http://localhost:8080/obr/repository.xml
  [bndtest] Bundle Indexer | v2.2
  [bndtest] (c) 2007 OSGi, All Rights Reserved
  [bndtest] Errors: 1
  [bndtest] Failures: 0
  [bndtest] 1 Error(s)
  [bndtest] Tests failed
  [bndtest] 	at aQute.bnd.ant.TestTask.executeProject(TestTask.java:78)
  [bndtest] 	at aQute.bnd.ant.TestTask.execute(TestTask.java:49)
  [bndtest] 	at org.apache.tools.ant.UnknownElement.execute(UnknownElement.java:291)
  [bndtest] 	at sun.reflect.GeneratedMethodAccessor4.invoke(Unknown Source)
  [bndtest] 	at sun.reflect.DelegatingMethodAccessorImpl.invoke(DelegatingMethodAccessorImpl.java:25)
  [bndtest] 	at java.lang.reflect.Method.invoke(Method.java:597)
  [bndtest] 	at org.apache.tools.ant.dispatch.DispatchUtils.execute(DispatchUtils.java:106)
  [bndtest] 	at org.apache.tools.ant.Task.perform(Task.java:348)
  [bndtest] 	at org.apache.tools.ant.Target.execute(Target.java:390)
  [bndtest] 	at org.apache.tools.ant.Target.performTasks(Target.java:411)
  [bndtest] 	at org.apache.tools.ant.Project.executeSortedTargets(Project.java:1399)
  [bndtest] 	at org.apache.tools.ant.helper.SingleCheckExecutor.executeTargets(SingleCheckExecutor.java:38)
  [bndtest] 	at org.apache.tools.ant.Project.executeTargets(Project.java:1251)
  [bndtest] 	at org.apache.tools.ant.taskdefs.Ant.execute(Ant.java:442)
  [bndtest] 	at org.apache.tools.ant.taskdefs.SubAnt.execute(SubAnt.java:302)
  [bndtest] 	at org.apache.tools.ant.taskdefs.SubAnt.execute(SubAnt.java:221)
  [bndtest] 	at org.apache.tools.ant.UnknownElement.execute(UnknownElement.java:291)
  [bndtest] 	at sun.reflect.GeneratedMethodAccessor4.invoke(Unknown Source)
  [bndtest] 	at sun.reflect.DelegatingMethodAccessorImpl.invoke(DelegatingMethodAccessorImpl.java:25)
  [bndtest] 	at java.lang.reflect.Method.invoke(Method.java:597)
  [bndtest] 	at org.apache.tools.ant.dispatch.DispatchUtils.execute(DispatchUtils.java:106)
  [bndtest] 	at org.apache.tools.ant.Task.perform(Task.java:348)
  [bndtest] 	at org.apache.tools.ant.Target.execute(Target.java:390)
  [bndtest] 	at org.apache.tools.ant.Target.performTasks(Target.java:411)
  [bndtest] 	at org.apache.tools.ant.Project.executeSortedTargets(Project.java:1399)
  [bndtest] 	at org.apache.tools.ant.Project.executeTarget(Project.java:1368)
  [bndtest] 	at org.apache.tools.ant.helper.DefaultExecutor.executeTargets(DefaultExecutor.java:41)
  [bndtest] 	at org.apache.tools.ant.Project.executeTargets(Project.java:1251)
  [bndtest] 	at org.apache.tools.ant.Main.runBuild(Main.java:809)
  [bndtest] 	at org.apache.tools.ant.Main.startAnt(Main.java:217)
  [bndtest] 	at org.apache.tools.ant.launch.Launcher.run(Launcher.java:280)
  [bndtest] 	at org.apache.tools.ant.launch.Launcher.main(Launcher.java:109)

BUILD FAILED
/x1/jenkins/jenkins-slave/workspace/ACE-trunk/cnf/build.xml:55: The following error occurred
while executing this line:
/x1/jenkins/jenkins-slave/workspace/ACE-trunk/cnf/build-template.xml:67: Tests failed

Total time: 2 minutes 26 seconds
Build step 'Invoke Ant' marked build as failure
Recording test results
TestNG Reports Processing: START
Looking for TestNG results report in workspace using pattern: **/testng/testng-results.xml
Saving reports...
Processing '/home/hudson/hudson/jobs/ACE-trunk/builds/2013-08-19_15-33-44/testng/testng-results-1.xml'
Processing '/home/hudson/hudson/jobs/ACE-trunk/builds/2013-08-19_15-33-44/testng/testng-results-10.xml'
Processing '/home/hudson/hudson/jobs/ACE-trunk/builds/2013-08-19_15-33-44/testng/testng-results-11.xml'
Processing '/home/hudson/hudson/jobs/ACE-trunk/builds/2013-08-19_15-33-44/testng/testng-results-12.xml'
Processing '/home/hudson/hudson/jobs/ACE-trunk/builds/2013-08-19_15-33-44/testng/testng-results-13.xml'
Processing '/home/hudson/hudson/jobs/ACE-trunk/builds/2013-08-19_15-33-44/testng/testng-results-14.xml'
Processing '/home/hudson/hudson/jobs/ACE-trunk/builds/2013-08-19_15-33-44/testng/testng-results-15.xml'
Processing '/home/hudson/hudson/jobs/ACE-trunk/builds/2013-08-19_15-33-44/testng/testng-results-16.xml'
Processing '/home/hudson/hudson/jobs/ACE-trunk/builds/2013-08-19_15-33-44/testng/testng-results-2.xml'
Processing '/home/hudson/hudson/jobs/ACE-trunk/builds/2013-08-19_15-33-44/testng/testng-results-3.xml'
Processing '/home/hudson/hudson/jobs/ACE-trunk/builds/2013-08-19_15-33-44/testng/testng-results-4.xml'
Processing '/home/hudson/hudson/jobs/ACE-trunk/builds/2013-08-19_15-33-44/testng/testng-results-5.xml'
Processing '/home/hudson/hudson/jobs/ACE-trunk/builds/2013-08-19_15-33-44/testng/testng-results-6.xml'
Processing '/home/hudson/hudson/jobs/ACE-trunk/builds/2013-08-19_15-33-44/testng/testng-results-7.xml'
Processing '/home/hudson/hudson/jobs/ACE-trunk/builds/2013-08-19_15-33-44/testng/testng-results-8.xml'
Processing '/home/hudson/hudson/jobs/ACE-trunk/builds/2013-08-19_15-33-44/testng/testng-results-9.xml'
Processing '/home/hudson/hudson/jobs/ACE-trunk/builds/2013-08-19_15-33-44/testng/testng-results.xml'
TestNG Reports Processing: FINISH

Mime
View raw message